Gentoo Websites Logo
Go to: Gentoo Home Documentation Forums Lists Bugs Planet Store Wiki Get Gentoo!

Bug 841188

Summary: dev-python/rich-12.3.0 fails tests
Product: Gentoo Linux Reporter: Agostino Sarubbo <ago>
Component: Current packagesAssignee: Python Gentoo Team <python>
Severity: normal CC: arthurzam, mgorny
Priority: Normal    
Version: unspecified   
Hardware: All   
OS: Linux   
See Also:
Package list:
Runtime testing required: ---
Attachments: build.log

Description Agostino Sarubbo gentoo-dev 2022-04-26 19:40:42 UTC

Issue: dev-python/rich-12.3.0 fails tests.
Discovered on: amd64 (internal ref: ci)
Comment 1 Agostino Sarubbo gentoo-dev 2022-04-26 19:40:44 UTC
Created attachment 774903 [details]

build log and emerge --info
Comment 2 Agostino Sarubbo gentoo-dev 2022-04-26 19:40:45 UTC
Error(s) that match a know pattern:

E       AssertionError: assert 'YAML+Jinja' == 'text'
FAILED tests/ - AssertionError: as...
Comment 3 Joe Kappus 2023-02-09 08:49:48 UTC
12.3 removed from the tree, fixed in later versions.