Gentoo Websites Logo
Go to: Gentoo Home Documentation Forums Lists Bugs Planet Store Wiki Get Gentoo!

Bug 832603

Summary: app-misc/khal-0.10.5 fails tests
Product: Gentoo Linux Reporter: Agostino Sarubbo <ago>
Component: Current packagesAssignee: Amy Liffey <amynka>
Severity: normal    
Priority: Normal    
Version: unspecified   
Hardware: All   
OS: Linux   
Package list:
Runtime testing required: ---
Attachments: build.log

Description Agostino Sarubbo gentoo-dev 2022-02-03 07:28:53 UTC

Issue: app-misc/khal-0.10.4 fails tests.
Discovered on: amd64 (internal ref: ci)

If you think this is a GCC-11 related issue, please block bug 732706.
Comment 1 Agostino Sarubbo gentoo-dev 2022-02-03 07:28:55 UTC
Created attachment 764252 [details]

build log and emerge --info
Comment 2 Agostino Sarubbo gentoo-dev 2022-02-03 07:28:56 UTC
Error(s) that match a know pattern:

E       AssertionError: assert ['meeting-three.ics', 'meeting-two.ics', 'meeting-one.ics'] == ['meeting-three.ics']
FAILED tests/ - AssertionError: ...
Comment 3 Amy Liffey gentoo-dev 2022-02-03 11:43:03 UTC
Strange works for me well.. I try to check this out
Comment 4 Agostino Sarubbo gentoo-dev 2022-08-03 07:08:01 UTC
tinderbox_musl has reproduced this issue with version 0.10.4-r1 - Updating summary.
Comment 5 Agostino Sarubbo gentoo-dev 2022-12-15 08:30:55 UTC
dash_tinderbox has reproduced this issue with version 0.10.5 - Updating summary.
Comment 6 Amy Liffey gentoo-dev 2023-05-14 16:50:31 UTC
Seems to work with current 0.11.1 and old versions are removed.