Gentoo Websites Logo
Go to: Gentoo Home Documentation Forums Lists Bugs Planet Store Wiki Get Gentoo!

Bug 790584

Summary: sys-block/thin-provisioning-tools-0.9.0: fails 94 tests on ppc
Product: Gentoo Linux Reporter: Sam James <sam>
Component: Current packagesAssignee: Robin Johnson <robbat2>
Status: CONFIRMED ---    
Severity: normal CC: base-system
Priority: Normal Keywords: TESTFAILURE
Version: unspecified   
Hardware: All   
OS: Linux   
Whiteboard:
Package list:
Runtime testing required: ---
Attachments: build.log
build.log (0.9.0)

Description Sam James archtester gentoo-dev Security 2021-05-16 20:39:41 UTC
Created attachment 709200 [details]
build.log

[----------] Global test environment tear-down
[==========] 200 tests from 30 test suites ran. (15042 ms total)
[  PASSED  ] 106 tests.
[  FAILED  ] 94 tests, listed below:
[  FAILED  ] ArrayBlockTests.can_create_an_empty_array
[  FAILED  ] ArrayBlockTests.read_only_array_blocks_are_possible
[  FAILED  ] ArrayBlockTests.updating_reopened_array_block
[  FAILED  ] ArrayBlockTests.growing
[  FAILED  ] ArrayBlockTests.grow_does_not_touch_existing_values
[  FAILED  ] ArrayBlockTests.shrinking
[  FAILED  ] ArrayBlockTests.ref_counting
[  FAILED  ] ArrayTests.can_create_an_empty_array
[  FAILED  ] ArrayTests.get_elements
[  FAILED  ] ArrayTests.set_elements
[  FAILED  ] ArrayTests.grow
[  FAILED  ] ArrayTests.reopen_array
[  FAILED  ] ArrayTests.visit_values
[  FAILED  ] ArrayTests.visit_values_with_too_few_entries
[  FAILED  ] BCacheTests.cleaned_on_demand
[  FAILED  ] BlockTests.out_of_range_access
[  FAILED  ] BlockTests.read_lock_all_blocks
[  FAILED  ] BlockTests.write_lock_all_blocks
[  FAILED  ] BlockTests.writes_persist
[  FAILED  ] BlockTests.write_lock_zero_zeroes
[  FAILED  ] BlockTests.read_validator_works
[  FAILED  ] BlockTests.write_validator_works
[  FAILED  ] BlockTests.cannot_have_two_superblocks
[  FAILED  ] BlockTests.can_have_subsequent_superblocks
[  FAILED  ] BlockTests.superblocks_can_change_address
[  FAILED  ] BlockTests.superblock_must_be_last
[  FAILED  ] BlockTests.references_can_be_copied
[  FAILED  ] BlockTests.no_concurrent_write_locks
[  FAILED  ] BlockTests.concurrent_read_locks
[  FAILED  ] BlockTests.read_then_write
[  FAILED  ] BlockTests.write_then_read
[  FAILED  ] ValidatorTests.check_on_read_lock
[  FAILED  ] ValidatorTests.check_only_called_once_on_read_lock
[  FAILED  ] ValidatorTests.validator_can_be_changed_by_read_lock
[  FAILED  ] ValidatorTests.check_and_prepare_on_write_lock
[  FAILED  ] ValidatorTests.check_only_called_once_on_write_lock
[  FAILED  ] ValidatorTests.validator_can_be_changed_by_write_lock
[  FAILED  ] ValidatorTests.no_check_but_prepare_on_write_lock_zero
[  FAILED  ] ValidatorTests.validator_can_be_changed_by_write_lock_zero
[  FAILED  ] ValidatorTests.check_and_prepare_on_superblock_lock
[  FAILED  ] ValidatorTests.check_only_called_once_on_superblock_lock
[  FAILED  ] ValidatorTests.validator_can_be_changed_by_superblock_lock
[  FAILED  ] ValidatorTests.no_check_but_prepare_on_superblock_lock_zero
[  FAILED  ] ValidatorTests.validator_can_be_changed_by_superblock_zero
[  FAILED  ] ValidatorTests.validator_check_failure_gets_passed_up
[  FAILED  ] BitsetTests.create_empty_bitset
[  FAILED  ] BitsetTests.grow_default_false
[  FAILED  ] BitsetTests.grow_default_true
[  FAILED  ] BitsetTests.grow_throws_if_actualy_asked_to_shrink
[  FAILED  ] BitsetTests.multiple_grow_calls
[  FAILED  ] BitsetTests.set_out_of_bounds_throws
[  FAILED  ] BitsetTests.set_works
[  FAILED  ] BitsetTests.reopen_works
[  FAILED  ] BitsetTests.walk_bitset
[  FAILED  ] BtreeTests.empty_btree_contains_nothing
[  FAILED  ] BtreeTests.insert_works
[  FAILED  ] BtreeTests.insert_does_not_insert_imaginary_values
[  FAILED  ] BtreeTests.clone
[  FAILED  ] BTreeCounterTests.count_empty_tree
[  FAILED  ] BTreeCounterTests.count_populated_tree
[  FAILED  ] BTreeDamageVisitorTests.an_empty_tree
[  FAILED  ] BTreeDamageVisitorTests.tree_with_a_trashed_root
[  FAILED  ] BTreeDamageVisitorTests.populated_tree_with_no_damage
[  FAILED  ] BTreeDamageVisitorTests.populated_tree_with_a_damaged_leaf_node
[  FAILED  ] BTreeDamageVisitorTests.populated_tree_with_a_sequence_of_damaged_leaf_nodes
[  FAILED  ] BTreeDamageVisitorTests.damaged_first_leaf
[  FAILED  ] BTreeDamageVisitorTests.damaged_last_leaf
[  FAILED  ] BTreeDamageVisitorTests.damaged_internal
[  FAILED  ] BTreeDamageVisitor2Tests.empty_tree
[  FAILED  ] BTreeDamageVisitor2Tests.tree_with_a_trashed_root
[  FAILED  ] BTreeDamageVisitor2Tests.populated_tree_with_no_damage
[  FAILED  ] BTreeDamageVisitor2Tests.damaged_leaf
[  FAILED  ] IOEngineTests.open_and_close
[  FAILED  ] IOEngineTests.you_can_read_a_read_only_handle
[  FAILED  ] IOEngineTests.you_cannot_write_to_a_read_only_handle
[  FAILED  ] IOEngineTests.you_can_write_to_a_read_write_handle
[  FAILED  ] IOEngineTests.final_block_read_succeeds
[  FAILED  ] IOEngineTests.out_of_bounds_read_fails
[  FAILED  ] IOEngineTests.out_of_bounds_write_succeeds
[  FAILED  ] IOEngineTests.succeed_with_timeout
[  FAILED  ] SpaceMapTests.test_sm_core
[  FAILED  ] SpaceMapTests.test_sm_careful_alloc
[  FAILED  ] SpaceMapTests.test_sm_recursive
[  FAILED  ] SpaceMapTests.test_sm_disk
[  FAILED  ] SpaceMapTests.test_sm_metadata
[  FAILED  ] MetadataSpaceMapTests.test_metadata_and_disk
[  FAILED  ] MetadataSpaceMapTests.test_allocate_blocks
[  FAILED  ] MetadataSpaceMapTests.test_multiple_shadows_by_dec
[  FAILED  ] MetadataSpaceMapTests.test_multiple_shadows_by_inc
[  FAILED  ] MetadataSpaceMapTests.test_intended_in_place_modification
[  FAILED  ] TransactionManagerTests.commit_succeeds
[  FAILED  ] TransactionManagerTests.shadowing
[  FAILED  ] TransactionManagerTests.multiple_shadowing
[  FAILED  ] TransactionManagerTests.shadow_free_block_fails

94 FAILED TESTS
make: *** [unit-tests/Makefile:98: unit-test] Error 1
 * ERROR: sys-block/thin-provisioning-tools-0.9.0::gentoo failed (test phase):

----
Portage 3.0.18 (python 3.9.4-final-0, default/linux/powerpc/ppc32/17.0/desktop, gcc-10.2.0, glibc-2.32-r7, 5.4.72-gentoo ppc)
=================================================================
System uname: Linux-5.4.72-gentoo-ppc-POWER8_-architected-,_altivec_supported-with-glibc2.32
KiB Mem:    24699464 total,  13428424 free
KiB Swap:   25165820 total,  23818192 free
Timestamp of repository gentoo: Sun, 16 May 2021 19:50:16 +0000
sh bash 5.1_p8
ld GNU ld (Gentoo 2.34 p6) 2.34.0
app-shells/bash:          5.1_p8::gentoo
dev-lang/perl:            5.30.3::gentoo
dev-lang/python:          2.7.18_p9::gentoo, 3.6.13_p3::gentoo, 3.7.10_p3::gentoo, 3.8.9_p2::gentoo, 3.9.4_p1::gentoo
dev-util/cmake:           3.18.5::gentoo
sys-apps/baselayout:      2.7::gentoo
sys-apps/openrc:          0.42.1-r1::gentoo
sys-apps/sandbox:         2.23::gentoo
sys-devel/autoconf:       2.13-r1::gentoo, 2.69-r5::gentoo
sys-devel/automake:       1.16.2-r1::gentoo
sys-devel/binutils:       2.34-r2::gentoo, 2.35.2::gentoo
sys-devel/gcc:            10.2.0-r5::gentoo
sys-devel/gcc-config:     2.4::gentoo
sys-devel/libtool:        2.4.6-r6::gentoo
sys-devel/make:           4.3::gentoo
sys-kernel/linux-headers: 5.10::gentoo (virtual/os-headers)
sys-libs/glibc:           2.32-r7::gentoo
Repositories:

gentoo
    location: /var/db/repos/gentoo
    sync-type: rsync
    sync-uri: rsync://rsync.gentoo.org/gentoo-portage
    priority: -1000
    sync-rsync-verify-max-age: 24
    sync-rsync-verify-metamanifest: yes
    sync-rsync-verify-jobs: 1
    sync-rsync-extra-opts:

ACCEPT_KEYWORDS="ppc"
ACCEPT_LICENSE="*"
CBUILD="powerpc-unknown-linux-gnu"
CFLAGS="-O2 -mcpu=powerpc -mtune=powerpc -pipe -frecord-gcc-switches -fdiagnostics-show-option"
CHOST="powerpc-unknown-linux-gnu"
CONFIG_PROTECT="/etc /etc/stunnel/stunnel.conf /usr/share/gnupg/qualified.txt /var/qmail/alias /var/qmail/control /var/vpopmail/etc"
CONFIG_PROTECT_MASK="/etc/ca-certificates.conf /etc/dconf /etc/env.d /etc/fonts/fonts.conf /etc/gconf /etc/gentoo-release /etc/php/apache2-php7.3/ext-active/ /etc/php/apache2-php7.4/ext-active/ /etc/php/cgi-php7.3/ext-active/ /etc/php/cgi-php7.4/ext-active/ /etc/php/cli-php7.3/ext-active/ /etc/php/cli-php7.4/ext-active/ /etc/revdep-rebuild /etc/sandbox.d /etc/terminfo /etc/texmf/language.dat.d /etc/texmf/language.def.d /etc/texmf/updmap.d /etc/texmf/web2c"
CXXFLAGS="-O2 -mcpu=powerpc -mtune=powerpc -pipe -frecord-gcc-switches -fdiagnostics-show-option"
DISTDIR="/var/cache/distfiles"
EMERGE_DEFAULT_OPTS="--nospinner --ask-enter-invalid --jobs=4 --load-average 10 --quiet-build --keep-going --complete-graph --with-bdeps=y --deep"
ENV_UNSET="CARGO_HOME DBUS_SESSION_BUS_ADDRESS DISPLAY GOBIN GOPATH PERL5LIB PERL5OPT PERLPREFIX PERL_CORE PERL_MB_OPT PERL_MM_OPT XAUTHORITY XDG_CACHE_HOME XDG_CONFIG_HOME XDG_DATA_HOME XDG_RUNTIME_DIR"
FCFLAGS="-O2 -mcpu=powerpc -mtune=powerpc -pipe -frecord-gcc-switches -fdiagnostics-show-option"
FEATURES="assume-digests binpkg-docompress binpkg-dostrip binpkg-logs cgroup config-protect-if-modified distlocks ebuild-locks fixlafiles ipc-sandbox mount-sandbox multilib-strict network-sandbox news parallel-fetch parallel-install pid-sandbox preserve-libs protect-owned qa-unresolved-soname-deps sandbox sfperms strict unknown-features-warn unmerge-logs unmerge-orphans userfetch userpriv usersandbox usersync xattr"
FFLAGS="-O2 -mcpu=powerpc -mtune=powerpc -pipe -frecord-gcc-switches -fdiagnostics-show-option"
GENTOO_MIRRORS="https://gentoo.osuosl.org/"
LANG="C.UTF8"
LDFLAGS="-Wl,-O1 -Wl,--as-needed -Wl,--defsym=__gentoo_check_ldflags__=0"
MAKEOPTS="-j12 -l10"
PKGDIR="/var/tmp/portage/ppc32"
PORTAGE_CONFIGROOT="/"
PORTAGE_RSYNC_OPTS="--recursive --links --safe-links --perms --times --omit-dir-times --compress --force --whole-file --delete --stats --human-readable --timeout=180 --exclude=/distfiles --exclude=/local --exclude=/packages --exclude=/.git"
PORTAGE_TMPDIR="/var/tmp"
USE="X a52 aac acl alsa berkdb big-endian bluetooth branding bzip2 cairo cdda cdr cli crypt cups dbus dri dts dvd dvdr elogind emboss encode exif flac fortran gdbm gif gpm gtk gui iconv icu ipv6 jpeg lcms libglvnd libnotify mad mng mp3 mp4 mpeg ncurses nls nptl ogg opengl openmp pam pango pcre pdf png polkit ppc ppds qt5 readline sdl seccomp spell split-usr ssl startup-notification svg tcpd tiff truetype udev udisks unicode upower usb vorbis wxwidgets x264 xattr xcb xml xv xvid zlib" ABI_PPC="32" ADA_TARGET="gnat_2018" ALSA_CARDS="aoa aoa-fabric-layout aoa-onyx aoa-soundbus aoa-soundbus-i2s aoa-tas aoa-toonie powermac usb-audio via82xx" APACHE2_MODULES="authn_core authz_core socache_shmcb unixd actions alias auth_basic authn_alias authn_anon authn_dbm authn_default authn_file authz_dbm authz_default authz_groupfile authz_host authz_owner authz_user autoindex cache cgi cgid dav dav_fs dav_lock deflate dir disk_cache env expires ext_filter file_cache filter headers include info log_config logio mem_cache mime mime_magic negotiation rewrite setenvif speling status unique_id userdir usertrack vhost_alias" CALLIGRA_FEATURES="karbon sheets words" COLLECTD_PLUGINS="df interface irq load memory rrdtool swap syslog" ELIBC="glibc" GPSD_PROTOCOLS="ashtech aivdm earthmate evermore fv18 garmin garmintxt gpsclock greis isync itrax mtk3301 nmea ntrip navcom oceanserver oldstyle oncore rtcm104v2 rtcm104v3 sirf skytraq superstar2 timing tsip tripmate tnt ublox ubx" INPUT_DEVICES="libinput" KERNEL="linux" LCD_DEVICES="bayrad cfontz cfontz633 glk hd44780 lb216 lcdm001 mtxorb ncurses text" LIBREOFFICE_EXTENSIONS="presenter-console presenter-minimizer" LUA_SINGLE_TARGET="lua5-1" LUA_TARGETS="lua5-1" OFFICE_IMPLEMENTATION="libreoffice" PHP_TARGETS="php7-3 php7-4" POSTGRES_TARGETS="postgres10 postgres11" PYTHON_SINGLE_TARGET="python3_8" PYTHON_TARGETS="python3_8 python3_9" RUBY_TARGETS="ruby26" USERLAND="GNU" VIDEO_CARDS="fbdev glint mga nv r128 radeon dummy v4l" XTABLES_ADDONS="quota2 psd pknock lscan length2 ipv4options ipset ipp2p iface geoip fuzzy condition tee tarpit sysrq proto steal rawnat logmark ipmark dhcpmac delude chaos account"
Unset:  CC, CPPFLAGS, CTARGET, CXX, INSTALL_MASK, LC_ALL, LINGUAS, PORTAGE_BINHOST, PORTAGE_BUNZIP2_COMMAND, PORTAGE_COMPRESS, PORTAGE_COMPRESS_FLAGS, PORTAGE_RSYNC_EXTRA_OPTS, RUSTFLAGS
Comment 1 Sam James archtester gentoo-dev Security 2021-05-16 20:44:44 UTC
I don't see a point in blocking stabilisation given that none of the versions in tree have working test suites for ppc anyway.
Comment 2 ernsteiswuerfel archtester 2021-08-02 10:40:16 UTC
Created attachment 729675 [details]
build.log (0.9.0)