Gentoo Websites Logo
Go to: Gentoo Home Documentation Forums Lists Bugs Planet Store Wiki Get Gentoo!

Bug 788439

Summary: dev-python/django-3.1.9: fails tests
Product: Gentoo Linux Reporter: Sam James <sam>
Component: Current packagesAssignee: Python Gentoo Team <python>
Status: CONFIRMED ---    
Severity: normal CC: mgorny
Priority: Normal Keywords: TESTFAILURE
Version: unspecified   
Hardware: All   
OS: Linux   
See Also: https://bugs.gentoo.org/show_bug.cgi?id=788442
Whiteboard:
Package list:
Runtime testing required: ---
Attachments: build.log.bz2

Description Sam James archtester gentoo-dev Security 2021-05-06 00:06:54 UTC
Created attachment 706266 [details]
build.log.bz2

======================================================================
FAIL: test_custom_project_template_from_tarball_by_url (admin_scripts.tests.StartProject)
The startproject management command is able to use a different project
----------------------------------------------------------------------
Traceback (most recent call last):
  File "/usr/lib/python3.7/unittest/case.py", line 59, in testPartExecutor
    yield
  File "/usr/lib/python3.7/unittest/case.py", line 628, in run
    testMethod()
  File "/var/tmp/portage/dev-python/django-3.1.9/work/Django-3.1.9/tests/admin_scripts/tests.py", line 2014, in test_custom_project_template_from_tarball_by_url
    self.assertNoOutput(err)
  File "/var/tmp/portage/dev-python/django-3.1.9/work/Django-3.1.9/tests/admin_scripts/tests.py", line 149, in assertNoOutput
    self.assertEqual(len(stream), 0, "Stream should be empty: actually contains '%s'" % stream)
  File "/usr/lib/python3.7/unittest/case.py", line 852, in assertEqual
    assertion_func(first, second, msg=msg)
  File "/usr/lib/python3.7/unittest/case.py", line 845, in _baseAssertEqual
    raise self.failureException(msg)
AssertionError: 169 != 0 : Stream should be empty: actually contains 'CommandError: couldn't download URL http://localhost:57173/custom_templates/project_template.tgz to project_template.tgz: <urlopen error [Errno 111] Connection refused>
'

======================================================================
FAIL: test_project_template_tarball_url (admin_scripts.tests.StartProject)
Startproject management command handles project template tar/zip balls from non-canonical urls
----------------------------------------------------------------------
Traceback (most recent call last):
  File "/usr/lib/python3.7/unittest/case.py", line 59, in testPartExecutor
    yield
  File "/usr/lib/python3.7/unittest/case.py", line 628, in run
    testMethod()
  File "/var/tmp/portage/dev-python/django-3.1.9/work/Django-3.1.9/tests/admin_scripts/tests.py", line 2026, in test_project_template_tarball_url
    self.assertNoOutput(err)
  File "/var/tmp/portage/dev-python/django-3.1.9/work/Django-3.1.9/tests/admin_scripts/tests.py", line 149, in assertNoOutput
    self.assertEqual(len(stream), 0, "Stream should be empty: actually contains '%s'" % stream)
  File "/usr/lib/python3.7/unittest/case.py", line 852, in assertEqual
    assertion_func(first, second, msg=msg)
  File "/usr/lib/python3.7/unittest/case.py", line 845, in _baseAssertEqual
    raise self.failureException(msg)
AssertionError: 170 != 0 : Stream should be empty: actually contains 'CommandError: couldn't download URL http://localhost:57173/custom_templates/project_template.tgz/ to project_template.tgz: <urlopen error [Errno 111] Connection refused>
'

----------------------------------------------------------------------
Ran 13842 tests in 155.539s

FAILED (failures=2, errors=17, skipped=947, expected failures=4)
Destroying test database for alias 'default' ('file:memorydb_default?mode=memory&cache=shared')...
Destroying test database for alias 'default' ('file:memorydb_default?mode=memory&cache=shared')...
Destroying test database for alias 'default' ('file:memorydb_default?mode=memory&cache=shared')...
Destroying test database for alias 'default' ('file:memorydb_default?mode=memory&cache=shared')...
Destroying test database for alias 'default' ('file:memorydb_default?mode=memory&cache=shared')...
Destroying test database for alias 'default' ('file:memorydb_default?mode=memory&cache=shared')...
Destroying test database for alias 'default' ('file:memorydb_default?mode=memory&cache=shared')...
Destroying test database for alias 'default' ('file:memorydb_default?mode=memory&cache=shared')...
Destroying test database for alias 'default' ('file:memorydb_default?mode=memory&cache=shared')...
Destroying test database for alias 'other' ('file:memorydb_other?mode=memory&cache=shared')...
Destroying test database for alias 'other' ('file:memorydb_other?mode=memory&cache=shared')...
Destroying test database for alias 'other' ('file:memorydb_other?mode=memory&cache=shared')...
Destroying test database for alias 'other' ('file:memorydb_other?mode=memory&cache=shared')...
Destroying test database for alias 'other' ('file:memorydb_other?mode=memory&cache=shared')...
Destroying test database for alias 'other' ('file:memorydb_other?mode=memory&cache=shared')...
Destroying test database for alias 'other' ('file:memorydb_other?mode=memory&cache=shared')...
Destroying test database for alias 'other' ('file:memorydb_other?mode=memory&cache=shared')...
Destroying test database for alias 'other' ('file:memorydb_other?mode=memory&cache=shared')...
 * ERROR: dev-python/django-3.1.9::gentoo failed (test phase):
 *   Tests fail with python3.7

----
Portage 3.0.18 (python 3.8.9-final-0, default/linux/x86/17.0/desktop/plasma, gcc-10.2.0, glibc-2.32-r7, 4.14.34-gentoo-infra38 i686)
=================================================================
System uname: Linux-4.14.34-gentoo-infra38-i686-Intel-R-_Xeon-R-_CPU_E5-2620_v4_@_2.10GHz-with-glibc2.1.3
KiB Mem:    16426740 total,   5398088 free
KiB Swap:    4194268 total,   4147000 free
Timestamp of repository gentoo: Wed, 05 May 2021 21:20:10 +0000
sh bash 5.0_p18
ld GNU ld (Gentoo 2.35.2 p1) 2.35.2
app-shells/bash:          5.0_p18::gentoo
dev-java/java-config:     2.3.1::gentoo
dev-lang/perl:            5.30.3::gentoo
dev-lang/python:          3.7.10_p3::gentoo, 3.8.9_p2::gentoo, 3.9.4_p1::gentoo
dev-lang/rust-bin:        1.51.0::gentoo
dev-util/cmake:           3.18.5::gentoo
sys-apps/baselayout:      2.7::gentoo
sys-apps/openrc:          0.42.1-r1::gentoo
sys-apps/sandbox:         2.22::gentoo
sys-devel/autoconf:       2.13-r1::gentoo, 2.69-r5::gentoo
sys-devel/automake:       1.16.2-r1::gentoo
sys-devel/binutils:       2.35.2::gentoo
sys-devel/gcc:            10.2.0-r5::gentoo
sys-devel/gcc-config:     2.4::gentoo
sys-devel/libtool:        2.4.6-r6::gentoo
sys-devel/make:           4.3::gentoo
sys-kernel/linux-headers: 5.10::gentoo (virtual/os-headers)
sys-libs/glibc:           2.32-r7::gentoo
Repositories:

gentoo
    location: /bound/portage
    sync-type: rsync
    sync-uri: rsync://rsync.gentoo.org/gentoo-portage
    priority: -1000
    sync-rsync-verify-jobs: 1
    sync-rsync-verify-metamanifest: yes
    sync-rsync-verify-max-age: 24
    sync-rsync-extra-opts:

ACCEPT_KEYWORDS="x86"
ACCEPT_LICENSE="*"
CBUILD="i686-pc-linux-gnu"
CFLAGS="-O2 -march=i686 -pipe -fdiagnostics-color=always -frecord-gcc-switches"
CHOST="i686-pc-linux-gnu"
CONFIG_PROTECT="/etc /usr/share/config /usr/share/gnupg/qualified.txt"
CONFIG_PROTECT_MASK="/etc/ca-certificates.conf /etc/dconf /etc/env.d /etc/fonts/fonts.conf /etc/gconf /etc/gentoo-release /etc/php/apache2-php7.4/ext-active/ /etc/php/cgi-php7.4/ext-active/ /etc/php/cli-php7.4/ext-active/ /etc/revdep-rebuild /etc/sandbox.d /etc/terminfo /etc/texmf/language.dat.d /etc/texmf/language.def.d /etc/texmf/updmap.d /etc/texmf/web2c"
CXXFLAGS="-O2 -march=i686 -pipe -fdiagnostics-color=always -frecord-gcc-switches"
DISTDIR="/bound/distfiles"
EMERGE_DEFAULT_OPTS="--complete-graph --with-bdeps=y --keep-going --deep"
ENV_UNSET="CARGO_HOME DBUS_SESSION_BUS_ADDRESS DISPLAY GOBIN GOPATH PERL5LIB PERL5OPT PERLPREFIX PERL_CORE PERL_MB_OPT PERL_MM_OPT XAUTHORITY XDG_CACHE_HOME XDG_CONFIG_HOME XDG_DATA_HOME XDG_RUNTIME_DIR"
FCFLAGS="-O2 -march=i686 -pipe -fdiagnostics-color=always -frecord-gcc-switches"
FEATURES="assume-digests binpkg-docompress binpkg-dostrip binpkg-logs cgroup config-protect-if-modified distlocks ebuild-locks fixlafiles ipc-sandbox merge-sync multilib-strict network-sandbox news parallel-fetch parallel-install pid-sandbox preserve-libs protect-owned qa-unresolved-soname-deps sandbox sfperms strict unknown-features-warn unmerge-logs unmerge-orphans userfetch userpriv usersandbox usersync xattr"
FFLAGS="-O2 -march=i686 -pipe -fdiagnostics-color=always -frecord-gcc-switches"
GENTOO_MIRRORS="http://distfiles.gentoo.org"
LANG="en_US.utf8"
LDFLAGS="-O2 -march=i686 -pipe -fdiagnostics-color=always -frecord-gcc-switches -Wl,--defsym=__gentoo_check_ldflags__=0 -Wl,-O1 -Wl,--as-needed"
MAKEOPTS="-j9 -l9"
PKGDIR="/var/cache/binpkgs"
PORTAGE_CONFIGROOT="/"
PORTAGE_RSYNC_OPTS="--recursive --links --safe-links --perms --times --omit-dir-times --compress --force --whole-file --delete --stats --human-readable --timeout=180 --exclude=/distfiles --exclude=/local --exclude=/packages --exclude=/.git"
PORTAGE_TMPDIR="/var/tmp"
USE="X a52 aac acl acpi activities alsa berkdb bluetooth branding bzip2 cairo cdda cdr cli crypt cups dbus declarative dri dts dvd dvdr elogind emboss encode exif flac fortran gdbm gif gpm graphite gtk gui iconv icu ipv6 jpeg kde kipi kwallet lcms libglvnd libnotify libtirpc mad mng mp3 mp4 mpeg ncurses nls nptl objc objc++ ogg opengl openmp pam pango pcre pdf phonon plasma png policykit polkit ppds qml qt5 readline sdl seccomp semantic-desktop spell split-usr ssl startup-notification svg tcpd threads tiff truetype udev udisks unicode upower usb vorbis wayland widgets wxwidgets x264 x86 xattr xcb xml xv xvid zlib" ABI_X86="32" ADA_TARGET="gnat_2018" ALSA_CARDS="ali5451 als4000 atiixp atiixp-modem bt87x ca0106 cmipci emu10k1 emu10k1x ens1370 ens1371 es1938 es1968 fm801 hda-intel intel8x0 intel8x0m maestro3 trident usb-audio via82xx via82xx-modem ymfpci" APACHE2_MODULES="authn_core authz_core socache_shmcb unixd actions alias auth_basic authn_alias authn_anon authn_dbm authn_default authn_file authz_dbm authz_default authz_groupfile authz_host authz_owner authz_user autoindex cache cgi cgid dav dav_fs dav_lock deflate dir disk_cache env expires ext_filter file_cache filter headers include info log_config logio mem_cache mime mime_magic negotiation rewrite setenvif speling status unique_id userdir usertrack vhost_alias" CALLIGRA_FEATURES="karbon sheets words" COLLECTD_PLUGINS="df interface irq load memory rrdtool swap syslog" CPU_FLAGS_X86="aes avx avx2 f16c fma3 mmx mmxext pclmul popcnt sse sse2 sse3 sse4_1 sse4_2 ssse3" ELIBC="glibc" GPSD_PROTOCOLS="ashtech aivdm earthmate evermore fv18 garmin garmintxt gpsclock greis isync itrax mtk3301 nmea ntrip navcom oceanserver oldstyle oncore rtcm104v2 rtcm104v3 sirf skytraq superstar2 timing tsip tripmate tnt ublox ubx" INPUT_DEVICES="libinput" KERNEL="linux" LCD_DEVICES="framebuffer" LIBREOFFICE_EXTENSIONS="presenter-console presenter-minimizer" LUA_SINGLE_TARGET="lua5-1" LUA_TARGETS="lua5-1" OFFICE_IMPLEMENTATION="libreoffice" PHP_TARGETS="php7-3 php7-4" POSTGRES_TARGETS="postgres12" PYTHON_SINGLE_TARGET="python3_8" PYTHON_TARGETS="python3_8 python3_7 python3_9" RUBY_TARGETS="ruby26" USERLAND="GNU" VIDEO_CARDS="amdgpu fbdev intel nouveau radeon radeonsi vesa dummy v4l" XTABLES_ADDONS="quota2 psd pknock lscan length2 ipv4options ipset ipp2p iface geoip fuzzy condition tee tarpit sysrq proto steal rawnat logmark ipmark dhcpmac delude chaos account"
Unset:  CC, CPPFLAGS, CTARGET, CXX, INSTALL_MASK, LC_ALL, LINGUAS, PORTAGE_BINHOST, PORTAGE_BUNZIP2_COMMAND, PORTAGE_COMPRESS, PORTAGE_COMPRESS_FLAGS, PORTAGE_RSYNC_EXTRA_OPTS, RUSTFLAGS
Comment 1 Michał Górny archtester Gentoo Infrastructure gentoo-dev Security 2021-05-06 06:55:15 UTC
That's weird.  The test passed for me.  Apparently it's using the same server spawned on localhost as do other Django tests.  I wonder if the server crashes for you or something.