Gentoo Websites Logo
Go to: Gentoo Home Documentation Forums Lists Bugs Planet Store Wiki Get Gentoo!

Bug 777069

Summary: media-gfx/graphite2-1.3.14 ld.lld: error: unknown argument '-pipe' with the LLVM linker
Product: Gentoo Linux Reporter: Alessandro Barbieri <lssndrbarbieri>
Component: Current packagesAssignee: Gentoo Office Team <office>
Status: UNCONFIRMED ---    
Severity: normal    
Priority: Normal    
Version: unspecified   
Hardware: All   
OS: Linux   
Whiteboard:
Package list:
Runtime testing required: ---
Bug Depends on:    
Bug Blocks: 731004    
Attachments: graphite2-1.3.14:20210318-171833.log

Description Alessandro Barbieri 2021-03-18 18:59:31 UTC
* Using Module::Build
 * perl Build.PL --installdirs=vendor --libdoc= --destdir=/var/tmp/portage/media-gfx/graphite2-1.3.14/image --create_packlist=1
WARNING: the following files are missing in your kit:
        README
Please inform the author.

ld.lld: error: unknown argument '-pipe'
ld.lld: error: unknown argument '-pipe'
ld.lld: error: unknown argument '-Wimplicit-function-declaration'
ld.lld: error: unknown argument '-Wno-error=implicit-function-declaration'
ld.lld: error: unknown argument '-Wl,-O1'
ld.lld: error: unknown argument '-Wl,--as-needed'
ld.lld: error: unknown emulation: arch=native
Warning: ExtUtils::CBuilder not installed or no compiler detected
Proceeding with configuration, but compilation may fail during Build

Created MYMETA.yml and MYMETA.json
Creating new 'Build' script for 'Text-Gr2' version '0.01'
Building Text-Gr2
Error: no compiler detected to compile 'lib/Text/Gr2.c'.  Aborting
 * ERROR: media-gfx/graphite2-1.3.14::gentoo failed (compile phase):
 *   Compilation failed
 * 
 * Call stack:
 *     ebuild.sh, line  125:  Called src_compile
 *   environment, line 5100:  Called perl-module_src_compile
 *   environment, line 4083:  Called die
 * The specific snippet of code:
 *           ./Build build || die "Compilation failed";
Comment 1 Alessandro Barbieri 2021-03-18 18:59:47 UTC
Created attachment 692277 [details]
graphite2-1.3.14:20210318-171833.log

buildlog