Gentoo Websites Logo
Go to: Gentoo Home Documentation Forums Lists Bugs Planet Store Wiki Get Gentoo!

Bug 775317

Summary: gnustep-libs/dbuskit-0.1.1 - ../powerpc-unknown-linux-gnu/bin/ld: ../Source/DBusKit.framework/Versions/Current/./libDBusKit.so: undefined reference to `GS_GC_HIDE'
Product: Gentoo Linux Reporter: ernsteiswuerfel <erhard_f>
Component: Current packagesAssignee: Gnustep herd <gnustep>
Status: UNCONFIRMED ---    
Severity: normal CC: ionen
Priority: Normal    
Version: unspecified   
Hardware: PPC   
OS: Linux   
Whiteboard:
Package list:
Runtime testing required: ---
Attachments: build.log
emerge --info

Description ernsteiswuerfel archtester 2021-03-11 00:32:00 UTC
Created attachment 690609 [details]
build.log

[...]
powerpc-unknown-linux-gnu-gcc -rdynamic  -Wl,-O1 -Wl,--as-needed -Wl,--hash-style=gnu   -Wl,-O1 -Wl,--as-needed -Wl,--hash-style=gnu  -pthread   -o obj/dk_make_protocol \
	./obj/dk_make_protocol.obj/dk_make_protocol.m.o \
	  -L../Source/DBusKit.framework/Versions/Current/.  -L/usr/lib/./obj  -L/var/tmp/portage/gnustep-libs/dbuskit-0.1.1/work/GNUstep/Library/Libraries -L/usr/local/lib -L/usr/lib   -lgnustep-base -lDBusKit   -lgnustep-base    -l:libobjc.so.4   -lm
/usr/lib/gcc/powerpc-unknown-linux-gnu/9.3.0/../../../../powerpc-unknown-linux-gnu/bin/ld: ../Source/DBusKit.framework/Versions/Current/./libDBusKit.so: undefined reference to `GS_GC_HIDE'
/usr/lib/gcc/powerpc-unknown-linux-gnu/9.3.0/../../../../powerpc-unknown-linux-gnu/bin/ld: ../Source/DBusKit.framework/Versions/Current/./libDBusKit.so: undefined reference to `GS_GC_UNHIDE'
collect2: error: ld returned 1 exit status
gmake[4]: *** [/usr/share/GNUstep/Makefiles/Instance/tool.make:89: obj/dk_make_protocol] Error 1
gmake[3]: *** [/usr/share/GNUstep/Makefiles/Instance/tool.make:74: internal-tool-all_] Error 2
gmake[2]: *** [/usr/share/GNUstep/Makefiles/Master/rules.make:297: dk_make_protocol.all.tool.variables] Error 2
gmake[1]: *** [/usr/share/GNUstep/Makefiles/Master/tool.make:71: internal-all] Error 2
gmake[1]: Leaving directory '/var/tmp/portage/gnustep-libs/dbuskit-0.1.1/work/libs-dbuskit-0.1.1/Tools'
make: *** [/usr/share/GNUstep/Makefiles/Master/serial-subdirectories.make:53: internal-all] Error 2
 * ERROR: gnustep-libs/dbuskit-0.1.1::gentoo failed (compile phase):
 *   emake failed
Comment 1 ernsteiswuerfel archtester 2021-03-11 00:32:30 UTC
Created attachment 690612 [details]
emerge --info