Gentoo Websites Logo
Go to: Gentoo Home Documentation Forums Lists Bugs Planet Store Wiki Get Gentoo!

Bug 749966

Summary: app-misc/mosquitto fails test
Product: Gentoo Linux Reporter: Thomas Deutschmann <whissi>
Component: Current packagesAssignee: Matt Turner <mattst88>
Status: CONFIRMED ---    
Severity: normal Keywords: TESTFAILURE
Priority: Normal    
Version: unspecified   
Hardware: All   
OS: Linux   
Whiteboard:
Package list:
Runtime testing required: ---
Bug Depends on:    
Bug Blocks: 744394    
Attachments: build.log

Description Thomas Deutschmann gentoo-dev 2020-10-18 15:54:01 UTC
Created attachment 666548 [details]
build.log

> Suite: Persist read
>   Test: Persistence disabled ...passed
>   Test: Empty file ...passed
>   Test: Corrupt header ...passed
>   Test: Unsupported version ...passed
>   Test: v3 config ok ...passed
>   Test: v3 config bad truncated ...passed
>   Test: v3 config bad dbid ...passed
>   Test: v3 bad chunk ...passed
>   Test: v3 message store ...passed
>   Test: v3 client ...passed
>   Test: v3 client message ...FAILED
>     1. persist_read_test.c:273  - CU_ASSERT_PTR_NOT_NULL(context->msgs_out.inflight)
>   Test: v3 retain ...passed
>   Test: v3 sub ...FAILED
>     1. persist_read_test.c:367  - CU_ASSERT_PTR_NOT_NULL(last_sub)
>     2. persist_read_test.c:372  - CU_ASSERT_EQUAL(last_qos,1)
>   Test: v4 config ok ...passed
>   Test: v4 message store ...passed
>   Test: v5 client ...FAILED
>     1. persist_read_test.c:566  - CU_ASSERT_PTR_NOT_NULL(db.contexts_by_id)
>     2. persist_read_test.c:568  - CU_ASSERT_PTR_NOT_NULL(context)
>   Test: v5 config bad truncated ...FAILED
>     1. persist_read_test.c:445  - CU_ASSERT_EQUAL(rc,1)
>     2. persist_read_test.c:446  - CU_ASSERT_EQUAL(db.last_db_id,0)
>   Test: v5 bad chunk ...passed
>   Test: v6 config ok ...passed
>   Test: v6 message store ...FAILED
>     1. persist_read_test.c:484  - CU_ASSERT_EQUAL(db.msg_store_count,1)
>     2. persist_read_test.c:485  - CU_ASSERT_EQUAL(db.msg_store_bytes,7)
>     3. persist_read_test.c:486  - CU_ASSERT_PTR_NOT_NULL(db.msg_store)
>   Test: v6 message store+props ...FAILED
>     1. persist_read_test.c:525  - CU_ASSERT_EQUAL(db.msg_store_count,1)
>     2. persist_read_test.c:526  - CU_ASSERT_EQUAL(db.msg_store_bytes,7)
>     3. persist_read_test.c:527  - CU_ASSERT_PTR_NOT_NULL(db.msg_store)
>   Test: v6 client ...FAILED
>     1. persist_read_test.c:599  - CU_ASSERT_PTR_NOT_NULL(db.contexts_by_id)
>     2. persist_read_test.c:601  - CU_ASSERT_PTR_NOT_NULL(context)
>   Test: v6 client message ...FAILED
>     1. persist_read_test.c:629  - CU_ASSERT_PTR_NOT_NULL(db.contexts_by_id)
>     2. persist_read_test.c:631  - CU_ASSERT_PTR_NOT_NULL(context)
>   Test: v6 client message+props ...FAILED
>     1. persist_read_test.c:678  - CU_ASSERT_PTR_NOT_NULL(db.contexts_by_id)
>     2. persist_read_test.c:680  - CU_ASSERT_PTR_NOT_NULL(context)
>   Test: v6 retain ...FAILED
>     1. persist_read_test.c:731  - CU_ASSERT_EQUAL(db.msg_store_count,1)
>     2. persist_read_test.c:732  - CU_ASSERT_EQUAL(db.msg_store_bytes,7)
>     3. persist_read_test.c:733  - CU_ASSERT_PTR_NOT_NULL(db.msg_store)
>     4. persist_read_test.c:747  - CU_ASSERT_EQUAL(last_retained,0x54)
>   Test: v6 sub ...FAILED
>     1. persist_read_test.c:770  - CU_ASSERT_PTR_NOT_NULL(db.contexts_by_id)
>     2. persist_read_test.c:772  - CU_ASSERT_PTR_NOT_NULL(context)
> 
> Run Summary:    Type  Total    Ran Passed Failed Inactive
>               suites      1      1    n/a      0        0
>                tests     26     26     15     11        0
>              asserts    107    107     82     25      n/a
> 
> Elapsed time =    0.001 seconds
> make[2]: *** [Makefile:128: test-broker] Error 25
> make[2]: Leaving directory '/var/tmp/portage/app-misc/mosquitto-1.6.12/work/mosquitto-1.6.12/test/unit'
> make[1]: *** [Makefile:18: utest] Error 2
> make[1]: Leaving directory '/var/tmp/portage/app-misc/mosquitto-1.6.12/work/mosquitto-1.6.12/test'
> make: *** [Makefile:75: test] Error 2
>  * ERROR: app-misc/mosquitto-1.6.12::gentoo failed (test phase):
> 


Portage 3.0.8 (python 3.7.9-final-0, default/linux/x86/17.0, gcc-9.3.0, glibc-2.31-r6, 5.4.66-gentoo-x86-kmod i686)
=================================================================
System uname: Linux-5.4.66-gentoo-x86-kmod-i686-with-gentoo-2.7
KiB Mem:     3106040 total,    973416 free
KiB Swap:    8875836 total,   8873012 free
Timestamp of repository gentoo: Sun, 18 Oct 2020 14:05:19 +0000
Head commit of repository gentoo: 003bff9e2f42d81705b8c9b8d4c0aa018863f2ec

sh bash 5.0_p18
ld GNU ld (Gentoo 2.34 p6) 2.34.0
app-shells/bash:          5.0_p18::gentoo
dev-java/java-config:     2.3.1::gentoo
dev-lang/perl:            5.30.3::gentoo
dev-lang/python:          2.7.18-r4::gentoo, 3.6.12::gentoo, 3.7.9::gentoo, 3.8.5::gentoo
dev-util/cmake:           3.17.4-r1::gentoo
dev-util/pkgconfig:       0.29.2::gentoo
sys-apps/baselayout:      2.7::gentoo
sys-apps/openrc:          0.42.1::gentoo
sys-apps/sandbox:         2.18::gentoo
sys-devel/autoconf:       2.13-r1::gentoo, 2.69-r5::gentoo
sys-devel/automake:       1.16.1-r1::gentoo
sys-devel/binutils:       2.34-r2::gentoo
sys-devel/gcc:            9.3.0-r1::gentoo
sys-devel/gcc-config:     2.3.1::gentoo
sys-devel/libtool:        2.4.6-r6::gentoo
sys-devel/make:           4.2.1-r4::gentoo
sys-kernel/linux-headers: 5.4-r1::gentoo (virtual/os-headers)
sys-libs/glibc:           2.31-r6::gentoo
Repositories:

gentoo
    location: /usr/portage
    sync-type: git
    sync-uri: https://anongit.gentoo.org/git/repo/sync/gentoo.git
    priority: -1000

ABI="x86"
ABI_X86="32"
ACCEPT_KEYWORDS="x86"
ACCEPT_LICENSE="*"
ACCEPT_PROPERTIES="*"
ACCEPT_RESTRICT="*"
ADA_TARGET="gnat_2018"
ARCH="x86"
BINPKG_COMPRESS="bzip2"
BROOT=""
CBUILD="i686-pc-linux-gnu"
CFLAGS="-O2 -pipe -march=pentium4m -mtune=pentium4m -Wno-error=jump-misses-init -Wno-error=sign-compare"
CHOST="i686-pc-linux-gnu"
CHOST_x86="i686-pc-linux-gnu"
COLLISION_IGNORE="/lib/modules/*"
CONFIG_PROTECT="/etc /usr/share/config /usr/share/gnupg/qualified.txt"
CPU_FLAGS_X86="mmx mmxext sse sse2"
CXXFLAGS="-O2 -pipe -march=pentium4m -mtune=pentium4m -Wno-error=jump-misses-init -Wno-error=sign-compare"
DEFAULT_ABI="x86"
EDITOR="/usr/bin/mcedit"
ELIBC="glibc"
ENV_UNSET="CARGO_HOME DBUS_SESSION_BUS_ADDRESS DISPLAY GOBIN GOPATH PERL5LIB PERL5OPT PERLPREFIX PERL_CORE PERL_MB_OPT PERL_MM_OPT XAUTHORITY XDG_CACHE_HOME XDG_CONFIG_HOME XDG_DATA_HOME XDG_RUNTIME_DIR"
EPREFIX=""
EROOT="/"
ESYSROOT="/"
FCFLAGS="-O2 -march=i686 -pipe"
FEATURES="assume-digests binpkg-docompress binpkg-dostrip binpkg-logs cgroup config-protect-if-modified distlocks downgrade-backup ebuild-locks fixlafiles ipc-sandbox merge-sync multilib-strict network-sandbox news parallel-fetch pid-sandbox preserve-libs protect-owned qa-unresolved-soname-deps sandbox sfperms strict unknown-features-warn unmerge-logs unmerge-orphans userfetch userpriv usersandbox usersync xattr"
FFLAGS="-O2 -march=i686 -pipe"
GCC_SPECS=""
GRUB_PLATFORMS="efi-32 pc"
GSETTINGS_BACKEND="dconf"
HOME="/root"
INFOPATH="/usr/share/gcc-data/i686-pc-linux-gnu/9.3.0/info:/usr/share/binutils-data/i686-pc-linux-gnu/2.34/info:/usr/share/info"
INPUT_DEVICES="libinput"
IUSE_IMPLICIT="abi_x86_32 prefix prefix-guest prefix-stack"
JAVAC="/etc/java-config-2/current-system-vm/bin/javac"
JAVA_HOME="/etc/java-config-2/current-system-vm"
JDK_HOME="/etc/java-config-2/current-system-vm"
KERNEL="linux"
L10N="en en-US de de-DE"
LANG="en_US.UTF-8"
LC_ALL="en_US.UTF-8"
LC_MESSAGES="C"
LC_PAPER="de_DE.UTF-8"
LDFLAGS="-Wl,-O1 -Wl,--as-needed"
LIBDIR_x86="lib"
LINGUAS="en de"
LOGNAME="root"
MAIL="/var/mail/root"
MAKEOPTS="--jobs 5 --load-average 7.95"
MANPAGER="manpager"
MOTD_SHOWN="pam"
MULTILIB_ABIS="x86"
NOCOLOR="true"
OFFICE_IMPLEMENTATION="libreoffice"
OPENCL_PROFILE="ocl-icd"
OPENGL_PROFILE="xorg-x11"
PAGER="/usr/bin/less"
PATH="/usr/local/sbin:/usr/local/bin:/usr/sbin:/usr/bin:/sbin:/bin:/opt/bin:/usr/lib/llvm/10/bin"
PHP_TARGETS="php7-2 php7-3"
POSTGRES_TARGETS="postgres10 postgres11"
PWD="/root"
PYTHONDONTWRITEBYTECODE="1"
PYTHON_SINGLE_TARGET="python3_7"
PYTHON_TARGETS="python2_7 python3_7"
QT_GRAPHICSSYSTEM="raster"
ROOT="/"
ROOTPATH="/usr/local/sbin:/usr/local/bin:/usr/sbin:/usr/bin:/sbin:/bin:/opt/bin:/usr/lib/llvm/10/bin"
RUBY_TARGETS="ruby25 ruby26"
SHELL="/bin/bash"
SHLVL="2"
SSH_ASKPASS="/usr/bin/ssh-askpass-fullscreen"
SSH_TTY="/dev/pts/0"
SYSROOT="/"
TERM="tmux-256color"
TMUX="/tmp//tmux-0/default,3583,0"
TMUX_PANE="%3"
TWISTED_DISABLE_WRITING_OF_PLUGIN_CACHE="1"
USER="root"
USERLAND="GNU"
VIDEO_CARDS="vmware"
XDG_CONFIG_DIRS="/etc/xdg"
XDG_DATA_DIRS="/usr/local/share:/usr/share"
XDG_RUNTIME_DIR="/run/user/0"
XDG_SESSION_CLASS="user"
XDG_SESSION_ID="1"
XDG_SESSION_TYPE="tty"
Comment 1 Thomas Deutschmann gentoo-dev 2021-05-08 01:52:23 UTC
=app-misc/mosquitto-2.0.10 is still failing the same.