Gentoo Websites Logo
Go to: Gentoo Home Documentation Forums Lists Bugs Planet Store Wiki Get Gentoo!

Bug 708466

Summary: media-sound/easytag-2.4.3-r4 - fails tests
Product: Gentoo Linux Reporter: ernsteiswuerfel <erhard_f>
Component: Current packagesAssignee: Gentoo Sound Team <sound>
Status: CONFIRMED ---    
Severity: normal CC: kingjon3377
Priority: Normal Keywords: TESTFAILURE
Version: unspecified   
Hardware: All   
OS: Linux   
Package list:
Runtime testing required: ---
Attachments: build.log
emerge --info

Description ernsteiswuerfel archtester 2020-02-06 12:17:48 UTC
Created attachment 612074 [details]

Making check in po
make[2]: Entering directory '/var/tmp/portage/media-sound/easytag-2.4.3-r1/work/easytag-2.4.3/po'
INTLTOOL_EXTRACT="/usr/bin/intltool-extract" XGETTEXT="/usr/bin/xgettext" srcdir=. /usr/bin/intltool-update --gettext-package easytag --pot
rm -f missing notexist
srcdir=. /usr/bin/intltool-update -m
if [ -r missing -o -r notexist ]; then \
  exit 1; \
make[2]: Leaving directory '/var/tmp/portage/media-sound/easytag-2.4.3-r1/work/easytag-2.4.3/po'
make[2]: Entering directory '/var/tmp/portage/media-sound/easytag-2.4.3-r1/work/easytag-2.4.3'
LC_ALL=C /usr/bin/intltool-merge  -x -u -c ./po/.intltool-merge-cache ./po data/ data/easytag.appdata.xml
Found cached translation database
Merging translations into data/easytag.appdata.xml.
CREATED data/easytag.appdata.xml
if test -f "data/easytag.appdata.xml"; then d=; else d="./"; fi; \
	if test -n "/usr/bin/appstream-util"; \
		then /usr/bin/appstream-util --nonet validate ${d}data/easytag.appdata.xml; fi \
	&& touch data/easytag.appdata.valid
data/easytag.appdata.xml: FAILED:
? tag-missing           : <content_rating> required [use]
? tag-missing           : <release> required
Validation of files failed
make[2]: *** [Makefile:4054: data/easytag.appdata.valid] Error 1
make[2]: Leaving directory '/var/tmp/portage/media-sound/easytag-2.4.3-r1/work/easytag-2.4.3'
make[1]: *** [Makefile:3280: check-recursive] Error 1
make[1]: Leaving directory '/var/tmp/portage/media-sound/easytag-2.4.3-r1/work/easytag-2.4.3'
make: *** [Makefile:3798: check] Error 2
 * ERROR: media-sound/easytag-2.4.3-r1::gentoo failed (test phase):
 *   Make check failed. See above for details.
Comment 1 ernsteiswuerfel archtester 2020-02-06 12:18:14 UTC
Created attachment 612076 [details]
emerge --info
Comment 2 Agostino Sarubbo gentoo-dev 2022-09-15 06:54:39 UTC
tinderbox_musl has reproduced this issue with version 2.4.3-r4 - Updating summary.