Gentoo Websites Logo
Go to: Gentoo Home Documentation Forums Lists Bugs Planet Store Wiki Get Gentoo!
Bugzilla DB migration completed. Please report issues to Infra team via email via infra@gentoo.org or IRC

Bug 690074

Summary: games-puzzle/tint-0.03b-r1 : /.../ld: io.o: undefined reference to symbol stdscr
Product: Gentoo Linux Reporter: Toralf Förster <toralf>
Component: Current packagesAssignee: Gentoo Games <games>
Status: RESOLVED FIXED    
Severity: normal    
Priority: Normal    
Version: unspecified   
Hardware: All   
OS: Linux   
Whiteboard:
Package list:
Runtime testing required: ---
Bug Depends on:    
Bug Blocks: 457530    
Attachments: emerge-info.txt
emerge-history.txt
environment
etc.portage.tbz2
games-puzzle:tint-0.03b-r1:20190716-230818.log
temp.tbz2

Description Toralf Förster gentoo-dev 2019-07-17 16:51:38 UTC
      |    ^~~~~~~~~~~~~~~~~~~~~~~~~~~~~~
cc -Wl,-O1 -Wl,--as-needed engine.o utils.o io.o tint.o -o tint -lncurses
/usr/lib/gcc/x86_64-pc-linux-gnu/9.1.0/../../../../x86_64-pc-linux-gnu/bin/ld: io.o: undefined reference to symbol 'stdscr'
/usr/lib/gcc/x86_64-pc-linux-gnu/9.1.0/../../../../x86_64-pc-linux-gnu/bin/ld: /lib64/libtinfo.so.6: error adding symbols: DSO missing from command line
collect2: error: ld returned 1 exit status
make: *** [Makefile:83: tint] Error 1

  -------------------------------------------------------------------

  This is an unstable amd64 chroot image at a tinderbox (==build bot)
  name: 17.1_no-multilib_hardened-20190715-113836

  -------------------------------------------------------------------

gcc-config -l:
 [1] x86_64-pc-linux-gnu-9.1.0 *

Available Python interpreters, in order of preference:
  [1]   python3.6
  [2]   python2.7 (fallback)
Available Ruby profiles:
  [1]   ruby24 (with Rubygems) *
Available Rust versions:
  [1]   rust-1.36.0 *



emerge -qpvO games-puzzle/tint
[ebuild  N    ] games-puzzle/tint-0.03b-r1
Comment 1 Toralf Förster gentoo-dev 2019-07-17 16:51:41 UTC
Created attachment 583196 [details]
emerge-info.txt
Comment 2 Toralf Förster gentoo-dev 2019-07-17 16:51:44 UTC
Created attachment 583198 [details]
emerge-history.txt
Comment 3 Toralf Förster gentoo-dev 2019-07-17 16:51:47 UTC
Created attachment 583200 [details]
environment
Comment 4 Toralf Förster gentoo-dev 2019-07-17 16:51:50 UTC
Created attachment 583202 [details]
etc.portage.tbz2
Comment 5 Toralf Förster gentoo-dev 2019-07-17 16:51:53 UTC
Created attachment 583204 [details]
games-puzzle:tint-0.03b-r1:20190716-230818.log
Comment 6 Toralf Förster gentoo-dev 2019-07-17 16:51:56 UTC
Created attachment 583206 [details]
temp.tbz2
Comment 7 Larry the Git Cow gentoo-dev 2019-07-17 21:52:38 UTC
The bug has been closed via the following commit(s):

https://gitweb.gentoo.org/repo/gentoo.git/commit/?id=b1943d6833bb67144ab2865373c521f10ab52843

commit b1943d6833bb67144ab2865373c521f10ab52843
Author:     Lars Wendler <polynomial-c@gentoo.org>
AuthorDate: 2019-07-17 21:51:24 +0000
Commit:     Lars Wendler <polynomial-c@gentoo.org>
CommitDate: 2019-07-17 21:52:32 +0000

    games-puzzle/tint: Fixed build with sys-libs/ncurses[tinfo]
    
    Closes: https://bugs.gentoo.org/690074
    Package-Manager: Portage-2.3.69, Repoman-2.3.16
    Signed-off-by: Lars Wendler <polynomial-c@gentoo.org>

 games-puzzle/tint/tint-0.03b-r1.ebuild | 9 +++++++--
 1 file changed, 7 insertions(+), 2 deletions(-)