Gentoo Websites Logo
Go to: Gentoo Home Documentation Forums Lists Bugs Planet Store Wiki Get Gentoo!

Bug 635632

Summary: dev-python/pytest-shutil-1.2.11 fails tests - OSError: [Errno 9] Bad file descriptor
Product: Gentoo Linux Reporter: eroen <gentoo>
Component: Current packagesAssignee: No maintainer - Look at https://wiki.gentoo.org/wiki/Project:Proxy_Maintainers if you want to take care of it <maintainer-needed>
Status: UNCONFIRMED ---    
Severity: normal CC: dolsen
Priority: Normal Keywords: TESTFAILURE
Version: unspecified   
Hardware: All   
OS: Linux   
Whiteboard:
Package list:
Runtime testing required: ---
Attachments: /var/log/portage/build/dev-python/pytest-shutil-1.2.11:20171027-211519.log

Description eroen 2017-10-27 21:18:50 UTC
Created attachment 500474 [details]
/var/log/portage/build/dev-python/pytest-shutil-1.2.11:20171027-211519.log

=================================================== FAILURES ====================================================
____________________________________________ test_run_in_subprocess _____________________________________________

    def test_run_in_subprocess():
        def fn():
            return None
        with no_cov():
>           res = run.run_in_subprocess(fn)()

tests/integration/test_run_integration.py:174: 
_ _ _ _ _ _ _ _ _ _ _ _ _ _ _ _ _ _ _ _ _ _ _ _ _ _ _ _ _ _ _ _ _ _ _ _ _ _ _ _ _ _ _ _ _ _ _ _ _ _ _ _ _ _ _ _ _
pytest_shutil/run.py:200: in inner
    chan.receive(None)
_ _ _ _ _ _ _ _ _ _ _ _ _ _ _ _ _ _ _ _ _ _ _ _ _ _ _ _ _ _ _ _ _ _ _ _ _ _ _ _ _ _ _ _ _ _ _ _ _ _ _ _ _ _ _ _ _

self = <Channel id=1 closed>, timeout = None

    def receive(self, timeout=None):
        """receive a data item that was sent from the other side.
            timeout: None [default] blocked waiting.  A positive number
            indicates the number of seconds after which a channel.TimeoutError
            exception will be raised if no item was received.
            Note that exceptions from the remotely executing code will be
            reraised as channel.RemoteError exceptions containing
            a textual representation of the remote traceback.
            """
        itemqueue = self._items
        if itemqueue is None:
            raise IOError("cannot receive(), channel has receiver callback")
        try:
            x = itemqueue.get(timeout=timeout)
        except self.gateway.execmodel.queue.Empty:
            raise self.TimeoutError("no item after %r seconds" % (timeout))
        if x is ENDMARKER:
            itemqueue.put(x)  # for other receivers
>           raise self._getremoteerror() or EOFError()
E           RemoteError: Traceback (most recent call last):
E             File "<string>", line 1076, in executetask
E             File "<remote exec>", line 4, in _run_in_subprocess_remote_fn
E             File "pytest_shutil/run.py", line 165, in _run_in_subprocess_redirect_stdout
E               os.dup2(fd, 1)
E           OSError: [Errno 9] Bad file descriptor

/usr/lib64/python2.7/site-packages/execnet/gateway_base.py:737: RemoteError

...

=============================================== warnings summary ================================================
None
  Module already imported so can not be re-written: common_setup

-- Docs: http://doc.pytest.org/en/latest/warnings.html
=============================== 8 failed, 41 passed, 1 warnings in 12.05 seconds ================================
 * ERROR: dev-python/pytest-shutil-1.2.11::gentoo failed (test phase):
 *   (no error message)
 * 
 * Call stack:
 *     ebuild.sh, line  124:  Called src_test
 *   environment, line 2759:  Called distutils-r1_src_test
 *   environment, line  917:  Called _distutils-r1_run_foreach_impl 'python_test'
 *   environment, line  363:  Called python_foreach_impl 'distutils-r1_run_phase' 'python_test'
 *   environment, line 2282:  Called multibuild_foreach_variant '_python_multibuild_wrapper' 'distutils-r1_run_phase' 'python_test'
 *   environment, line 1571:  Called _multibuild_run '_python_multibuild_wrapper' 'distutils-r1_run_phase' 'python_test'
 *   environment, line 1569:  Called _python_multibuild_wrapper 'distutils-r1_run_phase' 'python_test'
 *   environment, line  587:  Called distutils-r1_run_phase 'python_test'
 *   environment, line  848:  Called python_test
 *   environment, line 2639:  Called esetup.py 'test'
 *   environment, line 1116:  Called die
 * The specific snippet of code:
 *       "${@}" || die "${die_args[@]}";
Comment 1 eroen 2017-10-27 21:19:35 UTC
occam ~ # emerge --info '=dev-python/pytest-shutil-1.2.11::gentoo'
Portage 2.3.12 (python 3.6.3-final-0, hardened/linux/amd64, gcc-6.4.0, glibc-2.25-r8, 4.12.12-gentoo-o0 x86_64)
=================================================================
                         System Settings
=================================================================
System uname: Linux-4.12.12-gentoo-o0-x86_64-Intel-R-_Core-TM-_i5-2520M_CPU_@_2.50GHz-with-gentoo-2.4.1
KiB Mem:     8006608 total,   2613376 free
KiB Swap:   16777212 total,  16751752 free
Timestamp of repository gentoo: Fri, 27 Oct 2017 20:30:01 +0000
Head commit of repository gentoo: bd37d6752987c26bf60223635bff02df9100237a
Timestamp of repository eroen: Sun, 30 Oct 2016 21:58:42 +0000
Head commit of repository sapher: 9ef31d0bf6a902342746fb03a445d4f8b7ddabef

Head commit of repository wiktorb: 722797c27affae074c3d7b0a628cad1bdff2041c

Head commit of repository stuff: 75862eeaa5491846d52b599b7c3fbd81d1ac3b75

sh bash 4.4_p12
ld GNU ld (Gentoo 2.29.1 p2) 2.29.1
ccache version 3.3.4 [disabled]
app-shells/bash:          4.4_p12::gentoo
dev-java/java-config:     2.2.0-r3::gentoo
dev-lang/perl:            5.26.1::gentoo
dev-lang/python:          2.7.14::gentoo, 3.4.6::gentoo, 3.5.4::gentoo, 3.6.3::gentoo
dev-util/ccache:          3.3.4::gentoo
dev-util/cmake:           3.9.4::gentoo
dev-util/pkgconfig:       0.29.2::gentoo
sys-apps/baselayout:      2.4.1-r2::gentoo
sys-apps/openrc:          0.34.3::gentoo
sys-apps/sandbox:         2.12::gentoo
sys-devel/autoconf:       2.13::gentoo, 2.69-r4::gentoo
sys-devel/automake:       1.9.6-r4::gentoo, 1.15.1-r1::gentoo
sys-devel/binutils:       2.27-r1::gentoo, 2.28.1::gentoo, 2.29.1-r1::gentoo
sys-devel/gcc:            5.3.0::gentoo, 5.4.0-r3::gentoo, 6.3.0::gentoo, 6.4.0::gentoo
sys-devel/gcc-config:     1.9.0::gentoo
sys-devel/libtool:        2.4.6-r4::gentoo
sys-devel/make:           4.2.1-r1::gentoo
sys-kernel/linux-headers: 4.13::gentoo (virtual/os-headers)
sys-libs/glibc:           2.25-r8::gentoo
Repositories:

gentoo
    location: /usr/portage
    sync-type: rsync
    sync-uri: rsync://rsync.gentoo.org/gentoo-portage
    priority: -1000
    sync-rsync-extra-opts: --exclude ChangeLog* --exclude /metadata/cache/ --stats --delay-updates -c

eroen
    location: /usr/local/portage
    masters: gentoo
    priority: 0

sapher
    location: /var/lib/overlays/sapher
    sync-type: git
    sync-uri: https://github.com/apinsard/sapher-overlay.git
    masters: gentoo

wiktorb
    location: /var/lib/overlays/wiktorb
    sync-type: git
    sync-uri: https://github.com/wiktor-b/overlay.git
    masters: gentoo

enlightenment
    location: /var/lib/layman/enlightenment
    masters: gentoo
    priority: 50

flora
    location: /var/lib/layman/flora
    masters: gentoo
    priority: 50

gamerlay
    location: /var/lib/layman/gamerlay
    masters: gentoo
    priority: 50

glc
    location: /var/lib/layman/glc
    masters: gentoo
    priority: 50

hardened-development
    location: /var/lib/layman/hardened-development
    masters: gentoo
    priority: 50

haskell
    location: /var/lib/layman/haskell
    masters: gentoo
    priority: 50

hasufell
    location: /var/lib/layman/hasufell
    masters: gentoo
    priority: 50

java
    location: /var/lib/layman/java
    masters: gentoo
    priority: 50

laurentb
    location: /var/lib/layman/laurentb
    masters: gentoo
    priority: 50

roslin
    location: /var/lib/layman/roslin
    masters: gentoo
    priority: 50

science
    location: /var/lib/layman/science
    masters: gentoo
    priority: 50

stuff
    location: /var/lib/layman/stuff
    sync-type: git
    sync-uri: https://github.com/istitov/stuff.git
    masters: gentoo
    priority: 50

sunrise
    location: /var/lib/layman/sunrise
    masters: gentoo
    priority: 50

toolchain
    location: /var/lib/layman/toolchain
    masters: gentoo
    priority: 50

v-fox
    location: /var/lib/layman/v-fox
    masters: gentoo
    priority: 50

ACCEPT_KEYWORDS="amd64 ~amd64"
ACCEPT_LICENSE="*"
CBUILD="x86_64-pc-linux-gnu"
CFLAGS="-march=corei7-avx -pipe -Og -g -gdwarf-4"
CHOST="x86_64-pc-linux-gnu"
CONFIG_PROTECT="/etc /usr/share/config /usr/share/easy-rsa /usr/share/gnupg/qualified.txt"
CONFIG_PROTECT_MASK="/etc/ca-certificates.conf /etc/dconf /etc/env.d /etc/fonts/fonts.conf /etc/gconf /etc/gentoo-release /etc/revdep-rebuild /etc/sandbox.d /etc/terminfo /etc/texmf/language.dat.d /etc/texmf/language.def.d /etc/texmf/updmap.d /etc/texmf/web2c"
CXXFLAGS="-march=corei7-avx -pipe -Og -g -gdwarf-4"
DISTDIR="/var/distfiles"
EMERGE_DEFAULT_OPTS="--jobs=4 --autounmask --quiet-build --nospinner --verbose-conflicts --verbose-slot-rebuilds"
FCFLAGS="-O2 -pipe"
FEATURES="assume-digests binpkg-logs binpkg-multi-instance cgroup collision-protect compressdebug config-protect-if-modified distlocks ebuild-locks fixlafiles installsources ipc-sandbox merge-sync multilib-strict network-sandbox news parallel-fetch parallel-install preserve-libs protect-owned sandbox sfperms split-log splitdebug strict test unknown-features-warn unmerge-logs unmerge-orphans userfetch userpriv usersandbox usersync xattr"
FFLAGS="-O2 -pipe"
GENTOO_MIRRORS=""
LANG="en_GB.utf8"
LDFLAGS="-Wl,-O1 -Wl,--as-needed -Wl,--hash-style=gnu"
MAKEOPTS="-j4 -l10"
PKGDIR="/var/packages"
PORTAGE_COMPRESS="xz"
PORTAGE_COMPRESS_FLAGS="-9"
PORTAGE_CONFIGROOT="/"
PORTAGE_RSYNC_EXTRA_OPTS="--exclude ChangeLog* --exclude /metadata/cache/ --stats --delay-updates -c"
PORTAGE_RSYNC_OPTS="--recursive --links --safe-links --perms --times --omit-dir-times --compress --force --whole-file --delete --stats --human-readable --timeout=180 --exclude=/distfiles --exclude=/local --exclude=/packages --exclude=/.git"
PORTAGE_TMPDIR="/var/tmp"
USE="X a52 aac acl alsa amd64 apng audio audiofile avresample avx bash-completion bdf berkdb bluray bzip2 cairo caps cb cdda cdparanoia cdr cjk cli corefonts cracklib crypt cups curl cxx ddate declarative detex device-mapper dga dia djvu dri dts dvd dvi2tty dvipdfm ebook egl exif fam ffmpeg fftw fits flac fontconfig g3dvl gallium gbm gcrypt gdbm gif gimp git glamor glib glibc-omitfp gmp gnuplot gnutls gold gpm graphics graphviz gs gstreamer gtk gtk3 hardened highlight hscolour iconv icu id3tag idn imagemagick imlib inotify iproute2 ipv6 jbig jpeg jpeg2k jpg json justify kde kde4 kpathsea latex lcms libffi libssh2 libv4l luatex lvm lvm2 lzma lzo man metric mikmod mkv mms mmx mng modules mp3 mpeg mpg123 multilib multimedia musepack ncurses netlink nptl nut ocr odbc offensive ogg opengl openmp openvg optimization optimized-qmake opus pam pango pcre pdf pgf phonon pie png postscript private-headers pstricks pth publishers python3 qt3support qt4 raw readline samba sbsms scanner science sdl seccomp session smp sna sndfile speex spell sqlite sse sse2 sse3 sse4 sse41 sse4_1 sse4_2 ssh ssl ssp ssse3 svg t1lib tcpd tesseract theora threads tiff tls truetype udev unicode urandom usb v4l v4l2 vaapi video vorbis vpx webp wmf x264 xanim xattr xcb xcomposite xetex xft xinerama xkb xml xmlpatterns xorg xosd xpm xrandr xtpax xv xvid xvmc xz zlib zsh-completion" ABI_X86="32 64" APACHE2_MODULES="authn_core authz_core socache_shmcb unixd actions alias auth_basic authn_alias authn_anon authn_dbm authn_default authn_file authz_dbm authz_default authz_groupfile authz_host authz_owner authz_user autoindex cache cgi cgid dav dav_fs dav_lock deflate dir disk_cache env expires ext_filter file_cache filter headers include info log_config logio mem_cache mime mime_magic negotiation rewrite setenvif speling status unique_id userdir usertrack vhost_alias" CALLIGRA_FEATURES="kexi words flow plan sheets stage tables krita karbon braindump author" COLLECTD_PLUGINS="df interface irq load memory rrdtool swap syslog" CPU_FLAGS_X86="mmx sse sse2 avx sse3 ssse3 sse4_1 aes avx mmxext popcnt sse3 sse4_1 sse4_2 ssse3" CURL_SSL="openssl" ELIBC="glibc" GPSD_PROTOCOLS="ashtech aivdm earthmate evermore fv18 garmin garmintxt gpsclock isync itrax mtk3301 nmea ntrip navcom oceanserver oldstyle oncore rtcm104v2 rtcm104v3 sirf skytraq superstar2 timing tsip tripmate tnt ublox ubx" GRUB_PLATFORMS="efi-64" INPUT_DEVICES="mouse keyboard evdev synaptics wacom" KERNEL="linux" L10N="en en-US en-GB eng" LCD_DEVICES="bayrad cfontz cfontz633 glk hd44780 lb216 lcdm001 mtxorb ncurses text" LIBREOFFICE_EXTENSIONS="presenter-console presenter-minimizer" LINGUAS="en gb us en_US en_GB eng jbo no nb nn no_NO nb_NO nn_NO nor" LLVM_TARGETS="BPF X86" OFFICE_IMPLEMENTATION="libreoffice" PHP_TARGETS="php5-3" POSTGRES_TARGETS="postgres9_5" PYTHON_SINGLE_TARGET="python3_4" PYTHON_TARGETS="python2_7 python3_4 python3_5 python3_6" QEMU_SOFTMMU_TARGETS="x86_64 i386" RUBY_TARGETS="ruby22" SANE_BACKENDS="plustek" USERLAND="GNU" VIDEO_CARDS="intel i965 ilo" XTABLES_ADDONS="quota2 psd pknock lscan length2 ipv4options ipset ipp2p iface geoip fuzzy condition tee tarpit sysrq steal rawnat logmark ipmark dhcpmac delude chaos account"
Unset:  CC, CPPFLAGS, CTARGET, CXX, INSTALL_MASK, LC_ALL, PORTAGE_BUNZIP2_COMMAND

occam ~ # emerge -pqv '=dev-python/pytest-shutil-1.2.11::gentoo'
[ebuild  N    ] dev-python/pytest-shutil-1.2.11  USE="{test}" PYTHON_TARGETS="python2_7 python3_4 python3_5 python3_6 -pypy -pypy3"