Gentoo Websites Logo
Go to: Gentoo Home Documentation Forums Lists Bugs Planet Store Wiki Get Gentoo!

Bug 60583

Summary: kdelibs-3.2.3-r1 faild to compile
Product: Gentoo Linux Reporter: Christian Fernandez <rek2>
Component: [OLD] KDEAssignee: Gentoo KDE team <kde>
Status: RESOLVED CANTFIX    
Severity: normal    
Priority: High    
Version: unspecified   
Hardware: x86   
OS: Linux   
Whiteboard:
Package list:
Runtime testing required: ---

Description Christian Fernandez 2004-08-16 12:50:43 UTC
../../kio/kio/kfilterbase.h:107: internal compiler error: in pop_binding, at
   cp/decl.c:1442
Please submit a full bug report,
with preprocessed source if appropriate.
See <URL:http://bugs.gentoo.org/> for instructions.
The bug is not reproducible, so it is likely a hardware or OS problem.
make[3]: *** [kbzip2filter.lo] Error 1
make[3]: Leaving directory `/var/tmp/portage/kdelibs-3.2.3-r1/work/kdelibs-3.2.3/kioslave/bzip2'
make[2]: *** [all-recursive] Error 1
make[2]: Leaving directory `/var/tmp/portage/kdelibs-3.2.3-r1/work/kdelibs-3.2.3/kioslave'
make[1]: *** [all-recursive] Error 1
make[1]: Leaving directory `/var/tmp/portage/kdelibs-3.2.3-r1/work/kdelibs-3.2.3'
make: *** [all] Error 2

!!! ERROR: kde-base/kdelibs-3.2.3-r1 failed.
!!! Function kde_src_compile, Line 130, Exitcode 2
!!! died running emake, kde_src_compile:make


Reproducible: Always
Steps to Reproduce:
1. emerge kde-base/kdelibs-3.2.3-r1
2.
3.
Comment 1 Caleb Tennis (RETIRED) gentoo-dev 2004-08-18 11:01:36 UTC
> The bug is not reproducible, so it is likely a hardware or OS problem.

a local compiler issue, can't fix it here.