Gentoo Websites Logo
Go to: Gentoo Home Documentation Forums Lists Bugs Planet Store Wiki Get Gentoo!

Bug 583490

Summary: sys-fs/e2fsprogs-1.43 fails tests
Product: Gentoo Linux Reporter: eroen <gentoo>
Component: [OLD] Core systemAssignee: Gentoo's Team for Core System packages <base-system>
Status: UNCONFIRMED ---    
Severity: normal CC: kingjon3377, O01eg
Priority: Normal Keywords: TESTFAILURE
Version: unspecified   
Hardware: All   
OS: Linux   
Whiteboard:
Package list:
Runtime testing required: ---
Bug Depends on: 689534    
Bug Blocks:    
Attachments: build.log

Description eroen 2016-05-19 10:04:17 UTC
Created attachment 434694 [details]
build.log

62 tests succeeded	265 tests failed
Tests failed: d_dumpe2fs_group_only d_fallocate d_fallocate_bigalloc d_fallocate_blkmap d_inline_dump d_loaddump d_punch d_punch_bigalloc d_special_files d_xattr_edits d_xattr_sorting f_16384_block f_8192_block f_bad_bbitmap f_bad_bmap_csum f_bad_disconnected_inode f_bad_gdt_csum f_bad_ibitmap f_bad_inode_csum f_bad_local_jnl f_badbblocks f_badcluster f_baddir f_baddir2 f_baddotdir f_badinode f_badjour_indblks f_badjourblks f_badorphan f_badprimary f_badroot f_badsymlinks f_badtable f_bb_in_bb f_bbfile f_bbinode f_big_sparse f_bitmaps f_clear_xattr f_cloneblock_alloc_error f_collapse_extent_tree f_compress_extent_tree_level f_convert_bmap f_convert_bmap_and_extent f_corrupt_dirent_tail f_crashdisk f_create_symlinks f_deleted_inode_bad_csum f_desc_size_128 f_desc_size_bad f_detect_junk f_detect_xfs f_dir_bad_csum f_dir_bad_mode f_dirlink f_dup f_dup2 f_dup3 f_dup4 f_dup_ba f_dup_de f_dup_de2 f_dup_resize f_dupdot f_dupfsblks f_dupsuper f_ea_bad_csum f_ea_checks f_ea_value_crash f_emptydir f_encrypted_lpf f_end-bitmap f_eofblocks f_expand f_expandroot_create_lnf f_ext_journal f_ext_zero_len f_extent_bad_node f_extent_htree f_extent_int_bad_csum f_extent_int_bad_extent f_extent_int_bad_magic f_extent_interior_start_lblk f_extent_leaf_bad_csum f_extent_leaf_bad_extent f_extent_leaf_bad_magic f_extent_oobounds f_extent_too_deep f_extents f_extents2 f_extra_journal f_fast_symlink_extents f_file_acl_high f_filetype f_first_meta_bg_too_big f_full_bg f_h_badnode f_h_badroot f_h_normal f_h_reindex f_h_unsigned f_holedir f_holedir2 f_holedir3 f_holedir4 f_htree_bad_csum f_htree_leaf_csum f_hugedir_blocks f_hurd f_idata_and_extents f_illbbitmap f_illibitmap f_illitable f_illitable_flexbg f_imagic f_imagic_fs f_ind_inode_collision f_inlinedata_dirblocks f_inlinedata_repair f_inlinedir_detector f_inode_ea_collision f_invalid_bad_inode f_invalid_extent_symlink f_jnl_32bit f_jnl_64bit f_jnl_errno f_jnl_etb_alloc_fail f_journal f_lotsbad f_lpf f_lpf2 f_lpffile f_messy_inode f_miss_blk_bmap f_miss_journal f_misstable f_mke2fs2b f_mmp_garbage f_no f_no_cache_corrupt_inode f_noroot f_nospc_create_lnf f_okgroup f_opt_extent f_opt_extent_ext3 f_orphan f_orphan_dotdot_ft f_orphan_extents_inode f_orphan_indirect_inode f_overfsblks f_preen f_quota f_readonly_fsck f_rebuild_csum_rootdir f_recnect_bad f_reconnect f_rehash_dir f_resize_inode f_salvage_dir f_selinux f_short_encrypted_dirent f_special_ea f_summary_counts f_toobig_extent_dir f_trunc_dirent_header f_uninit_cat f_uninit_dir f_uninit_ext_past_eof f_uninit_ext_past_eof2 f_uninit_last_uninit f_unsorted_EAs f_unused_itable f_valid_ea_in_inode f_write_ea_no_extra_isize f_write_ea_toobig_extra_isize f_write_ea_toosmall_extra_isize f_yes f_yesall f_yesthenall f_yesthenno f_zero_group f_zero_inode_size f_zero_super f_zero_xattr f_zeroed_ext_header i_bad_csum j_corrupt_commit_csum j_corrupt_commit_tid j_corrupt_descr_csum j_corrupt_descr_tid j_corrupt_ext_jnl_sb_block j_corrupt_ext_jnl_sb_csum j_corrupt_journal_block j_corrupt_revoke_block j_corrupt_revoke_csum j_corrupt_revoke_rcount j_corrupt_sb_csum j_corrupt_sb_magic j_ext_dumpe2fs j_ext_long_revoke_trans j_ext_long_trans j_long_revoke_trans j_long_revoke_trans_mcsum_32bit j_long_revoke_trans_mcsum_64bit j_long_trans j_long_trans_mcsum_32bit j_long_trans_mcsum_64bit j_short_revoke_trans j_short_revoke_trans_mcsum_64bit j_short_trans j_short_trans_64bit j_short_trans_mcsum_64bit j_short_trans_old_csum j_short_trans_open_recover j_short_trans_recover j_short_trans_recover_mcsum_64bit j_short_uncommitted_trans j_short_uncommitted_trans_mcsum_64bit m_64bit_flexbg m_bigjournal m_dasd_bs m_desc_size_128 m_extent_journal m_hugefile m_hugefile_slack m_large_file m_mcsum_extjournal m_meta_bg m_minrootdir m_mkfs_overhead m_mmp m_mmp_bad_csum m_mmp_bad_magic m_no_opt m_quota m_raid_opt m_root_owner m_rootdir m_std m_uninit r_32to64bit r_32to64bit_expand_full r_32to64bit_meta r_32to64bit_move_itable r_64to32bit r_64to32bit_meta r_expand_full r_fixup_lastbg r_fixup_lastbg_big r_inline_xattr r_min_itable r_move_itable r_resize_inode t_dangerous t_disable_mcsum t_disable_mcsum_noinitbg t_disable_mcsum_yesinitbg t_enable_mcsum t_enable_mcsum_ext3 t_enable_mcsum_initbg t_ext_jnl_fail t_iexpand_full t_iexpand_mcsum t_replay_and_set t_uninit_bg_rm 
Makefile:361: recipe for target 'test_post' failed
make[1]: *** [test_post] Error 1
make[1]: Leaving directory '/var/tmp/portage/sys-fs/e2fsprogs-1.43/work/e2fsprogs-1.43/tests'
Makefile:390: recipe for target 'check-recursive' failed
make: *** [check-recursive] Error 1
 * ERROR: sys-fs/e2fsprogs-1.43::gentoo failed (test phase):
 *   Make check failed. See above for details.
 * 
 * Call stack:
 *            ebuild.sh, line  133:  Called src_test
 *          environment, line 2275:  Called default
 *   phase-functions.sh, line  805:  Called default_src_test
 *   phase-functions.sh, line  834:  Called __eapi0_src_test
 *     phase-helpers.sh, line  760:  Called die
 * The specific snippet of code:
 *   		$emake_cmd ${internal_opts} check || \
 *   			die "Make check failed. See above for details."
Comment 1 eroen 2016-05-19 10:04:54 UTC
localhost ~ # emerge --info '=sys-fs/e2fsprogs-1.43::gentoo'
Portage 2.2.28 (python 2.7.10-final-0, default/linux/amd64/13.0, gcc-4.9.3, glibc-2.22-r4, 4.4.6-gentoo x86_64)
=================================================================
                         System Settings
=================================================================
System uname: Linux-4.4.6-gentoo-x86_64-Intel-R-_Core-TM-_i5-2520M_CPU_@_2.50GHz-with-gentoo-2.2
KiB Mem:     4043356 total,   3723588 free
KiB Swap:          0 total,         0 free
Timestamp of repository gentoo: Thu, 19 May 2016 00:45:01 +0000
sh bash 4.3_p42-r1
ld GNU ld (Gentoo 2.25.1 p1.1) 2.25.1
app-shells/bash:          4.3_p42-r1::gentoo
dev-lang/perl:            5.20.2::gentoo
dev-lang/python:          2.7.10-r1::gentoo, 3.4.3-r1::gentoo
dev-util/pkgconfig:       0.28-r2::gentoo
sys-apps/baselayout:      2.2::gentoo
sys-apps/openrc:          0.19.1::gentoo
sys-apps/sandbox:         2.10-r1::gentoo
sys-devel/autoconf:       2.69::gentoo
sys-devel/automake:       1.14.1::gentoo, 1.15::gentoo
sys-devel/binutils:       2.25.1-r1::gentoo
sys-devel/gcc:            4.9.3::gentoo
sys-devel/gcc-config:     1.7.3::gentoo
sys-devel/libtool:        2.4.6::gentoo
sys-devel/make:           4.1-r1::gentoo
sys-kernel/linux-headers: 4.3::gentoo (virtual/os-headers)
sys-libs/glibc:           2.22-r4::gentoo
Repositories:

gentoo
    location: /usr/portage
    sync-type: rsync
    sync-uri: rsync://rsync.gentoo.org/gentoo-portage
    priority: -1000

ACCEPT_KEYWORDS="amd64"
ACCEPT_LICENSE="* -@EULA"
CBUILD="x86_64-pc-linux-gnu"
CFLAGS="-O2 -pipe"
CHOST="x86_64-pc-linux-gnu"
CONFIG_PROTECT="/etc"
CONFIG_PROTECT_MASK="/etc/ca-certificates.conf /etc/env.d /etc/gconf /etc/gentoo-release /etc/sandbox.d /etc/terminfo"
CXXFLAGS="-O2 -pipe"
DISTDIR="/usr/portage/distfiles"
FCFLAGS="-O2 -pipe"
FEATURES="assume-digests binpkg-logs config-protect-if-modified distlocks ebuild-locks fixlafiles merge-sync news parallel-fetch preserve-libs protect-owned sandbox sfperms strict unknown-features-warn unmerge-logs unmerge-orphans userfetch userpriv usersandbox usersync xattr"
FFLAGS="-O2 -pipe"
GENTOO_MIRRORS="http://distfiles.gentoo.org"
LDFLAGS="-Wl,-O1 -Wl,--as-needed"
PKGDIR="/usr/portage/packages"
PORTAGE_CONFIGROOT="/"
PORTAGE_RSYNC_OPTS="--recursive --links --safe-links --perms --times --omit-dir-times --compress --force --whole-file --delete --stats --human-readable --timeout=180 --exclude=/distfiles --exclude=/local --exclude=/packages --exclude=/.git"
PORTAGE_TMPDIR="/var/tmp"
USE="acl amd64 berkdb bindist bzip2 cli cracklib crypt cxx dri fortran gdbm iconv ipv6 mmx mmxext modules multilib ncurses nls nptl openmp pam pcre readline seccomp session sse sse2 ssl tcpd unicode xattr zlib" ABI_X86="64" ALSA_CARDS="ali5451 als4000 atiixp atiixp-modem bt87x ca0106 cmipci emu10k1x ens1370 ens1371 es1938 es1968 fm801 hda-intel intel8x0 intel8x0m maestro3 trident usb-audio via82xx via82xx-modem ymfpci" APACHE2_MODULES="authn_core authz_core socache_shmcb unixd actions alias auth_basic authn_alias authn_anon authn_dbm authn_default authn_file authz_dbm authz_default authz_groupfile authz_host authz_owner authz_user autoindex cache cgi cgid dav dav_fs dav_lock deflate dir disk_cache env expires ext_filter file_cache filter headers include info log_config logio mem_cache mime mime_magic negotiation rewrite setenvif speling status unique_id userdir usertrack vhost_alias" CALLIGRA_FEATURES="kexi words flow plan sheets stage tables krita karbon braindump author" CAMERAS="ptp2" COLLECTD_PLUGINS="df interface irq load memory rrdtool swap syslog" CPU_FLAGS_X86="mmx mmxext sse sse2" ELIBC="glibc" GPSD_PROTOCOLS="ashtech aivdm earthmate evermore fv18 garmin garmintxt gpsclock itrax mtk3301 nmea ntrip navcom oceanserver oldstyle oncore rtcm104v2 rtcm104v3 sirf superstar2 timing tsip tripmate tnt ublox ubx" INPUT_DEVICES="keyboard mouse evdev" KERNEL="linux" LCD_DEVICES="bayrad cfontz cfontz633 glk hd44780 lb216 lcdm001 mtxorb ncurses text" LIBREOFFICE_EXTENSIONS="presenter-console presenter-minimizer" OFFICE_IMPLEMENTATION="libreoffice" PHP_TARGETS="php5-5" PYTHON_SINGLE_TARGET="python2_7" PYTHON_TARGETS="python2_7 python3_4" RUBY_TARGETS="ruby20 ruby21" USERLAND="GNU" VIDEO_CARDS="amdgpu fbdev intel nouveau radeon radeonsi vesa dummy v4l" XTABLES_ADDONS="quota2 psd pknock lscan length2 ipv4options ipset ipp2p iface geoip fuzzy condition tee tarpit sysrq steal rawnat logmark ipmark dhcpmac delude chaos account"
Unset:  CC, CPPFLAGS, CTARGET, CXX, EMERGE_DEFAULT_OPTS, INSTALL_MASK, LANG, LC_ALL, MAKEOPTS, PORTAGE_BUNZIP2_COMMAND, PORTAGE_COMPRESS, PORTAGE_COMPRESS_FLAGS, PORTAGE_RSYNC_EXTRA_OPTS, USE_PYTHON

=================================================================
                        Package Settings
=================================================================

sys-fs/e2fsprogs-1.43::gentoo was built with the following:
USE="nls -static-libs" ABI_X86="64"

localhost ~ # emerge -pqv '=sys-fs/e2fsprogs-1.43::gentoo'
[ebuild   R   ] sys-fs/e2fsprogs-1.43  USE="nls -static-libs" 

 * IMPORTANT: 9 news items need reading for repository 'gentoo'.
 * Use eselect news read to view new items.
Comment 2 Coacher 2016-05-19 11:13:11 UTC
eroen, there are a couple of `Makefile:356: recipe for target 'docs' failed' errors in your build.log. They may be worth a separate bugreport.
Comment 3 eroen 2016-05-19 12:49:05 UTC
(In reply to Coacher from comment #2)
> eroen, there are a couple of `Makefile:356: recipe for target 'docs' failed'
> errors in your build.log. They may be worth a separate bugreport.

Good catch, I did not sport that. However, it is apparently intentional. The Makefile[1] has:

    docs:
        -@test -d doc && cd doc && $(MAKE) libext2fs.info

which aborts non-fatally if the `doc` folder is not present. The ebuild[2] removes this `doc` folder in src_prepare().

1: http://git.kernel.org/cgit/fs/ext2/e2fsprogs.git/tree/Makefile.in#n49
2: https://gitweb.gentoo.org/repo/gentoo.git/tree/sys-fs/e2fsprogs/e2fsprogs-1.43.ebuild#n45