Gentoo Websites Logo
Go to: Gentoo Home Documentation Forums Lists Bugs Planet Store Wiki Get Gentoo!

Bug 533002

Summary: dev-python/networkx-1.9.1 fails tests
Product: Gentoo Linux Reporter: Patrick Lauer <patrick>
Component: [OLD] UnspecifiedAssignee: Python Gentoo Team <python>
Status: UNCONFIRMED ---    
Severity: normal    
Priority: Normal    
Version: unspecified   
Hardware: All   
OS: Linux   
Whiteboard:
Package list:
Runtime testing required: ---

Description Patrick Lauer gentoo-dev 2014-12-19 07:55:13 UTC
======================================================================
ERROR: test_shp.TestShp.test_attributeexport
----------------------------------------------------------------------
Traceback (most recent call last):
  File "/usr/lib64/python3.3/site-packages/nose/case.py", line 198, in runTest
    self.test(*self.arg)
  File "/var/tmp/portage/dev-python/networkx-1.9.1/work/networkx-1.9.1/networkx/readwrite/tests/test_shp.py", line 112, in test_attributeexport
    G = nx.read_shp(self.shppath)
  File "/var/tmp/portage/dev-python/networkx-1.9.1/work/networkx-1.9.1/networkx/readwrite/nx_shp.py", line 83, in read_shp
    for lyrindex in xrange(lyrcount):
NameError: global name 'xrange' is not defined

======================================================================
ERROR: test_shp.TestShp.test_geometryexport
----------------------------------------------------------------------
Traceback (most recent call last):
  File "/usr/lib64/python3.3/site-packages/nose/case.py", line 198, in runTest
    self.test(*self.arg)
  File "/var/tmp/portage/dev-python/networkx-1.9.1/work/networkx-1.9.1/networkx/readwrite/tests/test_shp.py", line 92, in test_geometryexport
    G = nx.read_shp(self.shppath)
  File "/var/tmp/portage/dev-python/networkx-1.9.1/work/networkx-1.9.1/networkx/readwrite/nx_shp.py", line 83, in read_shp
    for lyrindex in xrange(lyrcount):
NameError: global name 'xrange' is not defined

======================================================================
ERROR: test_shp.TestShp.testload
----------------------------------------------------------------------
Traceback (most recent call last):
  File "/usr/lib64/python3.3/site-packages/nose/case.py", line 198, in runTest
    self.test(*self.arg)
  File "/var/tmp/portage/dev-python/networkx-1.9.1/work/networkx-1.9.1/networkx/readwrite/tests/test_shp.py", line 64, in testload
    G = nx.read_shp(self.shppath)
  File "/var/tmp/portage/dev-python/networkx-1.9.1/work/networkx-1.9.1/networkx/readwrite/nx_shp.py", line 83, in read_shp
    for lyrindex in xrange(lyrcount):
NameError: global name 'xrange' is not defined

======================================================================
FAIL: test_shp.TestShp.test_wkt_export
----------------------------------------------------------------------
Traceback (most recent call last):
  File "/usr/lib64/python3.3/site-packages/nose/case.py", line 198, in runTest
    self.test(*self.arg)
  File "/var/tmp/portage/dev-python/networkx-1.9.1/work/networkx-1.9.1/networkx/readwrite/tests/test_shp.py", line 134, in test_wkt_export
    assert False, e
nose.proxy.AssertionError: 'dict' object has no attribute 'iteritems'
>>  assert False, e
    

----------------------------------------------------------------------
Ran 2101 tests in 29.652s

FAILED (SKIP=4, errors=3, failures=1)
 * ERROR: dev-python/networkx-1.9.1::gentoo failed (test phase):
 *   (no error message)
 * 
Portage 2.2.15 (python 2.7.9-final-0, default/linux/amd64/13.0/desktop/kde, gcc-4.9.2, glibc-2.20, 3.18.0-gentoo x86_64)
=================================================================
System uname: Linux-3.18.0-gentoo-x86_64-AMD_Phenom-tm-_II_X4_965_Processor-with-gentoo-2.2
KiB Mem:     7919228 total,   1268608 free
KiB Swap:   16777208 total,  16673408 free
Timestamp of tree: Unknown
sh bash 4.3_p30-r1
ld GNU ld (Gentoo 2.24 p1.4) 2.24
app-shells/bash:          4.3_p30-r1
dev-lang/perl:            5.20.1-r3
dev-lang/python:          2.7.9, 3.3.5-r1, 3.4.2
dev-util/cmake:           3.0.2
dev-util/pkgconfig:       0.28-r2
sys-apps/baselayout:      2.2
sys-apps/openrc:          0.13.6
sys-apps/sandbox:         2.6-r1
sys-devel/autoconf:       2.69
sys-devel/automake:       1.14.1
sys-devel/binutils:       2.24-r3
sys-devel/gcc:            4.9.2
sys-devel/gcc-config:     1.8
sys-devel/libtool:        2.4.4
sys-devel/make:           4.1-r1
sys-kernel/linux-headers: 3.17-r1 (virtual/os-headers)
sys-libs/glibc:           2.20
Repositories: gentoo x-overlay
ACCEPT_KEYWORDS="amd64 ~amd64"
ACCEPT_LICENSE="*"
CBUILD="x86_64-pc-linux-gnu"
CFLAGS="-O2 -pipe"
CHOST="x86_64-pc-linux-gnu"
CONFIG_PROTECT="/etc /usr/share/config /usr/share/gnupg/qualified.txt /usr/share/themes/oxygen-gtk/gtk-2.0 /var/lib/hsqldb"
CONFIG_PROTECT_MASK="/etc/ca-certificates.conf /etc/dconf /etc/env.d /etc/fonts/fonts.conf /etc/gconf /etc/gentoo-release /etc/revdep-rebuild /etc/sandbox.d /etc/terminfo /etc/texmf/language.dat.d /etc/texmf/language.def.d /etc/texmf/updmap.d /etc/texmf/web2c"
CXXFLAGS="-O2 -pipe"
DISTDIR="/usr/portage/distfiles"
FCFLAGS="-O2 -pipe"
FEATURES="assume-digests binpkg-logs buildpkg config-protect-if-modified distlocks ebuild-locks fixlafiles merge-sync news parallel-fetch preserve-libs protect-owned sandbox sfperms split-elog strict test unknown-features-warn unmerge-logs unmerge-orphans userfetch userpriv usersandbox usersync"
FFLAGS="-O2 -pipe"
GENTOO_MIRRORS="http://mirrors.sohu.com/gentoo/"
LANG="en_US.utf8"
LDFLAGS="-Wl,-O1 -Wl,--as-needed"
MAKEOPTS="-j4"
PKGDIR="/usr/portage/packages"
PORTAGE_CONFIGROOT="/"
PORTAGE_RSYNC_OPTS="--recursive --links --safe-links --perms --times --omit-dir-times --compress --force --whole-file --delete --stats --human-readable --timeout=180 --exclude=/distfiles --exclude=/local --exclude=/packages"
PORTAGE_TMPDIR="/var/tmp"
PORTDIR="/usr/portage"
PORTDIR_OVERLAY="/overlay"
USE="X a52 aac acl acpi alsa amd64 berkdb bluetooth branding bzip2 cairo cdda cdr cli consolekit cracklib crypt cups cxx dbus declarative dri dts dvd dvdr egl emboss encode exif fam firefox flac fortran gdbm gif glamor gpm gtk iconv ipv6 jpeg kde kipi lcms ldap libnotify mad mmx mng modules mp3 mp4 mpeg multilib ncurses nls nptl ogg opengl openmp openvg pam pango pcre pdf phonon plasma png policykit ppds python qt3support qt4 readline sdl semantic-desktop session spell sqlite sse sse2 ssl startup-notification svg tcl tcpd tiff truetype udev udisks unicode upower usb vorbis wxwidgets x264 xa xcb xcomposite xinerama xml xscreensaver xv xvfb xvid zlib" ABI_X86="64" ALSA_CARDS="ali5451 als4000 atiixp atiixp-modem bt87x ca0106 cmipci emu10k1x ens1370 ens1371 es1938 es1968 fm801 hda-intel intel8x0 intel8x0m maestro3 trident usb-audio via82xx via82xx-modem ymfpci" APACHE2_MODULES="authn_core authz_core socache_shmcb unixd actions alias auth_basic authn_alias authn_anon authn_dbm authn_default authn_file authz_dbm authz_default authz_groupfile authz_host authz_owner authz_user autoindex cache cgi cgid dav dav_fs dav_lock deflate dir disk_cache env expires ext_filter file_cache filter headers include info log_config logio mem_cache mime mime_magic negotiation rewrite setenvif speling status unique_id userdir usertrack vhost_alias" CALLIGRA_FEATURES="kexi words flow plan sheets stage tables krita karbon braindump author" CAMERAS="ptp2" COLLECTD_PLUGINS="df interface irq load memory rrdtool swap syslog" ELIBC="glibc" GPSD_PROTOCOLS="ashtech aivdm earthmate evermore fv18 garmin garmintxt gpsclock itrax mtk3301 nmea ntrip navcom oceanserver oldstyle oncore rtcm104v2 rtcm104v3 sirf superstar2 timing tsip tripmate tnt ublox ubx" INPUT_DEVICES="keyboard mouse evdev" KERNEL="linux" LCD_DEVICES="bayrad cfontz cfontz633 glk hd44780 lb216 lcdm001 mtxorb ncurses text" LIBREOFFICE_EXTENSIONS="presenter-console presenter-minimizer" OFFICE_IMPLEMENTATION="libreoffice" PHP_TARGETS="php5-5" PYTHON_SINGLE_TARGET="python2_7" PYTHON_TARGETS="python2_7 python3_3 python3_4" RUBY_TARGETS="ruby21" USERLAND="GNU" VIDEO_CARDS="vesa" XTABLES_ADDONS="quota2 psd pknock lscan length2 ipv4options ipset ipp2p iface geoip fuzzy condition tee tarpit sysrq steal rawnat logmark ipmark dhcpmac delude chaos account"
Unset:  CPPFLAGS, CTARGET, EMERGE_DEFAULT_OPTS, INSTALL_MASK, LC_ALL, PORTAGE_BUNZIP2_COMMAND, PORTAGE_COMPRESS, PORTAGE_COMPRESS_FLAGS, PORTAGE_RSYNC_EXTRA_OPTS, SYNC, USE_PYTHON
Comment 1 Ian Delaney (RETIRED) gentoo-dev 2014-12-19 22:44:14 UTC
 ~/cvsPortage/gentoo-x86/dev-python/networkx $ ebuild networkx-1.9.1.ebuild clean test

Ran 2096 tests in 38.206s

OK (SKIP=6)


Ran 2096 tests in 34.999s

OK (SKIP=6)

Ran 2096 tests in 41.212s

OK (SKIP=6)
>>> Completed testing dev-python/networkx-1.9.1


just like when I bumped it
Comment 2 Ian Delaney (RETIRED) gentoo-dev 2014-12-20 00:08:45 UTC
right; as observed by floppym the tallies vary between our runs. The source of these failures is networkx/readwrite/tests/test_shp.py, appears an optional extra.

Patrick clearly has this emerged and this is what happens when it is.  In my case it was skipped. I get a series of

SKIP: OGR not available
SKIP: ogr not available.
in my build.log.

While upstream ought know about their trouble with an optional dep in the testsuite, from out perspective it's optional, it's not in the ebuild and the testsuite passes without it!!!  This makes this ebuild .... what exactly??