Gentoo Websites Logo
Go to: Gentoo Home Documentation Forums Lists Bugs Planet Store Wiki Get Gentoo!

Bug 499820

Summary: =dev-libs/glib-2.38.2 fails test spawn-singlethread with GLib-FATAL-WARNING: In call to g_spawn_sync(), exit status of a child process was requested but ECHILD was received by waitpid().
Product: Gentoo Linux Reporter: eroen <gentoo>
Component: [OLD] DevelopmentAssignee: Gentoo Linux Gnome Desktop Team <gnome>
Status: RESOLVED TEST-REQUEST    
Severity: normal CC: emeric.maschino, guillaume.horel
Priority: Normal Keywords: TESTFAILURE
Version: unspecified   
Hardware: All   
OS: Linux   
Whiteboard:
Package list:
Runtime testing required: ---
Bug Depends on:    
Bug Blocks: 486484    
Attachments: build.log.xz
test-suite.log

Description eroen 2014-01-30 18:43:50 UTC
[...]
FAIL: spawn-singlethread
[...]
make[8]: Entering directory '/var/tmp/portage/dev-libs/glib-2.38.2/work/glib-2.38.2-x86/glib/tests'
make  all-am
make[9]: Entering directory '/var/tmp/portage/dev-libs/glib-2.38.2/work/glib-2.38.2-x86/glib/tests'
make[9]: Nothing to be done for 'all-am'.
make[9]: Leaving directory '/var/tmp/portage/dev-libs/glib-2.38.2/work/glib-2.38.2-x86/glib/tests'
make[8]: Leaving directory '/var/tmp/portage/dev-libs/glib-2.38.2/work/glib-2.38.2-x86/glib/tests'
============================================================================
Testsuite summary for glib 2.38.2
============================================================================
# TOTAL: 77
# PASS:  76
# SKIP:  0
# XFAIL: 0
# FAIL:  1
# XPASS: 0
# ERROR: 0
============================================================================
See glib/tests/test-suite.log
Please report to http://bugzilla.gnome.org/enter_bug.cgi?product=glib
============================================================================
Makefile:2019: recipe for target 'test-suite.log' failed
make[7]: *** [test-suite.log] Error 1
make[7]: Leaving directory '/var/tmp/portage/dev-libs/glib-2.38.2/work/glib-2.38.2-x86/glib/tests'
Makefile:2125: recipe for target 'check-TESTS' failed
make[6]: *** [check-TESTS] Error 2
make[6]: Leaving directory '/var/tmp/portage/dev-libs/glib-2.38.2/work/glib-2.38.2-x86/glib/tests'
Makefile:2730: recipe for target 'check-am' failed
make[5]: *** [check-am] Error 2
make[5]: Leaving directory '/var/tmp/portage/dev-libs/glib-2.38.2/work/glib-2.38.2-x86/glib/tests'
Makefile:2734: recipe for target 'check' failed
make[4]: *** [check] Error 2
make[4]: Leaving directory '/var/tmp/portage/dev-libs/glib-2.38.2/work/glib-2.38.2-x86/glib/tests'
Makefile:2434: recipe for target 'check-recursive' failed
make[3]: *** [check-recursive] Error 1
make[3]: Leaving directory '/var/tmp/portage/dev-libs/glib-2.38.2/work/glib-2.38.2-x86/glib'
Makefile:2745: recipe for target 'check' failed
make[2]: *** [check] Error 2
make[2]: Leaving directory '/var/tmp/portage/dev-libs/glib-2.38.2/work/glib-2.38.2-x86/glib'
Makefile:1198: recipe for target 'check-recursive' failed
make[1]: *** [check-recursive] Error 1
make[1]: Leaving directory '/var/tmp/portage/dev-libs/glib-2.38.2/work/glib-2.38.2-x86'
Makefile:1655: recipe for target 'check' failed
make: *** [check] Error 2
 * __helpers_die: WARNING: emake failed
 * ERROR: dev-libs/glib-2.38.2::gentoo failed (test phase):
 *   virtualmake: the emake failed.
 * 
 * Call stack:
 *     ebuild.sh, line   93:  Called src_test
 *   environment, line 5650:  Called multilib-minimal_src_test
 *   environment, line 4189:  Called multilib_foreach_abi 'multilib-minimal_abi_src_test'
 *   environment, line 4351:  Called multibuild_foreach_variant '_multilib_multibuild_wrapper' 'multilib-minimal_abi_src_test'
 *   environment, line 3963:  Called _multibuild_run '_multilib_multibuild_wrapper' 'multilib-minimal_abi_src_test'
 *   environment, line 3961:  Called _multilib_multibuild_wrapper 'multilib-minimal_abi_src_test'
 *   environment, line  697:  Called multilib-minimal_abi_src_test
 *   environment, line 4183:  Called multilib_src_test
 *   environment, line 4544:  Called Xemake 'check'
 *   environment, line  407:  Called virtualmake 'check'
 *   environment, line 6497:  Called die
 * The specific snippet of code:
 *       [[ ${retval} -ne 0 ]] && die "${FUNCNAME}: the ${VIRTUALX_COMMAND} failed.";



eroen@falcon ~ $ emerge --info '=dev-libs/glib-2.38.2::gentoo'
Portage 2.2.8-r1 (default/linux/amd64/13.0, gcc-4.8.2, glibc-2.18-r1, 3.12.5e0-falcon0+ x86_64)
=================================================================
                         System Settings
=================================================================
System uname: Linux-3.12.5e0-falcon0+-x86_64-Intel-R-_Core-TM-2_Quad_CPU_@_2.40GHz-with-gentoo-2.2
KiB Mem:     4037884 total,    342232 free
KiB Swap:    8388604 total,   6402904 free
Timestamp of tree: Thu, 30 Jan 2014 12:45:01 +0000
ld GNU ld (GNU Binutils) 2.24
distcc 3.1 x86_64-pc-linux-gnu [disabled]
ccache version 3.1.9 [disabled]
app-shells/bash:          4.2_p45-r1
dev-java/java-config:     2.2.0
dev-lang/python:          2.7.6, 3.2.5-r3, 3.3.3
dev-util/ccache:          3.1.9-r3
dev-util/cmake:           2.8.12.2
dev-util/pkgconfig:       0.28
sys-apps/baselayout:      2.2
sys-apps/openrc:          0.12.4
sys-apps/sandbox:         2.6-r1
sys-devel/autoconf:       2.13, 2.69
sys-devel/automake:       1.9.6-r3, 1.11.6, 1.12.6, 1.13.4, 1.14.1
sys-devel/binutils:       2.24-r2
sys-devel/gcc:            4.5.4, 4.6.4, 4.7.3-r1, 4.8.2
sys-devel/gcc-config:     1.8
sys-devel/libtool:        2.4.2
sys-devel/make:           4.0-r1
sys-kernel/linux-headers: 3.13 (virtual/os-headers)
sys-libs/glibc:           2.18-r1
Repositories: gentoo gamerlay eroen
ACCEPT_KEYWORDS="amd64 ~amd64 ~x86"
ACCEPT_LICENSE="*"
CBUILD="x86_64-pc-linux-gnu"
CFLAGS="-march=core2 -O2 -pipe"
CHOST="x86_64-pc-linux-gnu"
CONFIG_PROTECT="/etc /usr/share/config /usr/share/gnupg/qualified.txt /usr/share/themes/oxygen-gtk/gtk-2.0"
CONFIG_PROTECT_MASK="/etc/ca-certificates.conf /etc/dconf /etc/env.d /etc/fonts/fonts.conf /etc/gconf /etc/gentoo-release /etc/revdep-rebuild /etc/sandbox.d /etc/terminfo /etc/texmf/language.dat.d /etc/texmf/language.def.d /etc/texmf/updmap.d /etc/texmf/web2c"
CXXFLAGS="-march=core2 -O2 -pipe"
DISTDIR="/var/distfiles"
EMERGE_DEFAULT_OPTS="--jobs 3 --nospinner --quiet-build --verbose-conflicts --with-bdeps=y --binpkg-respect-use y"
FCFLAGS="-O2 -pipe"
FEATURES="assume-digests binpkg-logs config-protect-if-modified distlocks ebuild-locks fixlafiles merge-sync news parallel-fetch preserve-libs protect-owned sandbox sfperms strict unknown-features-warn unmerge-logs unmerge-orphans userfetch userpriv usersandbox usersync xattr"
FFLAGS="-O2 -pipe"
GENTOO_MIRRORS="/var/temdist/ /var/distfiles-occam/ http://mirrors.eu.kernel.org/gentoo/ http://mirrors.kernel.org/gentoo/ http://distfiles.gentoo.org http://www.ibiblio.org/pub/Linux/distributions/gentoo"
LANG="en_GB.UTF-8"
LDFLAGS="-Wl,-O1 -Wl,--as-needed"
MAKEOPTS="-j4"
PKGDIR="/var/packages"
PORTAGE_CONFIGROOT="/"
PORTAGE_RSYNC_OPTS="--recursive --links --safe-links --perms --times --omit-dir-times --compress --force --whole-file --delete --stats --human-readable --timeout=180 --exclude=/distfiles --exclude=/local --exclude=/packages"
PORTAGE_TMPDIR="/var/tmp"
PORTDIR="/usr/portage"
PORTDIR_OVERLAY="/var/lib/layman/gamerlay /var/lib/layman/eroen"
SYNC="rsync://mirrors.eu.kernel.org/gentoo-portage/"
USE="X a52 aac aacs accessibility acl adns alsa amd64 ao berkdb bluray bs2b bzip2 cairo calendar canberra caps cdda cdio cdparanoia cdr cli corefonts cracklib crypt css cue cups curl cxx dbus dia dirac djvu dmapi dri dts dvd dvdnav dvi ebook eigen exif faac fam fbcondecor ffmpeg fftw fits flac fontconfig fortran fuse g3dvl gcrypt gd gdbm gif gimp git gmp gnutls gold gstreamer hdri highlight iconv icu id3tag idn imagemagick inotify iptc ipv6 jpeg jpeg2k kde kvm lcms lensfun libnotify loop-aes lqr lzma lzo mad man matroska midi mikmod mkv mms mmx mmxext mng mod modplug modules mp3 mp4 mpeg mpeg2 mpeg4 mpeg4pt2 mplayer mtp multilib musepack ncurses netlink nfs nls nouveau nptl ocr offensive ogg openal opencl openexr opengl opengtl openmp openvg optimization osmesa pam pango pcre pdf png pnm portaudio postscript qalculate qemu qt3support qt4 rar raw rdesktop readline real rtmp samba scanner schroedinger security session smp sndfile socks5 speex spice sse sse2 sse3 ssl ssse3 strong-optimization svg tbb tcpd theora threads tiff timidity tls truetype udev uml unicode usb usbredir v4l v4l2 vdpau virtualbox vnc vorbis wacom wavpack webp wmf x264 xattr xcb xcomposite xetex xfs xft xine xinerama xorg xps xrandr xv xvid xvmc zlib" ABI_X86="32 64" ALSA_CARDS="ali5451 als4000 atiixp atiixp-modem bt87x ca0106 cmipci emu10k1x ens1370 ens1371 es1938 es1968 fm801 hda-intel intel8x0 intel8x0m maestro3 trident usb-audio via82xx via82xx-modem ymfpci" APACHE2_MODULES="authn_core authz_core socache_shmcb unixd actions alias auth_basic authn_alias authn_anon authn_dbm authn_default authn_file authz_dbm authz_default authz_groupfile authz_host authz_owner authz_user autoindex cache cgi cgid dav dav_fs dav_lock deflate dir disk_cache env expires ext_filter file_cache filter headers include info log_config logio mem_cache mime mime_magic negotiation rewrite setenvif speling status unique_id userdir usertrack vhost_alias" CALLIGRA_FEATURES="kexi words flow plan sheets stage tables krita karbon braindump author" CAMERAS="ptp2" COLLECTD_PLUGINS="df interface irq load memory rrdtool swap syslog" CURL_SSL="openssl" DRACUT_MODULES="biosdevname caps crypt crypt-gpg dash dmraid lvm mdraid syslog" ELIBC="glibc" GPSD_PROTOCOLS="ashtech aivdm earthmate evermore fv18 garmin garmintxt gpsclock itrax mtk3301 nmea ntrip navcom oceanserver oldstyle oncore rtcm104v2 rtcm104v3 sirf superstar2 timing tsip tripmate tnt ublox ubx" GRUB_PLATFORMS="efi-64 pc qemu" INPUT_DEVICES="evdev keyboard mouse synaptics wacom" KERNEL="linux" LCD_DEVICES="bayrad cfontz cfontz633 glk hd44780 lb216 lcdm001 mtxorb ncurses text" LIBREOFFICE_EXTENSIONS="nlpsolver presenter-console presenter-minimizer" LINGUAS="en en_US en_GB nb no nb_NO" OFFICE_IMPLEMENTATION="libreoffice" PHP_TARGETS="php5-5" PYTHON_SINGLE_TARGET="python2_7" PYTHON_TARGETS="python2_7 python3_2 python3_3" RUBY_TARGETS="ruby20" SANE_BACKENDS="net plustek pnm" USERLAND="GNU" VIDEO_CARDS="nouveau nvidia vesa" XFCE_PLUGINS="menu" XTABLES_ADDONS="quota2 psd pknock lscan length2 ipv4options ipset ipp2p iface geoip fuzzy condition tee tarpit sysrq steal rawnat logmark ipmark dhcpmac delude chaos account"
USE_PYTHON="2.7 3.2 3.3"
Unset:  CPPFLAGS, CTARGET, INSTALL_MASK, LC_ALL, PORTAGE_BUNZIP2_COMMAND, PORTAGE_COMPRESS, PORTAGE_COMPRESS_FLAGS, PORTAGE_RSYNC_EXTRA_OPTS

=================================================================
                        Package Settings
=================================================================

dev-libs/glib-2.38.2 was built with the following:
USE="xattr -debug (-fam) (-selinux) -static-libs -systemtap -test -utils" ABI_X86="32 64 -x32" PYTHON_TARGETS="python2_7 -python2_6"
CFLAGS="-march=core2 -O2 -pipe -Wno-format-nonliteral"
CXXFLAGS="-march=core2 -O2 -pipe -Wno-format-nonliteral"

eroen@falcon ~ $ emerge -pqv '=dev-libs/glib-2.38.2::gentoo'
[ebuild   R   ] dev-libs/glib-2.38.2  USE="xattr -debug (-fam) (-selinux) -static-libs -systemtap {-test} -utils" ABI_X86="32 (64) (-x32)" PYTHON_TARGETS="python2_7 -python2_6"
Comment 1 eroen 2014-01-30 18:46:04 UTC
Created attachment 369148 [details]
build.log.xz
Comment 2 eroen 2014-01-30 18:46:59 UTC
Created attachment 369150 [details]
test-suite.log

[...]
FAIL: spawn-singlethread
========================

# random seed: R02Sc110c06bfb6edbcbca1b36f570e81dfa
# Start of gthread tests
ok 1 /gthread/spawn-single-sync
ok 2 /gthread/spawn-single-async
# GLib-FATAL-WARNING: In call to g_spawn_sync(), exit status of a child process was requested but ECHILD was received by waitpid(). Most likely the process is ignoring SIGCHLD, or some other thread is invoking waitpid() with a nonpositive first argument; either behavior can break applications that use g_spawn_sync either directly or indirectly.

(/var/tmp/portage/dev-libs/glib-2.38.2/work/glib-2.38.2-x86/glib/tests/.libs/spawn-singlethread:771754): GLib-WARNING **: In call to g_spawn_sync(), exit status of a child process was requested but ECHILD was received by waitpid(). Most likely the process is ignoring SIGCHLD, or some other thread is invoking waitpid() with a nonpositive first argument; either behavior can break applications that use g_spawn_sync either directly or indirectly.
/var/tmp/portage/dev-libs/glib-2.38.2/work/glib-2.38.2/tap-test: line 5: 771754 Trace/breakpoint trap   $1 -k --tap
Comment 3 Pacho Ramos gentoo-dev 2014-02-09 09:54:43 UTC
Please report this failure to upstream and paste the link here to let us track the issue:
bugzilla.gnome.org
Comment 4 Émeric Maschino 2014-03-13 20:08:38 UTC
Exact same failure here on ia64.

     Émeric
Comment 5 Pacho Ramos gentoo-dev 2014-09-28 12:55:23 UTC
(In reply to Pacho Ramos from comment #3)
> Please report this failure to upstream and paste the link here to let us
> track the issue:
> bugzilla.gnome.org

please also check with 2.40.2