Gentoo Websites Logo
Go to: Gentoo Home Documentation Forums Lists Bugs Planet Store Wiki Get Gentoo!

Bug 430126

Summary: dev-libs/libmemcached-1.0.4 fails tests
Product: Gentoo Linux Reporter: Patrick Lauer <patrick>
Component: Current packagesAssignee: Robin Johnson <robbat2>
Status: CONFIRMED ---    
Severity: normal CC: prometheanfire
Priority: Normal Keywords: TESTFAILURE
Version: unspecified   
Hardware: All   
OS: Linux   
See Also:
Package list:
Runtime testing required: ---

Description Patrick Lauer gentoo-dev 2012-08-06 04:46:20 UTC
Collection: allocation
        Testing init                                    0.0[ ok ]
        Testing create and free                                 0.0[ ok ]
        Testing clone                                   0.0[ ok ]
Collection: hashkit_st_functions
        Testing hashkit_digest                                  0.0[ ok ]

tests/ in hashkit_set_function_test() Expected "0" got "4" Additionally: "INVALID ARGUMENT"
        Testing hashkit_set_function                                    [ failed ]
        Testing hashkit_set_custom_function                                     0.0[ ok ]
        Testing hashkit_get_function                                    0.0[ ok ]
        Testing hashkit_set_distribution_function                                       0.0[ ok ]
        Testing hashkit_set_custom_distribution_function                                        0.0[ ok ]
        Testing hashkit_compare                                 0.0[ ok ]
Collection: library_functions
        Testing libhashkit_digest                                       0.0[ ok ]
Collection: hashing
        Testing one_at_a_time                                   0.0[ ok ]
        Testing md5                                     0.0[ ok ]
        Testing crc                                     0.0[ ok ]
        Testing fnv1_64                                 0.0[ ok ]
        Testing fnv1a_64                                        0.0[ ok ]
        Testing fnv1_32                                 0.0[ ok ]
        Testing fnv1a_32                                        0.0[ ok ]
        Testing hsieh                                   0.0[ ok ]
        Testing murmur                                  0.0[ ok ]
        Testing jenkis                                  0.0[ ok ]
Collection: regression
Some test failed.
        Total Collections                               5
        Failed Collections                              1
        Skipped Collections                             0
        Succeeded Collections                           4
Total                           21
        Failed                  1
        Skipped                 0
        Succeeded               20
FAIL: tests/testhashkit


1 of 25 tests failed
Please report to
make[2]: *** [check-TESTS] Error 1
make[2]: Leaving directory `/var/tmp/portage/dev-libs/libmemcached-1.0.4/work/libmemcached-1.0.4'
make[1]: *** [check-am] Error 2
make[1]: Leaving directory `/var/tmp/portage/dev-libs/libmemcached-1.0.4/work/libmemcached-1.0.4'
make: *** [check] Error 2
 * ERROR: dev-libs/libmemcached-1.0.4 failed (test phase):
 *   Make check failed. See above for details.

Portage (default/linux/amd64/10.0, gcc-4.7.1, glibc-2.15-r2, 3.5.0vs2.3.4-vs2.3.4 x86_64)
System uname: Linux-3.5.0vs2.3.4-vs2.3.4-x86_64-AMD_Phenom-tm-_II_X4_965_Processor-with-gentoo-2.1
Timestamp of tree: Unknown
app-shells/bash:          4.2_p37
dev-lang/python:          2.7.3-r2, 3.2.3-r1
dev-util/cmake:           2.8.8-r3
dev-util/pkgconfig:       0.27
sys-apps/baselayout:      2.1-r1
sys-apps/openrc:          0.10.5
sys-apps/sandbox:         2.6
sys-devel/autoconf:       2.69
sys-devel/automake:       1.12.2
sys-devel/binutils:       2.22.90
sys-devel/gcc:            4.7.1
sys-devel/gcc-config:     1.7.3
sys-devel/libtool:        2.4.2
sys-devel/make:           3.82-r3
sys-kernel/linux-headers: 3.5 (virtual/os-headers)
sys-libs/glibc:           2.15-r2
Repositories: gentoo
ACCEPT_KEYWORDS="amd64 ~amd64"
CFLAGS="-O2 -pipe"
CONFIG_PROTECT="/etc /usr/share/config /usr/share/gnupg/qualified.txt /usr/share/themes/oxygen-gtk/gtk-2.0 /var/lib/hsqldb"
CONFIG_PROTECT_MASK="/etc/ca-certificates.conf /etc/env.d /etc/fonts/fonts.conf /etc/gconf /etc/gentoo-release /etc/revdep-rebuild /etc/sandbox.d /etc/terminfo"
CXXFLAGS="-O2 -pipe"
FCFLAGS="-O2 -pipe"
FEATURES="assume-digests binpkg-logs buildpkg config-protect-if-modified distlocks ebuild-locks fixlafiles news parallel-fetch parse-eapi-ebuild-head protect-owned sandbox sfperms strict test unknown-features-warn unmerge-logs unmerge-orphans userfetch"
FFLAGS="-O2 -pipe"
LDFLAGS="-Wl,-O1 -Wl,--as-needed"
PORTAGE_RSYNC_OPTS="--recursive --links --safe-links --perms --times --compress --force --whole-file --delete --stats --human-readable --timeout=180 --exclude=/distfiles --exclude=/local --exclude=/packages"
USE="acl amd64 berkdb bzip2 cli cracklib crypt cups cxx dri fortran gdbm gpm iconv ipv6 mmx modules mudflap multilib ncurses nls nptl openmp pam pcre pppd readline session sse sse2 ssl tcpd unicode xa zlib" ALSA_CARDS="ali5451 als4000 atiixp atiixp-modem bt87x ca0106 cmipci emu10k1x ens1370 ens1371 es1938 es1968 fm801 hda-intel intel8x0 intel8x0m maestro3 trident usb-audio via82xx via82xx-modem ymfpci" ALSA_PCM_PLUGINS="adpcm alaw asym copy dmix dshare dsnoop empty extplug file hooks iec958 ioplug ladspa lfloat linear meter mmap_emul mulaw multi null plug rate route share shm softvol" APACHE2_MODULES="actions alias auth_basic authn_alias authn_anon authn_dbm authn_default authn_file authz_dbm authz_default authz_groupfile authz_host authz_owner authz_user autoindex cache cgi cgid dav dav_fs dav_lock deflate dir disk_cache env expires ext_filter file_cache filter headers include info log_config logio mem_cache mime mime_magic negotiation rewrite setenvif speling status unique_id userdir usertrack vhost_alias" CALLIGRA_FEATURES="kexi words flow plan sheets stage tables krita karbon braindump" CAMERAS="ptp2" COLLECTD_PLUGINS="df interface irq load memory rrdtool swap syslog" ELIBC="glibc" GPSD_PROTOCOLS="ashtech aivdm earthmate evermore fv18 garmin garmintxt gpsclock itrax mtk3301 nmea ntrip navcom oceanserver oldstyle oncore rtcm104v2 rtcm104v3 sirf superstar2 timing tsip tripmate tnt ubx" INPUT_DEVICES="keyboard mouse evdev" KERNEL="linux" LCD_DEVICES="bayrad cfontz cfontz633 glk hd44780 lb216 lcdm001 mtxorb ncurses text" LIBREOFFICE_EXTENSIONS="presenter-console presenter-minimizer" PHP_TARGETS="php5-3" PYTHON_TARGETS="python3_2 python2_7" RUBY_TARGETS="ruby18" USERLAND="GNU" VIDEO_CARDS="vesa" XTABLES_ADDONS="quota2 psd pknock lscan length2 ipv4options ipset ipp2p iface geoip fuzzy condition tee tarpit sysrq steal rawnat logmark ipmark dhcpmac delude chaos account"
Comment 1 Matthew Thode ( prometheanfire ) archtester Gentoo Infrastructure gentoo-dev Security 2014-01-27 08:30:45 UTC
Does this still apply to 1.0.17-r1?
Comment 2 Matthew Thode ( prometheanfire ) archtester Gentoo Infrastructure gentoo-dev Security 2014-02-18 03:16:01 UTC
doesn't apply against latest, closing.
Comment 3 Matthew Thode ( prometheanfire ) archtester Gentoo Infrastructure gentoo-dev Security 2014-02-18 03:46:41 UTC
sorry wrong memcache...