Gentoo Websites Logo
Go to: Gentoo Home Documentation Forums Lists Bugs Planet Store Wiki Get Gentoo!

Bug 287539

Summary: Stabilize games-util/atlas-0.3.1_p20090812
Product: Gentoo Linux Reporter: Mr. Bones. (RETIRED) <mr_bones_>
Component: [OLD] GamesAssignee: Gentoo Games <games>
Severity: enhancement CC: klaas.decanniere, tomka
Priority: High Keywords: STABLEREQ
Version: unspecified   
Hardware: All   
OS: Linux   
Package list:
Runtime testing required: ---

Description Mr. Bones. (RETIRED) gentoo-dev 2009-10-03 18:21:55 UTC
Please mark atlas-0.3.1_p20090812.ebuild stable.
Comment 1 Markus Meier gentoo-dev 2009-10-21 16:28:59 UTC
fails to compile here:

i686-pc-linux-gnu-g++ -DHAVE_CONFIG_H -I.     -O2 -march=i686 -pipe -DFGBASE_DIR='"/usr/share/games/FlightGear"' -c -o CrosshairsOverlay.o CrosshairsOverlay.cxx
i686-pc-linux-gnu-g++ -DHAVE_CONFIG_H -I.     -O2 -march=i686 -pipe -DFGBASE_DIR='"/usr/share/games/FlightGear"' -c -o Tiles.o Tiles.cxx
i686-pc-linux-gnu-g++ -DHAVE_CONFIG_H -I.     -O2 -march=i686 -pipe -DFGBASE_DIR='"/usr/share/games/FlightGear"' -c -o Searcher.o Searcher.cxx
Tiles.cxx: In constructor ���TileManager::TileManager(const SGPath&, const SGPath&, bool)���:
Tiles.cxx:124: error: void value not ignored as it ought to be
Tiles.cxx:168: error: void value not ignored as it ought to be
make[3]: *** [Tiles.o] Error 1
make[3]: *** Waiting for unfinished jobs....
make[3]: Leaving directory `/var/tmp/portage/games-util/atlas-0.3.1_p20090812/work/Atlas-0.3.1_p20090812/src'
make[2]: *** [all-recursive] Error 1
make[2]: Leaving directory `/var/tmp/portage/games-util/atlas-0.3.1_p20090812/work/Atlas-0.3.1_p20090812/src'
make[1]: *** [all] Error 2
make[1]: Leaving directory `/var/tmp/portage/games-util/atlas-0.3.1_p20090812/work/Atlas-0.3.1_p20090812/src'
make: *** [all-recursive] Error 1
 * ERROR: games-util/atlas-0.3.1_p20090812 failed.
 * Call stack:
 *     , line   49:  Called src_compile
 *             environment, line 3094:  Called games_src_compile
 *             environment, line 1962:  Called die
 * The specific snippet of code:
 *           emake || die "emake failed"
 *  The die message:
 *   emake failed

Portage (default/linux/x86/10.0/desktop, gcc-4.3.4, glibc-2.9_p20081201-r2, i686)
System uname: Linux-
Timestamp of tree: Wed, 21 Oct 2009 09:00:01 +0000
distcc 3.1 i686-pc-linux-gnu [disabled]
app-shells/bash:     4.0_p28
dev-java/java-config: 2.1.8-r1
dev-lang/python:     2.4.6, 2.5.4-r3, 2.6.2-r1
dev-python/pycrypto: 2.0.1-r8
dev-util/cmake:      2.6.4
sys-apps/sandbox:    1.6-r2
sys-devel/autoconf:  2.13, 2.63-r1
sys-devel/automake:  1.4_p6, 1.5, 1.7.9-r1, 1.8.5-r3, 1.9.6-r2, 1.10.2
sys-devel/binutils:  2.18-r3
sys-devel/gcc-config: 1.4.1
sys-devel/libtool:   2.2.6a
virtual/os-headers:  2.6.27-r2
CFLAGS="-O2 -march=i686 -pipe"
CONFIG_PROTECT="/etc /usr/kde/3.5/env /usr/kde/3.5/share/config /usr/kde/3.5/shutdown /usr/share/config /var/bind /var/lib/hsqldb"
CONFIG_PROTECT_MASK="/etc/ca-certificates.conf /etc/env.d /etc/env.d/java/ /etc/fonts/fonts.conf /etc/gconf /etc/php/apache2-php5/ext-active/ /etc/php/cgi-php5/ext-active/ /etc/php/cli-php5/ext-active/ /etc/revdep-rebuild /etc/sandbox.d /etc/terminfo /etc/texmf/language.dat.d /etc/texmf/language.def.d /etc/texmf/updmap.d /etc/texmf/web2c /etc/udev/rules.d"
CXXFLAGS="-O2 -march=i686 -pipe"
FEATURES="collision-protect distlocks fixpackages parallel-fetch protect-owned sandbox sfperms strict test unmerge-orphans userfetch userpriv usersandbox"
LINGUAS="en en_GB de"
PORTAGE_RSYNC_OPTS="--recursive --links --safe-links --perms --times --compress --force --whole-file --delete --stats --timeout=180 --exclude=/distfiles --exclude=/local --exclude=/packages"
USE="X a52 aac acl acpi alsa apache2 avahi berkdb bluetooth branding bzip2 cairo cdr cli consolekit cracklib crypt cups dbus dri dts dvd dvdr eds emboss encode evo examples fam firefox flac fortran gdbm gif gnome gpm gstreamer gtk hal iconv ipv6 isdnlog jpeg kde ldap libnotify mad mikmod modules mp3 mp4 mpeg mudflap ncurses nls nptl nptlonly objc objc++ ogg opengl openmp pam pcre pdf perl png ppds pppd python qt3support qt4 quicktime readline reflection sdl session source spell spl ssl startup-notification svg sysfs tcpd test thunar tiff truetype unicode usb vorbis win32codecs x264 x86 xml xorg xulrunner xv xvid zlib" ALSA_CARDS="ali5451 als4000 atiixp atiixp-modem bt87x ca0106 cmipci emu10k1 emu10k1x ens1370 ens1371 es1938 es1968 fm801 hda-intel intel8x0 intel8x0m maestro3 trident usb-audio via82xx via82xx-modem ymfpci" ALSA_PCM_PLUGINS="adpcm alaw asym copy dmix dshare dsnoop empty extplug file hooks iec958 ioplug ladspa lfloat linear meter mmap_emul mulaw multi null plug rate route share shm softvol" APACHE2_MODULES="actions alias auth_basic authn_alias authn_anon authn_dbm authn_default authn_file authz_dbm authz_default authz_groupfile authz_host authz_owner authz_user autoindex cache dav dav_fs dav_lock deflate dir disk_cache env expires ext_filter file_cache filter headers include info log_config logio mem_cache mime mime_magic negotiation rewrite setenvif speling status unique_id userdir usertrack vhost_alias" ELIBC="glibc" INPUT_DEVICES="keyboard mouse evdev" KERNEL="linux" LCD_DEVICES="bayrad cfontz cfontz633 glk hd44780 lb216 lcdm001 mtxorb ncurses text" LINGUAS="en en_GB de" USERLAND="GNU" VIDEO_CARDS="fbdev glint intel mach64 mga neomagic nv r128 radeon savage sis tdfx trident vesa vga via vmware voodoo"
Comment 2 Brent Baude (RETIRED) gentoo-dev 2010-01-22 20:14:26 UTC
ppc stable
Comment 3 Thomas Kahle (RETIRED) gentoo-dev 2010-02-25 12:54:27 UTC
(In reply to comment #1)
> fails to compile here:

Looks like API changes in {flight,sim}gear, we need to stable


first. With these it works.
Comment 4 Christian Faulhammer (RETIRED) gentoo-dev 2010-03-02 10:37:51 UTC
stable x86, thanks Thomas, closing
Comment 5 Thomas Kahle (RETIRED) gentoo-dev 2010-03-02 10:44:02 UTC
(In reply to comment #4)
> stable x86, thanks Thomas, closing

Did you stable flightgear and simgear?

Otherwise this does not compile!