Gentoo Websites Logo
Go to: Gentoo Home Documentation Forums Lists Bugs Planet Store Wiki Get Gentoo!

Bug 246570

Summary: app-emulation/wine-1.1.8 failed to emerge
Product: Gentoo Linux Reporter: ammar wk <y3dips>
Component: Current packagesAssignee: Gentoo Linux bug wranglers <bug-wranglers>
Severity: minor    
Priority: High    
Version: unspecified   
Hardware: x86   
OS: Linux   
Package list:
Runtime testing required: ---
Attachments: fix teh parser.y

Description ammar wk 2008-11-13 04:11:14 UTC
wine-1.1.8 failed to emerge 

Reproducible: Always

Steps to Reproduce:
1.emerge wine

Actual Results:  
parser.y:320: error: expected ';' before '}' token
make[2]: *** [] Error 1
make[2]: Leaving directory `/var/tmp/portage/app-emulation/wine-1.1.8/work/wine-1.1.8/dlls/jscript'
make[1]: *** [jscript] Error 2
make[1]: Leaving directory `/var/tmp/portage/app-emulation/wine-1.1.8/work/wine-1.1.8/dlls'
make: *** [dlls] Error 2
 * ERROR: app-emulation/wine-1.1.8 failed.
 * Call stack:
 *     , line   49:  Called src_compile
 *             environment, line 2391:  Called die
 * The specific snippet of code:
 *       emake all || die "all"
 *  The die message:
 *   all
 * If you need support, post the topmost build error, and the call stack if relevant.
 * A complete build log is located at '/var/tmp/portage/app-emulation/wine-1.1.8/temp/build.log'.
 * The ebuild environment file is located at '/var/tmp/portage/app-emulation/wine-1.1.8/temp/environment'.

Expected Results:  
successfully instaled

fix/patch are attached
Comment 1 ammar wk 2008-11-13 04:14:33 UTC
Created attachment 171593 [details, diff]
fix teh parser.y

fix teh parser.y
Comment 2 Rafał Mużyło 2008-11-13 08:54:24 UTC
Duplicate of bug 246193, fixed with bison 2.4-r1 and fixed upstream.
Comment 3 Ben de Groot (RETIRED) gentoo-dev 2008-11-13 10:13:15 UTC

*** This bug has been marked as a duplicate of bug 246193 ***