Gentoo Websites Logo
Go to: Gentoo Home Documentation Forums Lists Bugs Planet Store Wiki Get Gentoo!
Votes Bug # Summary
Gentoo Linux (bug list)
1 269315 [TRACKER] sys-devel/binutils[default-gold] linker breakage (Show Votes)
1 458968 games-simulation/micropolis ignores parallel make options (Show Votes)
1 543870 media-libs/libcaca-0.99_beta19 USE=doc with >=app-doc/doxygen-1.8.8 - Makefile:6: recipe for target 'refman.pdf' failed (Show Votes)
1 565740 media-libs/fontconfig-2.11.94 failed to emerge with USE=doc (Show Votes)
1 590756 media-libs/rtaudio-4.1.2 - ../.libs/librtaudio.so: error: undefined reference to 'pa_strerror' (Show Votes)
1 599470 [TRACKER] sys-auth/elogind - Integration into Gentoo (Show Votes)
1 614488 app-misc/oneko fork (Show Votes)
1 648988 dev-python/numpy-1.13.3 - src_compile(): don't know how to compile Fortran code on platform 'posix' (Show Votes)
1 657528 media-video/vlc: no sound with opus audio track, although compiled with opus USE flag (Show Votes)
1 669194 dev-libs/protobuf-3.6.1 with GOLD linker: `protoc --version`: terminate called after throwing an instance of 'std::system_error' (Show Votes)
1 682136 dev-java/ant-core-1.10.5-r1 with dev-java/java-config-2.2.0-r4 and dev-java/openjdk-11.0.2_p7 - Warning: Unable to determine tools.jar location. (Show Votes)
1 685010 =dev-lang/luajit-2.1.0_beta3 : add USE flag for GC64 mode (Show Votes)
1 687104 kde-plasma/ksysguard - Cannot view Detailed Memory Information as root since kde-plasma/libksysguard switch to webengine (Show Votes)
1 695374 sys-apps/audio-entropyd -d pulse leaves media-sound/pulseaudio open on Plasma logout (Show Votes)
1 696156 kde-plasma/kscreenlocker conflicts with x11-misc/xscreensaver under Wayland (Show Votes)
1 700146 x11-themes/adapta-gtk-theme-3.95.0.11 : make: *** [Makefile:<snip>: all-recursive] Error 1 (Show Votes)
1 723438 app-i18n/enca-1.19-r2 fails to build with USE=doc (Show Votes)
1 747184 =media-sound/lilypond-2.21.5 fails to build with USE=doc (Show Votes)
1 760549 app-office/libreoffice-7.0.3.1: configure: error: Your version of libclucene has contribs-lib missing. (Show Votes)
1 770070 app-doc/doxygen-1.9.1[doc, clang] error: Tag file 'example.tag' does not exist or is not a file. Skipping it... (Show Votes)
1 830364 dev-python/pygments-2.11.0: USE=doc failed to emerge (Show Votes)
1 831021 dev-util/nvidia-cuda-sdk-11.5.1 fails to compile: std_function.h:435:145: error: parameter packs not expanded with ...: (Show Votes)
1 833618 =dev-python/sphinx-4.4.0 USE=doc error: deploying.rst:162:unknown document: readthedocs:tutorial/index (Show Votes)
1 834677 dev-python/jaraco-packaging-9.0.0 failed to emerge with USE=doc (Show Votes)
1 834684 dev-python/importlib_metadata-4.11.2. failed to emerge with USE=doc (Show Votes)
1 836780 dev-python/pywavelets with USE=doc fails to build (Show Votes)
1 839006 dev-python/zipp-3.8.0 - /.../python3.9: cant open file .../setup.py: [Errno 2] No such file or directory (Show Votes)
1 841758 =dev-python/pygments-2.11.2 USE=doc fails to build: extension error (Show Votes)
28 votes used out of 50 allowed.

Portage Development (bug list)
1 492910 sys-apps/portage: emerge fails with ccache due to CCACHE_DIR permission issues (CCACHE_UMASK would help) (Show Votes)
1 649622 sys-apps/portage: virtual/w3m-0 keeps being installed when updating my system and de-installed by depclean (Show Votes)
2 votes used out of 10 allowed.

View all as bug list

Help with voting.