Gentoo Websites Logo
Go to: Gentoo Home Documentation Forums Lists Bugs Planet Store Wiki Get Gentoo!
Votes Bug # Summary
Gentoo Hosted Projects (bug list)
1 431408 [Future EAPI] USE_EXPAND should be possible per package (Show Votes)
1 564490 [Future EAPI] allow =sys-kernel/gentoo-sources-4.1.* handling (Show Votes)
2 votes used out of 5 allowed.

Gentoo Linux (bug list)
1 261375 dev-lang/perl and xs: bad CC/CXX/CFLAGS/CPPFLAGS/LDFLAGS handling (Show Votes)
1 361349 Use of /run (Show Votes)
1 373219 provide alternative for /etc/init.d/ so that openrc is not required (Show Votes)
1 389647 app-portage/gentoolkit: revdep-rebuild does not understand symlinks (Show Votes)
1 402309 sys-devel/gdb-7.4 doesn't honor LINGUAS for locale files (Show Votes)
1 424751 net-p2p/qbittorrent fails with parallel make: fatal error: ui_propertieswidget.h: No such file or directory (Show Votes)
1 480018 sys-apps/lm_sensors-3.3.4: /etc/init.d/lm_sensors should not check for MODULES_0 in /etc/conf.d/lm_sensors (Show Votes)
1 490956 net-analyzer/wireshark has some unneccessary configure options (Show Votes)
1 503666 sys-process/cronie[anacron] doesn't install anacron properly (Show Votes)
1 504116 [TRACKER] fix programs that source /etc/init.d/ (Show Votes)
1 504204 x11-libs/wxGTK- - x86_64-pc-linux-gnu-ranlib: /usr/lib64/crt1.o: In function `_start': (.text+0x20): undefined reference to `main' (Show Votes)
1 518096 dev-php/cphalcon - Phalcon PHP framework (Show Votes)
1 526138 sys-boot/grub-2.02_beta2-r2: QA issues with bash-completions (Show Votes)
1 526702 sys-apps/util-linux-2.25.2: missing bashcomp alias for 'su' (Show Votes)
1 526998 net-libs/webkit-gtk: requesting a binary package (Show Votes)
1 536984 [TRACKER] sys-devel/gcc-5 (Show Votes)
1 542820 sys-libs/ntdb: reassess possibly unneeded samba block (Show Votes)
1 543006 net-misc/vde fails to compile (Show Votes)
1 544836 dev-java/java-config-2.2.0: expand @GENTOO_PORTAGE_EPREFIX@ in shebang line (Show Votes)
1 545002 media-tv/kodi: Use more external libraries (Show Votes)
1 545688 net-analyzer/wireshark - switch to building with cmake (Show Votes)
1 550432 revdep-rebuild: support gcc std::__cxx11 symbol transition (Show Votes)
1 559064 cmake-utils.eclass (was sys-devel/llvm): ninja build ignores MAKEOPTS="--jobs=x --load-average=x" (Show Votes)
1 565244 net-misc/socat: add libressl support (Show Votes)
1 568320 dev-libs/gmp[pgo] fails to build on arm with error: unknown type name 'clock_gettime' (Show Votes)
1 571532 dev-libs/efl[egl,opengl] - configure: error: Full OpenGL with EGL is not supported, please add --with-opengl=es to your configure options to switch to EGL + OpenGL ES. (Show Votes)
1 574238 dev-lang/php-7.0.15 stable request (Show Votes)
1 577030 x11-libs/wxGTK-3.1.5 version bump (Show Votes)
1 579546 sys-apps/dbus-1.10.8-r1: kde apps cannot connect to dbus, plasma session reset after prelink run (Show Votes)
1 581434 sys-devel/gcc-6.2.0 version bump (Show Votes)
1 593094 media-gfx/enblend-4.1.3-r1 (with vigra-1.11.0) - /usr/include/vigra/stdconvolution.hxx:1170:19: error: ‘iter’ does not name a typ (Show Votes)
1 606142 sys-libs/ncurses-6.0-r1 failed to build with -flto -O2 (Show Votes)
1 606624 dev-libs/appstream-0.10.5 Error: cannot open mo file.../work/appstream-0.10.5_build/po/*.gmo (Show Votes)
1 611238 app-emulation/qemu-2.8.0-r6[vte,gtk,-gtk2] fails to configure if gtk+:2 is installed and vte:2.90, or vte:2.91 (Show Votes)
1 644562 sys-libs/ncurses-6.0-r2 - checking whether able to link to dl*() functions... configure: error: Cannot link test program for libdl (Show Votes)
1 652172 dev-qt/qtwebengine-5.9.4: CC, CXX, CFLAGS, CXXFLAGS, LDFLAGS not respected for most of the build (Show Votes)
1 657314 media-video/ffmpeg-3.4.2-r1[opencl] - src_configure(): ERROR: opencl not found (Show Votes)
1 663384 kde-plasma/kinfocenter-5.13.4 ninja: error: multiple rules generate kinfocenter-5.13.4/Modules/base/config-infocenter.h.cmake (Show Votes)
1 671112 app-eselect/eselect-opencl with media-libs/mesa-18.2.4 fails to report mesa opencl profile (Show Votes)
39 votes used out of 50 allowed.

Gentoo Security (bug list)
1 572384 <sys-kernel/gentoo-sources-{3.12.52-r1,3.14.58-r1,3.18.25-r1,4.1.15-r1}: possible local privilege escalation due to keyring facility (CVE-2016-0728) (Show Votes)
1 vote used out of 5 allowed.

Portage Development (bug list)
1 546246 emerge should have info about time needed to build packages (Show Votes)
1 549906 emerge should free up some memory before starting compilation (Show Votes)
2 votes used out of 10 allowed.

[OLD] Docs on (bug list)
1 538864 Configuration instructions for cronie and anacron is misleading (Show Votes)
1 vote used out of 5 allowed.

View all as bug list

Help with voting.