Gentoo Websites Logo
Go to: Gentoo Home Documentation Forums Lists Bugs Planet Store Wiki Get Gentoo!
Votes Bug # Summary
Gentoo Linux (bug list)
1 430702 [TRACKER] sys-libs/musl porting (Show Votes)
1 691806 dev-lang/orc related USE flag masked while orc is stable or keyworded (Show Votes)
1 703866 media-libs/libwebp without gui-libs/gdk-pixbuf-loader-webp no longer provides GNOME applications with WEBP support (Show Votes)
1 713786 [Tracker]: missing includes for musl (Show Votes)
1 714206 dev-util/debugedit-5.0 : tools/debugedit.c: fatal error: error.h: No such file or directory (Show Votes)
1 715680 ppc/ppc64 profile rework (Show Votes)
1 718914 dev-python/pylibacl fails tests (Show Votes)
1 728602 media-video/ffmpeg-4.3 USE=altivec - src/libswscale/ppc/yuv2rgb_altivec.c:339:18: error: implicit declaration of function ‘vec_xl’; did you mean ‘vec_rl’? [-Werror=implicit-function-declaration] (Show Votes)
1 734052 net-analyzer/wireshark-3.2.5 USE=qt5? - CMake Error at CMakeLists.txt:1097 (find_package): By not providing "FindQt5Core.cmake" in CMAKE_MODULE_PATH this project has asked CMake to find a package configuration file provided by "Qt5Core" [...] (Show Votes)
1 734280 app-office/abiword-3.0.5 fails to compile: ap_UnixApp.cpp:866:29: error: invalid suffix on literal; C++11 requires a space between literal and identifier [-Wreserved-user-defined-literal] (Show Votes)
1 743295 dev-python/scipy fails test test_bisplev_integer_overflow Fatal Python error: Segmentation fault (Show Votes)
1 768507 app-crypt/heimdal-7.7.0-r1 fails tests (Show Votes)
1 788652 dev-python/scipy-1.6.2: fails 1 test on ppc64 (TestNoData.test_nodata) (Show Votes)
1 790584 sys-block/thin-provisioning-tools-0.9.0: fails 94 tests on ppc (Show Votes)
1 795036 media-sound/mpg321-0.3.2 - mad.c:(.text+<snip>): undefined reference to audio_linear_dither (Show Votes)
1 823768 ppc(32) some package de-stabilization (Show Votes)
1 832478 xfce-extra/xfce4-sensors-plugin-1.4.2 fails to compile: ld.lld: error: undefined symbol: gtk_sensorstacho_get_type() (Show Votes)
1 863599 dev-cpp/glog-0.6.0 fails tests on stable arm/x86 (Show Votes)
1 874561 media-libs/libmpd-11.8.17-r1 - libmpd-playlist.c: error: incompatible pointer to integer conversion (Show Votes)
1 883207 app-text/wv-1.2.9-r3 fails to compile (CLANG-STRICTER-SYSTEM): wvConfig.c:3617:19: error: incompatible function pointer types assigning to startElementSAXFunc (aka void ()(void , const unsigned char , const unsigned char )) from void (void , const char , (Show Votes)
1 903611 [Tracker] Breakage with sys-libs/musl-1.2.4 (9999) LFS shims being removed (Show Votes)
1 909730 dev-ruby/rdoc-6.5.0: invalid character property name (Show Votes)
1 910382 dev-libs/xmlsec-1.3.1: fails tests (Show Votes)
1 914349 media-libs/audiofile-0.3.6-r5 fails to compile with clang: SimpleModule.h:128:40: error: no template named 'unary_function' in namespace 'std' (Show Votes)
1 914429 sci-libs/lapack-3.11 fails to build with samurai (Show Votes)
1 914637 sys-apps/keyutils-1.6.3 - [clang] ld.lld: error: version script assignment of KEYUTILS_1.7 to symbol keyctl_restrict failed: symbol not defined (Show Votes)
1 914640 sys-libs/binutils-libs-2.41-r2 - [clang] ld.lld: error: version script assignment of LIBCTF_1.0 to symbol ctf_label_set failed: symbol not defined (Show Votes)
1 915205 net-wireless/bluez-5.72 fails to link with clang-17: ld.lld: error: version script assignment of 'global' to symbol 'error' failed: symbol not defined (Show Votes)
1 917677 move ppc64 to ELFv2 ABI? (Show Votes)
1 918981 dev-cpp/abseil-cpp-20230802.0: fails to build on ppc (Show Votes)
1 919078 app-cdr/brasero: fails to compile (brasero-metadata.c:668:45: error: passing argument 1 of ‘gst_install_plugins_async’ from incompatible pointer type [-Wincompatible-pointer-types]) (Show Votes)
1 921583 gnome-base/gnome-control-center-45.2: fails tests (Show Votes)
1 922236 multiple rust crates fail to compile on ppc: error[E0432]: unresolved import `std::sync::atomic::AtomicI64` (Show Votes)
1 923959 net-print/libcupsfilters-2.0.0-r3 - error: ISO C++17 does not allow dynamic exception specifications (Show Votes)
1 925241 dev-libs/elfutils-0.190: ./stack:1:1: error: expected unqualified-id with libcxx-18 and clang (Show Votes)
1 925455 sys-libs/libblockdev-3.0.4: stablereq (Show Votes)
1 926147 [Tracker] Breakage with sys-libs/musl-1.2.5 (Show Votes)
1 926505 [Tracker] Build failures with sys-devel/clang-18 (Show Votes)
1 929265 xfce-base/xfce4-settings: needs upgrade to Python 3.12 (PythonCompatUpdate) (Show Votes)
1 929371 app-text/yelp-tools: needs upgrade to Python 3.12 (PythonCompatUpdate) (Show Votes)
1 929833 sys-devel/distcc: needs upgrade to Python 3.12 (PythonCompatUpdate) (Show Votes)
41 votes used out of 50 allowed.

View all as bug list

Help with voting.