* Package:    app-admin/fsvs-1.2.5-r2
 * Repository: gentoo
 * USE:        abi_x86_64 amd64 elibc_musl kernel_linux userland_GNU
 * FEATURES:   network-sandbox preserve-libs sandbox userpriv usersandbox


@@@@@ PLEASE PAY ATTENTION HERE!!! @@@@@
This information may help you to understand if this is a duplicate or if this bug exists after you pushed a fix;
This ebuild was merged at the following commit:
https://github.com/gentoo-mirror/gentoo/commit/2bfa1d372975168f595cf3b28b902ce7062960c4  (Wed Dec 29 20:51:46 UTC 2021)
@@@@@ END @@@@@



##################
# emerge --info: #
##################
!!! It seems /run is not mounted. Process management may malfunction.
Portage 3.0.30 (python 3.10.1-final-0, default/linux/amd64/17.0/musl/hardened, gcc-11.2.1, musl-1.2.2-r7, 4.19.174-gentoo x86_64)
=================================================================
System uname: Linux-4.19.174-gentoo-x86_64-Intel-R-_Xeon-R-_CPU_E5-2650_v4_@_2.20GHz-with-libc
KiB Mem:   264046488 total,  60171500 free
KiB Swap:          0 total,         0 free
Timestamp of repository gentoo: Wed, 29 Dec 2021 20:51:45 +0000
sh bash 5.1_p12
ld GNU ld (Gentoo 2.37_p1 p1) 2.37
app-misc/pax-utils:        1.3.3::gentoo
app-shells/bash:           5.1_p12::gentoo
dev-lang/perl:             5.34.0-r6::gentoo
dev-lang/python:           3.8.12_p1::gentoo, 3.9.9::gentoo, 3.10.1-r1::gentoo
dev-util/cmake:            3.22.1::gentoo
dev-util/meson:            0.60.3::gentoo
sys-apps/baselayout:       2.8::gentoo
sys-apps/openrc:           0.44.10::gentoo
sys-apps/sandbox:          2.29::gentoo
sys-devel/autoconf:        2.71-r1::gentoo
sys-devel/automake:        1.16.5::gentoo
sys-devel/binutils:        2.37_p1-r1::gentoo
sys-devel/binutils-config: 5.4::gentoo
sys-devel/gcc:             11.2.1_p20211127::gentoo
sys-devel/gcc-config:      2.5-r1::gentoo
sys-devel/libtool:         2.4.6-r6::gentoo
sys-devel/make:            4.3::gentoo
sys-kernel/linux-headers:  5.15-r1::gentoo (virtual/os-headers)
sys-libs/musl:             1.2.2-r7::gentoo
Repositories:

gentoo
    location: /usr/portage
    sync-type: rsync
    sync-uri: rsync://rsync.gentoo.org/gentoo-portage
    priority: -1000
    sync-rsync-verify-jobs: 1
    sync-rsync-verify-metamanifest: yes
    sync-rsync-verify-max-age: 24
    sync-rsync-extra-opts: 

ACCEPT_KEYWORDS="amd64 ~amd64"
ACCEPT_LICENSE="* GPL-3"
CBUILD="x86_64-gentoo-linux-musl"
CFLAGS="-O2 -pipe -march=x86-64 -frecord-gcc-switches -fno-diagnostics-color -fmessage-length=0"
CHOST="x86_64-gentoo-linux-musl"
CONFIG_PROTECT="/etc /usr/share/gnupg/qualified.txt"
CONFIG_PROTECT_MASK="/etc/ca-certificates.conf /etc/env.d /etc/fonts/fonts.conf /etc/gconf /etc/gentoo-release /etc/revdep-rebuild /etc/sandbox.d /etc/terminfo"
CXXFLAGS="-O2 -pipe -march=x86-64 -frecord-gcc-switches -fno-diagnostics-color -fmessage-length=0"
DISTDIR="/var/tmp/portage/app-admin/fsvs-1.2.5-r2/distdir"
EMERGE_DEFAULT_OPTS="--with-bdeps=y -1 -k -b"
ENV_UNSET="CARGO_HOME DBUS_SESSION_BUS_ADDRESS DISPLAY GOBIN GOPATH PERL5LIB PERL5OPT PERLPREFIX PERL_CORE PERL_MB_OPT PERL_MM_OPT XAUTHORITY XDG_CACHE_HOME XDG_CONFIG_HOME XDG_DATA_HOME XDG_RUNTIME_DIR"
FCFLAGS="-O2 -pipe -march=x86-64 -frecord-gcc-switches -fno-diagnostics-color -fmessage-length=0"
FEATURES="assume-digests binpkg-docompress binpkg-dostrip binpkg-logs binpkg-multi-instance buildpkg buildpkg-live config-protect-if-modified distlocks ebuild-locks fixlafiles ipc-sandbox merge-sync network-sandbox news parallel-fetch pid-sandbox preserve-libs protect-owned qa-unresolved-soname-deps sandbox sfperms sign split-log strict unknown-features-warn unmerge-logs unmerge-orphans userfetch userpriv usersandbox usersync xattr"
FFLAGS="-O2 -pipe -march=x86-64 -frecord-gcc-switches -fno-diagnostics-color -fmessage-length=0"
GENTOO_MIRRORS="http://mirror.leaseweb.com/gentoo/ http://ftp.snt.utwente.nl/pub/os/linux/gentoo/ http://ftp.belnet.be/pub/rsync.gentoo.org/gentoo/ http://distfiles.gentoo.org"
INSTALL_MASK="charset.alias /usr/share/locale/locale.alias"
LANG="C.UTF8"
LDFLAGS="-Wl,-O1 -Wl,--as-needed -Wl,--defsym=__gentoo_check_ldflags__=0"
MAKEOPTS="-j2"
PKGDIR="/root/tbci/binpkg"
PORTAGE_CONFIGROOT="/"
PORTAGE_RSYNC_OPTS="--recursive --links --safe-links --perms --times --omit-dir-times --compress --force --whole-file --delete --stats --human-readable --timeout=180 --exclude=/distfiles --exclude=/local --exclude=/packages --exclude=/.git"
PORTAGE_TMPDIR="/var/tmp"
SHELL="/bin/bash"
USE="acl amd64 bzip2 crypt elogind hardened iconv ipv6 jumbo-build libglvnd libtirpc native-symlinks ncurses nls nptl openmp pam pcre pie readline seccomp split-usr ssl ssp unicode xattr xtpax zlib" ABI_X86="64" ELIBC="musl" KERNEL="linux" USERLAND="GNU"
Unset:  ADDR2LINE, AR, ARFLAGS, AS, ASFLAGS, CC, CCLD, CONFIG_SHELL, CPP, CPPFLAGS, CTARGET, CXX, CXXFILT, ELFEDIT, EXTRA_ECONF, F77FLAGS, FC, GCOV, GPROF, LC_ALL, LD, LEX, LFLAGS, LIBTOOL, LINGUAS, MAKE, MAKEFLAGS, NM, OBJCOPY, OBJDUMP, PORTAGE_BINHOST, PORTAGE_BUNZIP2_COMMAND, PORTAGE_COMPRESS, PORTAGE_COMPRESS_FLAGS, PORTAGE_RSYNC_EXTRA_OPTS, RANLIB, READELF, RUSTFLAGS, SIZE, STRINGS, STRIP, YACC, YFLAGS





##############################
# emerge history (qlop -mv): #
##############################
2021-12-29T21:09:44 >>> acct-group/svnusers-0-r1
2021-12-29T21:09:50 >>> dev-libs/libutf8proc-2.6.1
2021-12-29T21:10:00 >>> acct-user/svn-0-r1
2021-12-29T21:10:09 >>> app-eselect/eselect-ctags-1.19
2021-12-29T21:10:12 >>> dev-libs/apr-1.7.0-r4
2021-12-29T21:10:15 >>> app-arch/lz4-1.9.3-r1
2021-12-29T21:10:34 >>> dev-libs/apr-util-1.6.1-r7
2021-12-29T21:10:37 >>> dev-python/pygments-2.10.0
2021-12-29T21:10:40 >>> dev-util/scons-4.3.0
2021-12-29T21:11:18 >>> dev-python/docutils-0.18.1
2021-12-29T21:11:32 >>> net-libs/serf-1.3.9-r2
2021-12-29T21:11:50 >>> dev-util/ctags-20211017.0
2021-12-29T21:12:58 >>> dev-vcs/subversion-1.14.1




#######################################
# installed packages (qlist -ICvUSS): #
#######################################
acct-group/audio-0-r1:0
acct-group/cdrom-0-r1:0
acct-group/dialout-0-r1:0
acct-group/disk-0-r1:0
acct-group/input-0-r1:0
acct-group/kmem-0-r1:0
acct-group/kvm-0-r1:0
acct-group/lp-0-r1:0
acct-group/man-0-r1:0
acct-group/messagebus-0-r1:0
acct-group/portage-0:0
acct-group/render-0-r1:0
acct-group/sgx-0:0
acct-group/sshd-0-r1:0
acct-group/svnusers-0-r1:0
acct-group/tape-0-r1:0
acct-group/tty-0-r1:0
acct-group/video-0-r1:0
acct-user/man-1-r1:0
acct-user/messagebus-0-r1:0
acct-user/portage-0:0
acct-user/sshd-0-r1:0
acct-user/svn-0-r1:0
app-admin/eselect-1.4.18:0 -doc -emacs -vim-syntax
app-admin/perl-cleaner-2.30:0
app-arch/bzip2-1.0.8-r1:0/1 -abi_mips_n32 -abi_mips_n64 -abi_mips_o32 -abi_s390_32 -abi_s390_64 -abi_x86_32 abi_x86_64 -abi_x86_x32 split-usr -static -static-libs
app-arch/gzip-1.11:0 -pic -static
app-arch/libarchive-3.5.2:0/13 -abi_mips_n32 -abi_mips_n64 -abi_mips_o32 -abi_s390_32 -abi_s390_64 -abi_x86_32 abi_x86_64 -abi_x86_x32 acl -blake2 bzip2 e2fsprogs -expat iconv -lz4 lzma -lzo -nettle -static-libs xattr zlib -zstd
app-arch/lz4-1.9.3-r1:0/r132 -abi_mips_n32 -abi_mips_n64 -abi_mips_o32 -abi_s390_32 -abi_s390_64 -abi_x86_32 abi_x86_64 -abi_x86_x32 -static-libs
app-arch/tar-1.34:0 acl -minimal nls -selinux xattr
app-arch/unzip-6.0_p26:0 bzip2 -natspec unicode
app-arch/xz-utils-5.2.5-r1:0 -abi_mips_n32 -abi_mips_n64 -abi_mips_o32 -abi_s390_32 -abi_s390_64 -abi_x86_32 abi_x86_64 -abi_x86_x32 extra-filters nls split-usr -static-libs
app-arch/zstd-1.5.1:0/1 -abi_mips_n32 -abi_mips_n64 -abi_mips_o32 -abi_s390_32 -abi_s390_64 -abi_x86_32 abi_x86_64 -abi_x86_x32 -lz4 -static-libs threads
app-crypt/gnupg-2.3.4:0 bzip2 -doc -ldap nls readline -selinux smartcard ssl -test tofu -tools -usb -user-socket -wks-server
app-crypt/gpgme-1.16.0:1/11 -common-lisp cxx -python python_targets_python3_10 python_targets_python3_8 python_targets_python3_9 -qt5 -static-libs
app-crypt/libb2-0.98.1-r3:0 -abi_mips_n32 -abi_mips_n64 -abi_mips_o32 -abi_s390_32 -abi_s390_64 -abi_x86_32 abi_x86_64 -abi_x86_x32 -native-cflags openmp -static-libs
app-crypt/libmd-1.0.4:0 -abi_mips_n32 -abi_mips_n64 -abi_mips_o32 -abi_s390_32 -abi_s390_64 -abi_x86_32 abi_x86_64 -abi_x86_x32
app-crypt/pinentry-1.2.0:0 -caps -efl -emacs -gnome-keyring -gtk ncurses -qt5
app-crypt/rhash-1.4.2:0 -abi_mips_n32 -abi_mips_n64 -abi_mips_o32 -abi_s390_32 -abi_s390_64 -abi_x86_32 abi_x86_64 -abi_x86_x32 -debug nls ssl -static-libs
app-editors/nano-6.0:0 -debug -justify -magic -minimal ncurses nls spell split-usr -static unicode
app-eselect/eselect-ctags-1.19:0
app-eselect/eselect-fontconfig-1.1-r1:0
app-eselect/eselect-iptables-20211203:0
app-eselect/eselect-lib-bin-symlink-0.1.1-r1:0
app-eselect/eselect-pinentry-0.7.2:0
app-misc/c_rehash-1.7-r1:0
app-misc/ca-certificates-20211016.3.72:0 -cacert
app-misc/editor-wrapper-4-r1:0
app-misc/mime-types-9:0
app-misc/pax-utils-1.3.3:0 -caps -debug -python -python_single_target_python3_10 -python_single_target_python3_8 python_single_target_python3_9 seccomp
app-misc/tmux-3.2a:0 -debug -selinux -utempter -vim-syntax
app-portage/eix-0.36.0:0 -debug -doc nls -sqlite
app-portage/elt-patches-20211104:0
app-portage/gemato-16.2:0 gpg -python_targets_pypy3 python_targets_python3_10 python_targets_python3_8 python_targets_python3_9 -test -tools
app-portage/gentoolkit-0.5.1-r1:0 -python_targets_pypy3 python_targets_python3_10 python_targets_python3_8 python_targets_python3_9 -test
app-portage/portage-utils-0.93.3:0 nls openmp qmanifest qtegrity -static
app-shells/bash-5.1_p12:0 -afs -bashlogger -examples -mem-scramble net nls -plugins readline
app-shells/push-3.4:0
app-shells/quoter-4.2:0
app-text/ansifilter-2.18:0 -qt5
app-text/build-docbook-catalog-2.1:0
app-text/docbook-xml-dtd-4.5-r2:4.5
app-text/docbook-xml-dtd-4.4-r3:4.4
app-text/docbook-xml-dtd-4.2-r3:4.2
app-text/docbook-xml-dtd-4.1.2-r7:4.1.2
app-text/docbook-xsl-stylesheets-1.79.1-r2:0 -ruby
app-text/manpager-1:0
app-text/sgml-common-0.6.3-r7:0
app-text/xmlto-0.0.28-r8:0 -latex -text
dev-db/sqlite-3.37.0:3 -abi_mips_n32 -abi_mips_n64 -abi_mips_o32 -abi_s390_32 -abi_s390_64 -abi_x86_32 abi_x86_64 -abi_x86_x32 -debug -doc -icu readline -secure-delete -static-libs -tcl -test -tools
dev-lang/perl-5.34.0-r6:0/5.34 -berkdb -debug -doc -gdbm ithreads -minimal
dev-lang/python-3.10.1-r1:3.10 -bluetooth -build -examples gdbm hardened -libedit -lto ncurses -pgo readline sqlite ssl -test -tk -verify-sig -wininst xml
dev-lang/python-3.9.9:3.9 -bluetooth -build -examples gdbm hardened -lto ncurses -pgo readline sqlite ssl -test -tk -verify-sig -wininst xml
dev-lang/python-3.8.12_p1:3.8 -bluetooth -build -examples gdbm hardened ncurses readline sqlite ssl -test -tk -verify-sig -wininst xml
dev-lang/python-exec-2.4.8:2 native-symlinks python_targets_pypy3 python_targets_python3_10 python_targets_python3_8 python_targets_python3_9 -test
dev-lang/python-exec-conf-2.4.6:2 -python_targets_pypy3 python_targets_python3_10 python_targets_python3_8 python_targets_python3_9
dev-lang/tcl-8.6.12:0/8.6 -abi_mips_n32 -abi_mips_n64 -abi_mips_o32 -abi_s390_32 -abi_s390_64 -abi_x86_32 abi_x86_64 -abi_x86_x32 -debug threads
dev-libs/apr-1.7.0-r4:1/1.7 -doc -older-kernels-compatibility -selinux -static-libs urandom
dev-libs/apr-util-1.6.1-r7:1 -berkdb -doc -gdbm -ldap -mysql -nss -odbc -openssl -postgres -sqlite -static-libs
dev-libs/elfutils-0.186:0 -abi_mips_n32 -abi_mips_n64 -abi_mips_o32 -abi_s390_32 -abi_s390_64 -abi_x86_32 abi_x86_64 -abi_x86_x32 bzip2 -lzma nls -static-libs -test -threads utils -valgrind -zstd
dev-libs/expat-2.4.2:0 -abi_mips_n32 -abi_mips_n64 -abi_mips_o32 -abi_s390_32 -abi_s390_64 -abi_x86_32 abi_x86_64 -abi_x86_x32 -examples split-usr -static-libs unicode
dev-libs/glib-2.70.2:2 -abi_mips_n32 -abi_mips_n64 -abi_mips_o32 -abi_s390_32 -abi_s390_64 -abi_x86_32 abi_x86_64 -abi_x86_x32 -dbus -debug elf -fam -gtk-doc mime -selinux -static-libs -sysprof -systemtap -test -utils xattr
dev-libs/gmp-6.2.1-r2:0/10.4 -abi_mips_n32 -abi_mips_n64 -abi_mips_o32 -abi_s390_32 -abi_s390_64 -abi_x86_32 abi_x86_64 -abi_x86_x32 asm cxx -doc -pic -static-libs
dev-libs/gobject-introspection-1.70.0:0 -doctool -gtk-doc -python_single_target_python3_10 -python_single_target_python3_8 python_single_target_python3_9 -test
dev-libs/gobject-introspection-common-1.70.0:0
dev-libs/isl-0.24-r2:0/23 -abi_mips_n32 -abi_mips_n64 -abi_mips_o32 -abi_s390_32 -abi_s390_64 -abi_x86_32 abi_x86_64 -abi_x86_x32 -static-libs
dev-libs/jsoncpp-1.9.5:0/25 -doc -test
dev-libs/libassuan-2.5.5:0
dev-libs/libbsd-0.11.3:0 -abi_mips_n32 -abi_mips_n64 -abi_mips_o32 -abi_s390_32 -abi_s390_64 -abi_x86_32 abi_x86_64 -abi_x86_x32 -static-libs
dev-libs/libevent-2.1.12:0/2.1-7 -abi_mips_n32 -abi_mips_n64 -abi_mips_o32 -abi_s390_32 -abi_s390_64 -abi_x86_32 abi_x86_64 -abi_x86_x32 clock-gettime -debug -malloc-replacement ssl -static-libs -test threads -verbose-debug
dev-libs/libffi-3.4.2-r1:0/8 -abi_mips_n32 -abi_mips_n64 -abi_mips_o32 -abi_s390_32 -abi_s390_64 -abi_x86_32 abi_x86_64 -abi_x86_x32 -debug -exec-static-trampoline -pax-kernel -static-libs -test
dev-libs/libgcrypt-1.9.4:0/20 -abi_mips_n32 -abi_mips_n64 -abi_mips_o32 -abi_s390_32 -abi_s390_64 -abi_x86_32 abi_x86_64 -abi_x86_x32 asm -cpu_flags_arm_neon cpu_flags_x86_aes cpu_flags_x86_avx cpu_flags_x86_avx2 -cpu_flags_x86_padlock -cpu_flags_x86_sha cpu_flags_x86_sse4_1 -doc -o-flag-munging -static-libs
dev-libs/libgpg-error-1.43:0 -abi_mips_n32 -abi_mips_n64 -abi_mips_o32 -abi_s390_32 -abi_s390_64 -abi_x86_32 abi_x86_64 -abi_x86_x32 -common-lisp nls -static-libs
dev-libs/libksba-1.6.0:0 -static-libs
dev-libs/libltdl-2.4.6:0 -abi_mips_n32 -abi_mips_n64 -abi_mips_o32 -abi_s390_32 -abi_s390_64 -abi_x86_32 abi_x86_64 -abi_x86_x32 -static-libs
dev-libs/libpcre-8.45:3 -abi_mips_n32 -abi_mips_n64 -abi_mips_o32 -abi_s390_32 -abi_s390_64 -abi_x86_32 abi_x86_64 -abi_x86_x32 bzip2 cxx -jit -libedit pcre16 pcre32 readline recursion-limit split-usr -static-libs unicode zlib
dev-libs/libpcre2-10.39:0/3 -abi_mips_n32 -abi_mips_n64 -abi_mips_o32 -abi_s390_32 -abi_s390_64 -abi_x86_32 abi_x86_64 -abi_x86_x32 bzip2 -jit -libedit pcre16 pcre32 readline recursion-limit split-usr -static-libs unicode zlib
dev-libs/libpipeline-1.5.4:0 -test
dev-libs/libtasn1-4.18.0:0/6 -abi_mips_n32 -abi_mips_n64 -abi_mips_o32 -abi_s390_32 -abi_s390_64 -abi_x86_32 abi_x86_64 -abi_x86_x32 -static-libs -test -valgrind
dev-libs/libunistring-0.9.10-r1:0/2 -abi_mips_n32 -abi_mips_n64 -abi_mips_o32 -abi_s390_32 -abi_s390_64 -abi_x86_32 abi_x86_64 -abi_x86_x32 -doc -static-libs
dev-libs/libutf8proc-2.6.1:0/2.6.1 -cjk -static-libs -test
dev-libs/libuv-1.42.0:0/1 -abi_mips_n32 -abi_mips_n64 -abi_mips_o32 -abi_s390_32 -abi_s390_64 -abi_x86_32 abi_x86_64 -abi_x86_x32
dev-libs/libxml2-2.9.12-r5:2 -abi_mips_n32 -abi_mips_n64 -abi_mips_o32 -abi_s390_32 -abi_s390_64 -abi_x86_32 abi_x86_64 -abi_x86_x32 -debug -examples -icu ipv6 -lzma python python_targets_python3_10 python_targets_python3_8 python_targets_python3_9 readline -static-libs -test -verify-sig
dev-libs/libxslt-1.1.34-r2:0 -abi_mips_n32 -abi_mips_n64 -abi_mips_o32 -abi_s390_32 -abi_s390_64 -abi_x86_32 abi_x86_64 -abi_x86_x32 crypt -debug -examples -static-libs -verify-sig
dev-libs/lzo-2.10:2 -abi_mips_n32 -abi_mips_n64 -abi_mips_o32 -abi_s390_32 -abi_s390_64 -abi_x86_32 abi_x86_64 -abi_x86_x32 -examples split-usr -static-libs
dev-libs/mpc-1.2.1:0/3 -abi_mips_n32 -abi_mips_n64 -abi_mips_o32 -abi_s390_32 -abi_s390_64 -abi_x86_32 abi_x86_64 -abi_x86_x32 -static-libs
dev-libs/mpfr-4.1.0_p13-r1:0/6 -abi_mips_n32 -abi_mips_n64 -abi_mips_o32 -abi_s390_32 -abi_s390_64 -abi_x86_32 abi_x86_64 -abi_x86_x32 -static-libs
dev-libs/nettle-3.7.3:0/8-6 -abi_mips_n32 -abi_mips_n64 -abi_mips_o32 -abi_s390_32 -abi_s390_64 -abi_x86_32 abi_x86_64 -abi_x86_x32 asm -cpu_flags_arm_neon cpu_flags_x86_aes -cpu_flags_x86_sha -doc gmp -static-libs -test
dev-libs/npth-1.6-r1:0
dev-libs/openssl-1.1.1m:0/1.1 -abi_mips_n32 -abi_mips_n64 -abi_mips_o32 -abi_s390_32 -abi_s390_64 -abi_x86_32 abi_x86_64 -abi_x86_x32 asm cpu_flags_x86_sse2 -rfc3779 -sctp -sslv3 -static-libs -test -tls-compression -tls-heartbeat -vanilla
dev-libs/popt-1.18:0 -abi_mips_n32 -abi_mips_n64 -abi_mips_o32 -abi_s390_32 -abi_s390_64 -abi_x86_32 abi_x86_64 -abi_x86_x32 nls -static-libs
dev-perl/Devel-CheckLib-1.140.0:0 -test
dev-perl/Encode-Locale-1.50.0-r1:0 -test
dev-perl/File-Listing-6.140.0:0 -test
dev-perl/HTML-Parser-3.760.0:0 -test
dev-perl/HTML-Tagset-3.200.0-r2:0
dev-perl/HTTP-Cookies-6.100.0:0 -test
dev-perl/HTTP-Date-6.50.0:0
dev-perl/HTTP-Message-6.330.0:0 -test -test
dev-perl/HTTP-Negotiate-6.10.0-r2:0 -test
dev-perl/IO-HTML-1.4.0:0 -test
dev-perl/IO-Socket-INET6-2.720.0-r2:0 -test
dev-perl/IO-Socket-SSL-2.72.0:0 -examples -idn -test
dev-perl/libwww-perl-6.600.0-r1:0 ssl -test
dev-perl/Locale-gettext-1.70.0-r1:0 -test
dev-perl/LWP-MediaTypes-6.40.0:0 -test
dev-perl/LWP-Protocol-https-6.100.0:0 -test
dev-perl/Module-Build-0.423.100:0 -test
dev-perl/Mozilla-CA-20999999-r1:0 -test
dev-perl/Net-HTTP-6.210.0:0 -minimal -test
dev-perl/Net-SSLeay-1.900.0:0 -examples -examples -minimal -test
dev-perl/Socket6-0.290.0:0 -test
dev-perl/TimeDate-2.330.0-r1:0 -test
dev-perl/Try-Tiny-0.310.0:0 -minimal -test
dev-perl/URI-5.100.0:0 -test
dev-perl/WWW-RobotRules-6.20.0-r2:0 -test
dev-perl/XML-Parser-2.460.0-r2:0
dev-python/certifi-3021.3.16-r1:0 -python_targets_pypy3 python_targets_python3_10 python_targets_python3_8 python_targets_python3_9 -test
dev-python/charset_normalizer-2.0.9:0 -python_targets_pypy3 python_targets_python3_10 python_targets_python3_8 python_targets_python3_9 -test
dev-python/docutils-0.18.1:0 -python_targets_pypy3 python_targets_python3_10 python_targets_python3_8 python_targets_python3_9
dev-python/idna-3.3:0 -python_targets_pypy3 python_targets_python3_10 python_targets_python3_8 python_targets_python3_9
dev-python/jinja-3.0.3:0 -doc -examples -python_targets_pypy3 python_targets_python3_10 python_targets_python3_8 python_targets_python3_9 -test
dev-python/markupsafe-2.0.1:0 -python_targets_pypy3 python_targets_python3_10 python_targets_python3_8 python_targets_python3_9 -test
dev-python/packaging-21.3-r1:0 -python_targets_pypy3 python_targets_python3_10 python_targets_python3_8 python_targets_python3_9 -test
dev-python/pygments-2.10.0:0 -doc -python_targets_pypy3 python_targets_python3_10 python_targets_python3_8 python_targets_python3_9 -test
dev-python/pyparsing-3.0.6:0 -examples -python_targets_pypy3 python_targets_python3_10 python_targets_python3_8 python_targets_python3_9 -test
dev-python/pypax-0.9.5:0 -ptpax python_targets_python3_8 python_targets_python3_9 xtpax
dev-python/PySocks-1.7.1-r1:0 -python_targets_pypy3 python_targets_python3_10 python_targets_python3_8 python_targets_python3_9
dev-python/requests-2.26.0:0 -python_targets_pypy3 python_targets_python3_10 python_targets_python3_8 python_targets_python3_9 -socks5 -test
dev-python/setuptools-59.8.0:0 -python_targets_pypy3 python_targets_python3_10 python_targets_python3_8 python_targets_python3_9 -test
dev-python/setuptools_scm-6.3.2:0 -python_targets_pypy3 python_targets_python3_10 python_targets_python3_8 python_targets_python3_9 -test
dev-python/tomli-2.0.0:0 -python_targets_pypy3 python_targets_python3_10 python_targets_python3_8 python_targets_python3_9 -test
dev-python/urllib3-1.26.7:0 -brotli -python_targets_pypy3 python_targets_python3_10 python_targets_python3_8 python_targets_python3_9 -test
dev-util/cmake-3.22.1:0 -doc -emacs ncurses -qt5 -test -test
dev-util/ctags-20211017.0:0 -json -xml -yaml
dev-util/desktop-file-utils-0.26-r1:0 -emacs
dev-util/glib-utils-2.70.2:0 -python_single_target_python3_10 -python_single_target_python3_8 python_single_target_python3_9
dev-util/gperf-3.1:0
dev-util/gtk-doc-am-1.33.2:0
dev-util/intltool-0.51.0-r2:0
dev-util/meson-0.60.3:0 python_targets_python3_10 python_targets_python3_8 python_targets_python3_9 -test
dev-util/meson-format-array-0:0 python_targets_python3_10 python_targets_python3_8 python_targets_python3_9
dev-util/ninja-1.10.2-r1:0 -doc -emacs -test -vim-syntax
dev-util/pkgconf-1.8.0-r1:0/3 -abi_mips_n32 -abi_mips_n64 -abi_mips_o32 -abi_s390_32 -abi_s390_64 -abi_x86_32 abi_x86_64 -abi_x86_x32 -test
dev-util/re2c-2.2:0 -debug -test
dev-util/scons-4.3.0:0 -doc python_targets_python3_10 python_targets_python3_8 python_targets_python3_9 -test
dev-vcs/git-2.34.1-r1:0 blksha1 -cgi curl -cvs -doc -emacs -gnome-keyring gpg -highlight iconv -mediawiki -mediawiki-experimental nls pcre -perforce -perl -ppcsha1 -python_single_target_python3_10 -python_single_target_python3_8 python_single_target_python3_9 -subversion -test threads -tk webdav -xinetd
dev-vcs/subversion-1.14.1:0 -apache2 -apache2 -berkdb -debug -doc -extras -gnome-keyring -java -java -kwallet nls -perl -plaintext-password-storage -ruby -sasl -test
media-fonts/liberation-fonts-2.1.3:0 -X -X -fontforge
media-gfx/graphite2-1.3.14_p20210810:0 -abi_mips_n32 -abi_mips_n64 -abi_mips_o32 -abi_s390_32 -abi_s390_64 -abi_x86_32 abi_x86_64 -abi_x86_x32 -perl -test
media-libs/fontconfig-2.13.1-r2:1.0 -abi_mips_n32 -abi_mips_n64 -abi_mips_o32 -abi_s390_32 -abi_s390_64 -abi_x86_32 abi_x86_64 -abi_x86_x32 -doc -static-libs
media-libs/freetype-2.11.1:2 -X -abi_mips_n32 -abi_mips_n64 -abi_mips_o32 -abi_s390_32 -abi_s390_64 -abi_x86_32 abi_x86_64 -abi_x86_x32 adobe-cff -brotli bzip2 cleartype-hinting -debug -doc -fontforge harfbuzz -infinality png -static-libs -utils
media-libs/harfbuzz-3.2.0:0/3.0.0 -abi_mips_n32 -abi_mips_n64 -abi_mips_o32 -abi_s390_32 -abi_s390_64 -abi_x86_32 abi_x86_64 -abi_x86_x32 cairo -debug -doc -experimental glib graphite -icu introspection -test truetype
media-libs/libpng-1.6.37-r2:0/16 -abi_mips_n32 -abi_mips_n64 -abi_mips_o32 -abi_s390_32 -abi_s390_64 -abi_x86_32 abi_x86_64 -abi_x86_x32 -apng -cpu_flags_arm_neon cpu_flags_x86_sse -static-libs
net-dns/libidn2-2.3.2:0/2 -abi_mips_n32 -abi_mips_n64 -abi_mips_o32 -abi_s390_32 -abi_s390_64 -abi_x86_32 abi_x86_64 -abi_x86_x32 -static-libs -verify-sig
net-firewall/iptables-1.8.7:0/1.8.3 -conntrack ipv6 -netlink -nftables -pcap split-usr -static-libs
net-libs/gnutls-3.7.2:0/30 -abi_mips_n32 -abi_mips_n64 -abi_mips_o32 -abi_s390_32 -abi_s390_64 -abi_x86_32 abi_x86_64 -abi_x86_x32 cxx -dane -doc -examples -guile idn nls openssl -pkcs11 seccomp -sslv2 -sslv3 -static-libs -test -test-full tls-heartbeat -tools -valgrind
net-libs/libmnl-1.0.4:0/0.2.0 -examples split-usr -static-libs
net-libs/nghttp2-1.46.0:0/1.14 -abi_mips_n32 -abi_mips_n64 -abi_mips_o32 -abi_s390_32 -abi_s390_64 -abi_x86_32 abi_x86_64 -abi_x86_x32 -cxx -debug -hpack-tools -jemalloc -static-libs -test threads -utils -xml
net-libs/serf-1.3.9-r2:1 -kerberos -static-libs
net-misc/curl-7.80.0:0 -abi_mips_n32 -abi_mips_n64 -abi_mips_o32 -abi_s390_32 -abi_s390_64 -abi_x86_32 abi_x86_64 -abi_x86_x32 -adns -alt-svc -brotli -curl_ssl_gnutls -curl_ssl_mbedtls -curl_ssl_nss curl_ssl_openssl ftp -gnutls -gopher -hsts http2 -idn imap ipv6 -kerberos -ldap -mbedtls -nghttp3 -nss openssl pop3 progress-meter -quiche -rtmp -samba smtp -ssh ssl -sslv3 -static-libs -telnet -test tftp -threads -zstd
net-misc/iputils-20210722-r1:0 arping -caps -clockdiff -doc filecaps -gcrypt -idn ipv6 -nettle nls -rarpd -rdisc ssl -static -test -tftpd -tracepath -traceroute6
net-misc/netifrc-0.7.3:0
net-misc/openssh-8.8_p1-r4:0 -X -X509 -abi_mips_n32 -audit -debug -hpn -kerberos -ldns -libedit -livecd pam pie scp -sctp -security-key -selinux ssl -static -test -xmss
net-misc/rsync-3.2.3-r5:0 acl -examples iconv ipv6 -lz4 ssl -stunnel -system-zlib xattr -xxhash -zstd
net-misc/wget-1.21.2:0 -cookie_check -debug -gnutls -idn ipv6 -metalink nls -ntlm pcre ssl -static -test -uuid zlib
perl-core/CPAN-2.290.0-r1:0
perl-core/Encode-3.120.0:0
perl-core/File-Temp-0.231.100:0
perl-core/Scalar-List-Utils-1.560.0:0
sec-keys/openpgp-keys-gentoo-release-20200704:0 -test
sys-apps/acl-2.3.1:0 -abi_mips_n32 -abi_mips_n64 -abi_mips_o32 -abi_s390_32 -abi_s390_64 -abi_x86_32 abi_x86_64 -abi_x86_x32 nls split-usr -static-libs
sys-apps/attr-2.5.1:0 -abi_mips_n32 -abi_mips_n64 -abi_mips_o32 -abi_s390_32 -abi_s390_64 -abi_x86_32 abi_x86_64 -abi_x86_x32 -debug nls split-usr -static-libs
sys-apps/baselayout-2.8:0 -build split-usr
sys-apps/coreutils-9.0-r1:0 acl -caps -gmp -hostname -kill -multicall nls -selinux split-usr -static -test -vanilla xattr
sys-apps/dbus-1.12.20-r4:0 -X -abi_mips_n32 -abi_mips_n64 -abi_mips_o32 -abi_s390_32 -abi_s390_64 -abi_x86_32 abi_x86_64 -abi_x86_x32 -debug -doc elogind -selinux -static-libs -systemd -test -test
sys-apps/debianutils-5.5:0 installkernel -static
sys-apps/diffutils-3.8:0 nls -static
sys-apps/elfix-0.9.5:0 -ptpax xtpax
sys-apps/file-5.41:0 -abi_mips_n32 -abi_mips_n64 -abi_mips_o32 -abi_s390_32 -abi_s390_64 -abi_x86_32 abi_x86_64 -abi_x86_x32 bzip2 -lzma -python python_targets_python3_10 python_targets_python3_8 python_targets_python3_9 -seccomp -static-libs zlib
sys-apps/findutils-4.8.0-r1:0 nls -selinux -static -test
sys-apps/gawk-5.1.1-r1:0 -mpfr nls readline
sys-apps/gentoo-functions-0.15:0
sys-apps/grep-3.7:0 nls pcre -static
sys-apps/groff-1.22.4:0 -X -examples -uchardet
sys-apps/help2man-1.48.5:0 nls
sys-apps/install-xattr-0.8:0
sys-apps/iproute2-5.15.0:0 -atm -berkdb -bpf -caps -elf iptables ipv6 -libbsd -minimal -selinux
sys-apps/kbd-2.4.0:0 nls pam -test
sys-apps/kmod-29:0 -debug -doc lzma -pkcs7 -python python_targets_python3_10 python_targets_python3_8 python_targets_python3_9 -static-libs tools zlib -zstd
sys-apps/less-590:0 pcre unicode
sys-apps/man-db-2.9.4-r1:0 -berkdb -gdbm manpager -nls seccomp -selinux -static-libs zlib
sys-apps/net-tools-2.10:0 arp hostname ipv6 -nis nls -plipconfig -selinux -slattach -static
sys-apps/openrc-0.44.10:0 -audit -bash -debug ncurses netifrc -newnet pam -selinux -sysv-utils unicode
sys-apps/portage-3.0.30-r1:0 -apidoc -build -doc -gentoo-dev ipc native-extensions -python_targets_pypy3 python_targets_python3_10 python_targets_python3_8 python_targets_python3_9 rsync-verify -selinux -test xattr
sys-apps/sandbox-2.29:0 -abi_mips_n32 -abi_mips_n64 -abi_mips_o32 -abi_s390_32 -abi_s390_64 -abi_x86_32 abi_x86_64 -abi_x86_x32 nnp
sys-apps/sed-4.8:0 acl nls -selinux -static
sys-apps/shadow-4.10-r4:0/4 acl -audit -bcrypt -cracklib nls pam -selinux -skey split-usr -su xattr
sys-apps/systemd-tmpfiles-249.5:0 -selinux -test
sys-apps/sysvinit-3.01:0 -ibm -selinux -static
sys-apps/texinfo-6.8:0 nls standalone -static
sys-apps/util-linux-2.37.2-r3:0 -abi_mips_n32 -abi_mips_n64 -abi_mips_o32 -abi_s390_32 -abi_s390_64 -abi_x86_32 abi_x86_64 -abi_x86_x32 -audit -build -caps cramfs -cryptsetup -fdformat hardlink -kill logger -magic ncurses nls pam -python python_targets_python3_10 python_targets_python3_8 python_targets_python3_9 readline -rtas -selinux -slang split-usr -static-libs su suid -systemd -test -tty-helpers -udev unicode
sys-apps/which-2.21:0
sys-auth/elogind-246.10-r2:0 acl -audit cgroup-hybrid -debug -doc pam -policykit -selinux
sys-auth/pambase-20211218-r1:0 -caps -debug elogind -gnome-keyring -homed -minimal -mktemp nullok -pam_krb5 -pam_ssh passwdqc -pwhistory -pwquality -securetty -selinux sha512 -systemd -yescrypt
sys-auth/passwdqc-2.0.2-r1:0
sys-devel/autoconf-2.71-r1:2.71 -emacs
sys-devel/autoconf-archive-2021.02.19-r1:0
sys-devel/autoconf-wrapper-15:0
sys-devel/automake-1.16.5:1.16 -test
sys-devel/automake-wrapper-11:0
sys-devel/binutils-2.37_p1-r1:2.37 -cet -default-gold -doc gold -multitarget nls plugins -static-libs -test -vanilla
sys-devel/binutils-config-5.4:0 native-symlinks
sys-devel/bison-3.8.2:0 -examples nls -static -test
sys-devel/flex-2.6.4-r1:0 -abi_mips_n32 -abi_mips_n64 -abi_mips_o32 -abi_s390_32 -abi_s390_64 -abi_x86_32 abi_x86_64 -abi_x86_x32 nls -static -test
sys-devel/gcc-11.2.1_p20211127:11 -ada -cet -custom-cflags cxx -d -debug -doc -fixed-point -fortran -go graphite hardened -jit -libssp lto -multilib -nls nptl -objc -objc++ -objc-gc openmp -pch -pgo pie -sanitize ssp -systemtap -test -valgrind -vanilla -vtv -zstd
sys-devel/gcc-config-2.5-r1:0 cc-wrappers native-symlinks
sys-devel/gettext-0.21-r1:0 -abi_mips_n32 -abi_mips_n64 -abi_mips_o32 -abi_s390_32 -abi_s390_64 -abi_x86_32 abi_x86_64 -abi_x86_x32 acl -cvs cxx -doc -emacs -git -java -java ncurses -nls openmp -static-libs
sys-devel/gnuconfig-20210107:0
sys-devel/libtool-2.4.6-r6:2 -vanilla
sys-devel/m4-1.4.19:0 -examples nls
sys-devel/make-4.3:0 -guile nls -static
sys-devel/patch-2.7.6-r4:0 -static -test xattr
sys-fs/e2fsprogs-1.46.4:0 -cron -fuse -lto -nls split-usr -static-libs threads
sys-fs/udev-249.6-r2:0 -abi_mips_n32 -abi_mips_n64 -abi_mips_o32 -abi_s390_32 -abi_s390_64 -abi_x86_32 abi_x86_64 -abi_x86_x32 acl kmod -selinux split-usr -test
sys-fs/udev-init-scripts-35:0
sys-kernel/installkernel-gentoo-3:0
sys-kernel/linux-headers-5.15-r1:0 -headers-only
sys-libs/argp-standalone-1.4.1-r1:0 -static-libs
sys-libs/binutils-libs-2.37_p1-r1:0/2.37 -64-bit-bfd -abi_mips_n32 -abi_mips_n64 -abi_mips_o32 -abi_s390_32 -abi_s390_64 -abi_x86_32 abi_x86_64 -abi_x86_x32 -cet -multitarget nls -static-libs
sys-libs/e2fsprogs-libs-1.46.4:0 -abi_mips_n32 -abi_mips_n64 -abi_mips_o32 -abi_s390_32 -abi_s390_64 -abi_x86_32 abi_x86_64 -abi_x86_x32 split-usr -static-libs
sys-libs/fts-standalone-1.2.7:0 -static-libs
sys-libs/gdbm-1.22:0/6 -abi_mips_n32 -abi_mips_n64 -abi_mips_o32 -abi_s390_32 -abi_s390_64 -abi_x86_32 abi_x86_64 -abi_x86_x32 berkdb nls readline -static-libs
sys-libs/libcap-2.62:0 -abi_mips_n32 -abi_mips_n64 -abi_mips_o32 -abi_s390_32 -abi_s390_64 -abi_x86_32 abi_x86_64 -abi_x86_x32 pam split-usr -static-libs -tools
sys-libs/libseccomp-2.5.3:0 -abi_mips_n32 -abi_mips_n64 -abi_mips_o32 -abi_s390_32 -abi_s390_64 -abi_x86_32 abi_x86_64 -abi_x86_x32 -python python_targets_python3_10 python_targets_python3_8 python_targets_python3_9 -static-libs -test
sys-libs/musl-1.2.2-r7:0 -headers-only
sys-libs/ncurses-6.3_p20211106:0/6 -abi_mips_n32 -abi_mips_n64 -abi_mips_o32 -abi_s390_32 -abi_s390_64 -abi_x86_32 abi_x86_64 -abi_x86_x32 -ada cxx -debug -doc -gpm -minimal -profile split-usr -static-libs -test tinfo -trace
sys-libs/obstack-standalone-1.1:0 -static-libs
sys-libs/pam-1.5.2-r1:0 -abi_mips_n32 -abi_mips_n64 -abi_mips_o32 -abi_s390_32 -abi_s390_64 -abi_x86_32 abi_x86_64 -abi_x86_x32 -audit -berkdb -debug -filecaps -nis -selinux
sys-libs/readline-8.1_p1-r1:0/8 -abi_mips_n32 -abi_mips_n64 -abi_mips_o32 -abi_s390_32 -abi_s390_64 -abi_x86_32 abi_x86_64 -abi_x86_x32 split-usr -static-libs unicode -utils
sys-libs/zlib-1.2.11-r4:0/1 -abi_mips_n32 -abi_mips_n64 -abi_mips_o32 -abi_s390_32 -abi_s390_64 -abi_x86_32 abi_x86_64 -abi_x86_x32 minizip split-usr -static-libs
sys-process/procps-3.3.17-r1:0/8 -abi_mips_n32 -abi_mips_n64 -abi_mips_o32 -abi_s390_32 -abi_s390_64 -abi_x86_32 abi_x86_64 -abi_x86_x32 elogind kill -modern-top ncurses nls -selinux split-usr -static-libs -systemd -test unicode
sys-process/psmisc-23.4-r1:0 -X ipv6 nls -selinux
virtual/acl-0-r2:0 -abi_mips_n32 -abi_mips_n64 -abi_mips_o32 -abi_s390_32 -abi_s390_64 -abi_x86_32 abi_x86_64 -abi_x86_x32 -static-libs
virtual/awk-1:0
virtual/dev-manager-0-r2:0
virtual/editor-0-r3:0
virtual/libc-1-r1:0
virtual/libcrypt-1-r1:0/1 -abi_mips_n32 -abi_mips_n64 -abi_mips_o32 -abi_s390_32 -abi_s390_64 -abi_x86_32 abi_x86_64 -abi_x86_x32 -static-libs
virtual/libelf-3:0/1 -abi_mips_n32 -abi_mips_n64 -abi_mips_o32 -abi_s390_32 -abi_s390_64 -abi_x86_32 abi_x86_64 -abi_x86_x32
virtual/libiconv-0-r2:0 -abi_mips_n32 -abi_mips_n64 -abi_mips_o32 -abi_s390_32 -abi_s390_64 -abi_x86_32 abi_x86_64 -abi_x86_x32
virtual/libintl-0-r2:0 -abi_mips_n32 -abi_mips_n64 -abi_mips_o32 -abi_s390_32 -abi_s390_64 -abi_x86_32 abi_x86_64 -abi_x86_x32
virtual/libudev-232-r5:0/1 -abi_mips_n32 -abi_mips_n64 -abi_mips_o32 -abi_s390_32 -abi_s390_64 -abi_x86_32 abi_x86_64 -abi_x86_x32 -systemd
virtual/man-0-r4:0
virtual/os-headers-0-r2:0
virtual/package-manager-1:0
virtual/pager-0:0
virtual/perl-Carp-1.520.0-r1:0
virtual/perl-Compress-Raw-Bzip2-2.101.0:0
virtual/perl-Compress-Raw-Zlib-2.101.0:0
virtual/perl-CPAN-2.290.0:0
virtual/perl-CPAN-Meta-2.150.10-r5:0
virtual/perl-CPAN-Meta-Requirements-2.140.0-r7:0
virtual/perl-CPAN-Meta-YAML-0.18.0-r7:0
virtual/perl-Data-Dumper-2.179.0:0
virtual/perl-Digest-MD5-2.580.0:0
virtual/perl-Encode-3.120.0:0
virtual/perl-Exporter-5.760.0:0
virtual/perl-ExtUtils-CBuilder-0.280.236:0
virtual/perl-ExtUtils-Install-2.200.0:0
virtual/perl-ExtUtils-MakeMaker-7.620.0:0
virtual/perl-ExtUtils-Manifest-1.730.0:0
virtual/perl-ExtUtils-ParseXS-3.430.0:0
virtual/perl-File-Spec-3.800.0:0
virtual/perl-File-Temp-0.231.100:0
virtual/perl-Getopt-Long-2.520.0:0
virtual/perl-IO-1.460.0:0
virtual/perl-IO-Compress-2.102.0:0
virtual/perl-IO-Socket-IP-0.410.0:0
virtual/perl-JSON-PP-4.60.0:0
virtual/perl-libnet-3.130.0:0 ssl
virtual/perl-MIME-Base64-3.160.0:0
virtual/perl-Module-Metadata-1.0.37-r1:0
virtual/perl-parent-0.238.0-r1:0
virtual/perl-Parse-CPAN-Meta-2.150.10-r5:0
virtual/perl-Perl-OSType-1.10.0-r5:0
virtual/perl-podlators-4.140.0-r2:0
virtual/perl-Scalar-List-Utils-1.560.0:0
virtual/perl-Test-Harness-3.430.0:0
virtual/perl-Text-ParseWords-3.300.0-r8:0
virtual/perl-Time-Local-1.300.0:0
virtual/perl-version-0.992.800:0
virtual/perl-XSLoader-0.300.0-r4:0
virtual/pkgconfig-2-r1:0
virtual/service-manager-1:0
virtual/ssh-0:0 -minimal
virtual/tmpfiles-0-r1:0
virtual/ttf-fonts-1-r1:0
virtual/udev-217-r3:0
virtual/yacc-0:0
www-client/pybugz-0.13-r1:0 python_targets_python3_8 python_targets_python3_9
x11-libs/cairo-1.16.0-r5:0 -X -abi_mips_n32 -abi_mips_n64 -abi_mips_o32 -abi_s390_32 -abi_s390_64 -abi_x86_32 abi_x86_64 -abi_x86_x32 -aqua -debug -gles2-only glib -opengl -static-libs svg -utils -valgrind
x11-libs/pixman-0.40.0:0 -abi_mips_n32 -abi_mips_n64 -abi_mips_o32 -abi_s390_32 -abi_s390_64 -abi_x86_32 abi_x86_64 -abi_x86_x32 -cpu_flags_arm_iwmmxt -cpu_flags_arm_iwmmxt2 -cpu_flags_arm_neon -cpu_flags_ppc_altivec cpu_flags_x86_mmxext cpu_flags_x86_sse2 cpu_flags_x86_ssse3 -loongson2f -static-libs
x11-misc/shared-mime-info-2.1:0


#######################
# build.log           #
#######################
>>> Unpacking source...
>>> Unpacking fsvs-1.2.5.tar.bz2 to /var/tmp/portage/app-admin/fsvs-1.2.5-r2/work
>>> Source unpacked in /var/tmp/portage/app-admin/fsvs-1.2.5-r2/work
>>> Preparing source in /var/tmp/portage/app-admin/fsvs-1.2.5-r2/work/fsvs-1.2.5 ...
 * Applying fsvs-1.2.5-as-needed.patch ...
 [ ok ]
>>> Source prepared.
>>> Configuring source in /var/tmp/portage/app-admin/fsvs-1.2.5-r2/work/fsvs-1.2.5 ...
./configure --prefix=/usr --build=x86_64-gentoo-linux-musl --host=x86_64-gentoo-linux-musl --mandir=/usr/share/man --infodir=/usr/share/info --datadir=/usr/share --sysconfdir=/etc --localstatedir=/var/lib --docdir=/usr/share/doc/fsvs-1.2.5-r2 --htmldir=/usr/share/doc/fsvs-1.2.5-r2/html --libdir=/usr/lib
checking for x86_64-gentoo-linux-musl-gcc... x86_64-gentoo-linux-musl-gcc
checking whether the C compiler works... yes
checking for C compiler default output file name... a.out
checking for suffix of executables... 
checking whether we are cross compiling... no
checking for suffix of object files... o
checking whether we are using the GNU C compiler... yes
checking whether x86_64-gentoo-linux-musl-gcc accepts -g... yes
checking for x86_64-gentoo-linux-musl-gcc option to accept ISO C89... none needed
checking how to run the C preprocessor... x86_64-gentoo-linux-musl-gcc -E
checking for grep that handles long lines and -e... /bin/grep
checking for egrep... /bin/grep -E
checking for ANSI C header files... yes
checking for sys/types.h... yes
checking for sys/stat.h... yes
checking for stdlib.h... yes
checking for string.h... yes
checking for memory.h... yes
checking for strings.h... yes
checking for inttypes.h... yes
checking for stdint.h... yes
checking for unistd.h... yes
checking minix/config.h usability... no
checking minix/config.h presence... no
checking for minix/config.h... no
checking whether it is safe to define __EXTENSIONS__... yes
configure: ***  Now configuring FSVS   ***
checking for x86_64-gentoo-linux-musl-gcc... (cached) x86_64-gentoo-linux-musl-gcc
checking whether we are using the GNU C compiler... (cached) yes
checking whether x86_64-gentoo-linux-musl-gcc accepts -g... (cached) yes
checking for x86_64-gentoo-linux-musl-gcc option to accept ISO C89... (cached) none needed
checking how to run the C preprocessor... x86_64-gentoo-linux-musl-gcc -E
configure: "CFLAGS=-O2 -pipe -march=x86-64 -frecord-gcc-switches -fno-diagnostics-color -fmessage-length=0 -std=gnu89 -D_GNU_SOURCE=1 -D_FILE_OFFSET_BITS=64 -idirafter /usr/local/include -idirafter /usr/include -idirafter /openpkg/include -idirafter /usr/include/apr-1"
configure: "LDFLAGS=-Wl,-O1 -Wl,--as-needed -Wl,--defsym=__gentoo_check_ldflags__=0 -L/usr/local/lib -L/openpkg/lib"
checking for pcre_compile in -lpcre... yes
checking for apr_md5_init in -laprutil-1... yes
checking for svn_txdelta_apply in -lsvn_delta-1... yes
checking for svn_ra_initialize in -lsvn_ra-1... yes
checking for gdbm_firstkey in -lgdbm... yes
checking for ANSI C header files... (cached) yes
checking fcntl.h usability... yes
checking fcntl.h presence... yes
checking for fcntl.h... yes
checking stddef.h usability... yes
checking stddef.h presence... yes
checking for stddef.h... yes
checking for stdlib.h... (cached) yes
checking for string.h... (cached) yes
checking sys/time.h usability... yes
checking sys/time.h presence... yes
checking for sys/time.h... yes
checking for unistd.h... (cached) yes
checking pcre.h usability... yes
checking pcre.h presence... yes
checking for pcre.h... yes
checking for dirent.h that defines DIR... yes
checking for library containing opendir... none required
checking for struct stat.st_mtim... yes
configure: No compatible valgrind version.
configure: No compatible valgrind version.
checking linux/kdev_t.h usability... yes
checking linux/kdev_t.h presence... yes
checking for linux/kdev_t.h... yes
checking for getdents64... yes
checking linux/types.h usability... yes
checking linux/types.h presence... yes
checking for linux/types.h... yes
checking linux/unistd.h usability... yes
checking linux/unistd.h presence... yes
checking for linux/unistd.h... yes
checking for comparison_fn_t... no
checking for special C compiler options needed for large files... no
checking for _FILE_OFFSET_BITS value needed for large files... no
checking for an ANSI C-conforming const... yes
checking for inline... inline
checking for struct stat.st_rdev... yes
checking whether time.h and sys/time.h may both be included... yes
checking whether struct tm is in sys/time.h or time.h... time.h
checking for uint32_t... yes
checking for uint64_t... yes
checking for uid_t in sys/types.h... yes
checking for unistd.h... (cached) yes
checking for working chown... yes
checking for pid_t... yes
checking vfork.h usability... no
checking vfork.h presence... no
checking for vfork.h... no
checking for fork... yes
checking for vfork... yes
checking for working fork... yes
checking for working vfork... (cached) yes
checking for stdlib.h... (cached) yes
checking for GNU libc compatible malloc... yes
checking for working memcmp... yes
checking for stdlib.h... (cached) yes
checking for unistd.h... (cached) yes
checking for sys/param.h... yes
checking for getpagesize... yes
checking for working mmap... yes
checking for stdlib.h... (cached) yes
checking for GNU libc compatible realloc... yes
checking return type of signal handlers... void
checking for vprintf... yes
checking for _doprnt... no
checking for fchdir... yes
checking for getcwd... yes
checking for gettimeofday... yes
checking for memmove... yes
checking for memset... yes
checking for mkdir... yes
checking for munmap... yes
checking for rmdir... yes
checking for strchr... yes
checking for strdup... yes
checking for strerror... yes
checking for strrchr... yes
checking for strtoul... yes
checking for strtoull... yes
checking for alphasort... yes
checking for dirfd... yes
checking for lchown... yes
checking for lutimes... yes
checking for strsep... yes
configure: creating ./config.status
config.status: creating src/Makefile
config.status: WARNING:  'src/Makefile.in' seems to ignore the --datarootdir setting
config.status: creating tests/Makefile
config.status: creating src/config.h
>>> Source configured.
>>> Compiling source in /var/tmp/portage/app-admin/fsvs-1.2.5-r2/work/fsvs-1.2.5 ...
make -j2 CC=x86_64-gentoo-linux-musl-gcc 
     deps for warnings.c
     deps for waa.c
In file included from /usr/include/subversion-1/svn_md5.h:32,
                 from waa.c:15:
/usr/include/subversion-1/svn_types.h:261:26: error: missing binary operator before token "("
  261 | #if !APR_VERSION_AT_LEAST(1, 5, 0)
      |                          ^
In file included from /usr/include/subversion-1/svn_ra.h:37,
                 from global.h:22,
                 from options.h:13,
                 from warnings.h:13,
                 from warnings.c:14:
/usr/include/subversion-1/svn_types.h:261:26: error: missing binary operator before token "("
  261 | #if !APR_VERSION_AT_LEAST(1, 5, 0)
      |                          ^
     deps for url.c
     deps for update.c
In file included from /usr/include/subversion-1/svn_ra.h:37,
                 from global.h:22,
                 from actions.h:12,
                 from url.h:12,
                 from url.c:16:
/usr/include/subversion-1/svn_types.h:261:26: error: missing binary operator before token "("
  261 | #if !APR_VERSION_AT_LEAST(1, 5, 0)
      |                          ^
In file included from /usr/include/subversion-1/svn_delta.h:40,
                 from update.c:60:
/usr/include/subversion-1/svn_types.h:261:26: error: missing binary operator before token "("
  261 | #if !APR_VERSION_AT_LEAST(1, 5, 0)
      |                          ^
     deps for sync.c
     deps for status.c
In file included from /usr/include/subversion-1/svn_delta.h:40,
                 from sync.c:68:
/usr/include/subversion-1/svn_types.h:261:26: error: missing binary operator before token "("
  261 | #if !APR_VERSION_AT_LEAST(1, 5, 0)
      |                          ^
In file included from /usr/include/subversion-1/svn_ra.h:37,
                 from global.h:22,
                 from status.c:13:
/usr/include/subversion-1/svn_types.h:261:26: error: missing binary operator before token "("
  261 | #if !APR_VERSION_AT_LEAST(1, 5, 0)
      |                          ^
     deps for revert.c
     deps for resolve.c
In file included from /usr/include/subversion-1/svn_delta.h:40,
                 from revert.c:13:
/usr/include/subversion-1/svn_types.h:261:26: error: missing binary operator before token "("
  261 | #if !APR_VERSION_AT_LEAST(1, 5, 0)
      |                          ^
In file included from /usr/include/subversion-1/svn_ra.h:37,
                 from global.h:22,
                 from resolve.c:14:
/usr/include/subversion-1/svn_types.h:261:26: error: missing binary operator before token "("
  261 | #if !APR_VERSION_AT_LEAST(1, 5, 0)
      |                          ^
     deps for remote.c
     deps for racallback.c
     deps for props.c
In file included from /usr/include/subversion-1/svn_ra.h:37,
                 from racallback.c:18:
/usr/include/subversion-1/svn_types.h:261:26: error: missing binary operator before token "("
  261 | #if !APR_VERSION_AT_LEAST(1, 5, 0)
      |                          ^
In file included from /usr/include/subversion-1/svn_props.h:36,
                 from props.c:27:
/usr/include/subversion-1/svn_types.h:261:26: error: missing binary operator before token "("
  261 | #if !APR_VERSION_AT_LEAST(1, 5, 0)
      |                          ^
     deps for options.c
     deps for log.c
In file included from /usr/include/subversion-1/svn_ra.h:37,
                 from global.h:22,
                 from options.c:11:
/usr/include/subversion-1/svn_types.h:261:26: error: missing binary operator before token "("
  261 | #if !APR_VERSION_AT_LEAST(1, 5, 0)
      |                          ^
In file included from /usr/include/subversion-1/svn_ra.h:37,
                 from log.c:48:
/usr/include/subversion-1/svn_types.h:261:26: error: missing binary operator before token "("
  261 | #if !APR_VERSION_AT_LEAST(1, 5, 0)
      |                          ^
     deps for info.c
     deps for ignore.c
In file included from /usr/include/subversion-1/svn_ra.h:37,
                 from global.h:22,
                 from info.c:56:
/usr/include/subversion-1/svn_types.h:261:26: error: missing binary operator before token "("
  261 | #if !APR_VERSION_AT_LEAST(1, 5, 0)
      |                          ^
In file included from /usr/include/subversion-1/svn_ra.h:37,
                 from global.h:22,
                 from ignore.c:16:
/usr/include/subversion-1/svn_types.h:261:26: error: missing binary operator before token "("
  261 | #if !APR_VERSION_AT_LEAST(1, 5, 0)
      |                          ^
     deps for helper.c
     deps for hash_ops.c
In file included from /usr/include/subversion-1/svn_config.h:36,
                 from helper.c:22:
/usr/include/subversion-1/svn_types.h:261:26: error: missing binary operator before token "("
  261 | #if !APR_VERSION_AT_LEAST(1, 5, 0)
      |                          ^
In file included from /usr/include/subversion-1/svn_ra.h:37,
                 from global.h:22,
                 from hash_ops.c:11:
/usr/include/subversion-1/svn_types.h:261:26: error: missing binary operator before token "("
  261 | #if !APR_VERSION_AT_LEAST(1, 5, 0)
      |                          ^
     deps for fsvs.c
     deps for export.c
In file included from /usr/include/subversion-1/svn_error.h:39,
                 from fsvs.c:21:
/usr/include/subversion-1/svn_types.h:261:26: error: missing binary operator before token "("
  261 | #if !APR_VERSION_AT_LEAST(1, 5, 0)
      |                          ^
In file included from /usr/include/subversion-1/svn_delta.h:40,
                 from export.c:17:
/usr/include/subversion-1/svn_types.h:261:26: error: missing binary operator before token "("
  261 | #if !APR_VERSION_AT_LEAST(1, 5, 0)
      |                          ^
     deps for est_ops.c
     deps for direnum.c
In file included from /usr/include/subversion-1/svn_ra.h:37,
                 from global.h:22,
                 from est_ops.c:18:
/usr/include/subversion-1/svn_types.h:261:26: error: missing binary operator before token "("
  261 | #if !APR_VERSION_AT_LEAST(1, 5, 0)
      |                          ^
In file included from /usr/include/subversion-1/svn_ra.h:37,
                 from global.h:22,
                 from est_ops.h:13,
                 from direnum.c:20:
/usr/include/subversion-1/svn_types.h:261:26: error: missing binary operator before token "("
  261 | #if !APR_VERSION_AT_LEAST(1, 5, 0)
      |                          ^
     deps for diff.c
     deps for cp_mv.c
In file included from /usr/include/subversion-1/svn_ra.h:37,
                 from global.h:22,
                 from diff.c:17:
/usr/include/subversion-1/svn_types.h:261:26: error: missing binary operator before token "("
  261 | #if !APR_VERSION_AT_LEAST(1, 5, 0)
      |                          ^
In file included from /usr/include/subversion-1/svn_ra.h:37,
                 from global.h:22,
                 from cp_mv.c:12:
/usr/include/subversion-1/svn_types.h:261:26: error: missing binary operator before token "("
  261 | #if !APR_VERSION_AT_LEAST(1, 5, 0)
      |                          ^
     deps for commit.c
     deps for checksum.c
In file included from /usr/include/subversion-1/svn_delta.h:40,
                 from commit.c:72:
/usr/include/subversion-1/svn_types.h:261:26: error: missing binary operator before token "("
  261 | #if !APR_VERSION_AT_LEAST(1, 5, 0)
      |                          ^
In file included from /usr/include/subversion-1/svn_ra.h:37,
                 from global.h:22,
                 from checksum.h:12,
                 from checksum.c:16:
/usr/include/subversion-1/svn_types.h:261:26: error: missing binary operator before token "("
  261 | #if !APR_VERSION_AT_LEAST(1, 5, 0)
      |                          ^
     deps for checkout.c
     deps for cat.c
In file included from /usr/include/subversion-1/svn_ra.h:37,
                 from global.h:22,
                 from actions.h:12,
                 from url.h:12,
                 from checkout.c:16:
/usr/include/subversion-1/svn_types.h:261:26: error: missing binary operator before token "("
  261 | #if !APR_VERSION_AT_LEAST(1, 5, 0)
      |                          ^
In file included from /usr/include/subversion-1/svn_ra.h:37,
                 from global.h:22,
                 from cat.c:13:
/usr/include/subversion-1/svn_types.h:261:26: error: missing binary operator before token "("
  261 | #if !APR_VERSION_AT_LEAST(1, 5, 0)
      |                          ^
     deps for cache.c
     deps for build.c
In file included from /usr/include/subversion-1/svn_ra.h:37,
                 from global.h:22,
                 from cache.c:13:
/usr/include/subversion-1/svn_types.h:261:26: error: missing binary operator before token "("
  261 | #if !APR_VERSION_AT_LEAST(1, 5, 0)
      |                          ^
In file included from /usr/include/subversion-1/svn_ra.h:37,
                 from global.h:22,
                 from build.c:11:
/usr/include/subversion-1/svn_types.h:261:26: error: missing binary operator before token "("
  261 | #if !APR_VERSION_AT_LEAST(1, 5, 0)
      |                          ^
     deps for add_unvers.c
     deps for actions.c
In file included from /usr/include/subversion-1/svn_ra.h:37,
                 from global.h:22,
                 from add_unvers.c:11:
/usr/include/subversion-1/svn_types.h:261:26: error: missing binary operator before token "("
  261 | #if !APR_VERSION_AT_LEAST(1, 5, 0)
      |                          ^
In file included from /usr/include/subversion-1/svn_ra.h:37,
                 from global.h:22,
                 from actions.h:12,
                 from actions.c:12:
/usr/include/subversion-1/svn_types.h:261:26: error: missing binary operator before token "("
  261 | #if !APR_VERSION_AT_LEAST(1, 5, 0)
      |                          ^
     deps for ac_list.c
In file included from /usr/include/subversion-1/svn_ra.h:37,
                 from global.h:22,
                 from ac_list.c:9:
/usr/include/subversion-1/svn_types.h:261:26: error: missing binary operator before token "("
  261 | #if !APR_VERSION_AT_LEAST(1, 5, 0)
      |                          ^
/bin/sh: line 1: tags: No such file or directory
     tags
Not seen: S_ISDOOR
Not seen: NEED_FNESTED_FUNCTIONS
     CC ac_list.c
x86_64-gentoo-linux-musl-gcc -O2 -pipe -march=x86-64 -frecord-gcc-switches -fno-diagnostics-color -fmessage-length=0 -std=gnu89 -D_GNU_SOURCE=1 -D_FILE_OFFSET_BITS=64 -idirafter /usr/local/include -idirafter /usr/include -idirafter /openpkg/include -idirafter /usr/include/apr-1  -Wall -funsigned-char -Os -DFSVS_VERSION='"fsvs-1.2.5:2457"' -c -o ac_list.o ac_list.c
     CC actions.c
x86_64-gentoo-linux-musl-gcc -O2 -pipe -march=x86-64 -frecord-gcc-switches -fno-diagnostics-color -fmessage-length=0 -std=gnu89 -D_GNU_SOURCE=1 -D_FILE_OFFSET_BITS=64 -idirafter /usr/local/include -idirafter /usr/include -idirafter /openpkg/include -idirafter /usr/include/apr-1  -Wall -funsigned-char -Os -DFSVS_VERSION='"fsvs-1.2.5:2457"' -c -o actions.o actions.c
In file included from props.h:19,
                 from ac_list.c:24:
hash_ops.h:13:10: fatal error: db.h: No such file or directory
   13 | #include <db.h>
      |          ^~~~~~
compilation terminated.
make[1]: *** [Makefile:149: ac_list.o] Error 1
make[1]: *** Waiting for unfinished jobs....
In file included from est_ops.h:14,
                 from actions.c:13:
waa.h:286:41: warning: duplicate 'const' declaration specifier [-Wduplicate-decl-specifier[https://gcc.gnu.org/onlinedocs/gcc/Warning-Options.html#index-Wduplicate-decl-specifier]]
  286 | int waa__create_working_copy(const char const *wc_dir);
      |                                         ^~~~~
waa.h:289:38: warning: duplicate 'const' declaration specifier [-Wduplicate-decl-specifier[https://gcc.gnu.org/onlinedocs/gcc/Warning-Options.html#index-Wduplicate-decl-specifier]]
  289 | int waa__set_working_copy(const char const *wc_dir);
      |                                      ^~~~~
In file included from props.h:19,
                 from est_ops.h:15,
                 from actions.c:13:
hash_ops.h:13:10: fatal error: db.h: No such file or directory
   13 | #include <db.h>
      |          ^~~~~~
compilation terminated.
make[1]: *** [Makefile:149: actions.o] Error 1
make: *** [Makefile:2: default-target] Error 2
 * ERROR: app-admin/fsvs-1.2.5-r2::gentoo failed (compile phase):
 *   emake failed
 * 
 * If you need support, post the output of `emerge --info '=app-admin/fsvs-1.2.5-r2::gentoo'`,
 * the complete build log and the output of `emerge -pqv '=app-admin/fsvs-1.2.5-r2::gentoo'`.
 * The complete build log is located at '/var/log/emerge-log/build/app-admin/fsvs-1.2.5-r2:20211229-211541.log'.
 * For convenience, a symlink to the build log is located at '/var/tmp/portage/app-admin/fsvs-1.2.5-r2/temp/build.log'.
 * The ebuild environment file is located at '/var/tmp/portage/app-admin/fsvs-1.2.5-r2/temp/environment'.
 * Working directory: '/var/tmp/portage/app-admin/fsvs-1.2.5-r2/work/fsvs-1.2.5'
 * S: '/var/tmp/portage/app-admin/fsvs-1.2.5-r2/work/fsvs-1.2.5'