* Package:    dev-ml/opam-format-2.0.8-r3
 * Repository: gentoo
 * Maintainer: ml@gentoo.org gienah@gentoo.org
 * USE:        abi_x86_64 amd64 elibc_glibc kernel_linux ocamlopt userland_GNU
 * FEATURES:   network-sandbox preserve-libs sandbox test userpriv usersandbox


@@@@@ PLEASE PAY ATTENTION HERE!!! @@@@@
This information may help you to understand if this is a duplicate or if this bug exists after you pushed a fix;
This ebuild was merged at the following commit:
https://github.com/gentoo/gentoo/commit/52d438422968d43ce090534d9e80b89e4f905754  (Sun Jun  6 23:55:18 UTC 2021)
@@@@@ END @@@@@



@@@@@ PLEASE PAY ATTENTION HERE!!! @@@@@
This ebuild was merged (directly or as a dependency) because of the following commit:
https://github.com/gentoo/gentoo/commit/8ecc12752fc010ffab88cba03a3923674a3da448
@@@@@ END @@@@@



##################
# emerge --info: #
##################
Portage 3.0.18 (python 3.9.5-final-0, default/linux/amd64/17.1, gcc-11.1.0, glibc-2.33, 5.4.0-1049-aws x86_64)
=================================================================
System uname: Linux-5.4.0-1049-aws-x86_64-Intel-R-_Xeon-R-_Platinum_8259CL_CPU_@_2.50GHz-with-glibc2.33
KiB Mem:    65048036 total,  50006272 free
KiB Swap:          0 total,         0 free
sh bash 5.1_p8
ld GNU ld (Gentoo 2.36.1 p3) 2.36.1
app-shells/bash:          5.1_p8::gentoo
dev-lang/perl:            5.34.0::gentoo
dev-lang/python:          2.7.18_p10::gentoo, 3.8.10_p2::gentoo, 3.9.5_p2::gentoo, 3.10.0_beta2::gentoo
dev-lang/rust:            1.52.1::gentoo
dev-util/cmake:           3.20.3::gentoo
dev-util/pkgconfig:       0.29.2::gentoo
sys-apps/baselayout:      2.7-r2::gentoo
sys-apps/openrc:          0.43.3::gentoo
sys-apps/sandbox:         2.24::gentoo
sys-devel/autoconf:       2.13-r1::gentoo, 2.69-r5::gentoo
sys-devel/automake:       1.16.3-r1::gentoo
sys-devel/binutils:       2.36.1-r1::gentoo
sys-devel/gcc:            11.1.0::gentoo
sys-devel/gcc-config:     2.4::gentoo
sys-devel/libtool:        2.4.6-r6::gentoo
sys-devel/make:           4.3::gentoo
sys-kernel/linux-headers: 5.12::gentoo (virtual/os-headers)
sys-libs/glibc:           2.33::gentoo
Repositories:

gentoo
    location: /usr/portage
    sync-type: rsync
    sync-uri: rsync://rsync.gentoo.org/gentoo-portage
    priority: -1000
    sync-rsync-verify-metamanifest: yes
    sync-rsync-extra-opts: 
    sync-rsync-verify-jobs: 1
    sync-rsync-verify-max-age: 24

ACCEPT_KEYWORDS="amd64 ~amd64"
ACCEPT_LICENSE="* LGPL-2.1"
CBUILD="x86_64-pc-linux-gnu"
CFLAGS="-O2 -pipe -march=x86-64 -frecord-gcc-switches"
CHOST="x86_64-pc-linux-gnu"
CONFIG_PROTECT="/etc /usr/share/gnupg/qualified.txt"
CONFIG_PROTECT_MASK="/etc/ca-certificates.conf /etc/env.d /etc/gconf /etc/gentoo-release /etc/revdep-rebuild /etc/sandbox.d /etc/terminfo"
CXXFLAGS="-O2 -pipe -march=x86-64 -frecord-gcc-switches"
DISTDIR="/var/tmp/portage/dev-ml/opam-format-2.0.8-r3/distdir"
EMERGE_DEFAULT_OPTS="--with-bdeps=y -1 -k -b"
ENV_UNSET="CARGO_HOME DBUS_SESSION_BUS_ADDRESS DISPLAY GOBIN GOPATH PERL5LIB PERL5OPT PERLPREFIX PERL_CORE PERL_MB_OPT PERL_MM_OPT XAUTHORITY XDG_CACHE_HOME XDG_CONFIG_HOME XDG_DATA_HOME XDG_RUNTIME_DIR"
FCFLAGS="-O2 -pipe -march=x86-64 -frecord-gcc-switches"
FEATURES="assume-digests binpkg-docompress binpkg-dostrip binpkg-logs binpkg-multi-instance buildpkg config-protect-if-modified distlocks ebuild-locks fixlafiles ipc-sandbox merge-sync multilib-strict network-sandbox news parallel-fetch pid-sandbox preserve-libs protect-owned qa-unresolved-soname-deps sandbox sfperms sign split-log strict test unknown-features-warn unmerge-logs unmerge-orphans userfetch userpriv usersandbox usersync xattr"
FFLAGS="-O2 -pipe -march=x86-64 -frecord-gcc-switches"
GENTOO_MIRRORS="http://distfiles.gentoo.org"
LANG="en_US.utf8"
LDFLAGS="-Wl,-O1 -Wl,--as-needed -Wl,--defsym=__gentoo_check_ldflags__=0"
MAKEOPTS="-j16"
PKGDIR="/root/.packages"
PORTAGE_CONFIGROOT="/"
PORTAGE_RSYNC_OPTS="--recursive --links --safe-links --perms --times --omit-dir-times --compress --force --whole-file --delete --stats --human-readable --timeout=180 --exclude=/distfiles --exclude=/local --exclude=/packages --exclude=/.git"
PORTAGE_TMPDIR="/var/tmp"
USE="acl amd64 berkdb bzip2 cli crypt dri elogind fortran gdbm iconv ipv6 jumbo-build libglvnd libtirpc multilib native-symlinks ncurses nls nptl ocamlopt openmp pam pcre readline seccomp split-usr ssl tcpd test unicode xattr zlib" ABI_X86="64" ELIBC="glibc" KERNEL="linux" USERLAND="GNU"
Unset:  CC, CPPFLAGS, CTARGET, CXX, INSTALL_MASK, LC_ALL, LINGUAS, PORTAGE_BINHOST, PORTAGE_BUNZIP2_COMMAND, PORTAGE_COMPRESS, PORTAGE_COMPRESS_FLAGS, PORTAGE_RSYNC_EXTRA_OPTS, RUSTFLAGS





##############################
# emerge history (qlop -mv): #
##############################
2021-06-07T02:22:17 >>> sys-libs/zlib-1.2.11-r4
2021-06-07T02:22:22 >>> dev-libs/libbsd-0.10.0
2021-06-07T02:22:23 >>> x11-libs/xtrans-1.4.0
2021-06-07T02:22:22 >>> x11-base/xorg-proto-2021.4
2021-06-07T02:22:23 >>> sys-libs/binutils-libs-2.36.1-r1
2021-06-07T02:22:24 >>> app-arch/rpm-4.16.1.3
2021-06-07T02:22:24 >>> x11-base/xcb-proto-1.14.1
2021-06-07T02:22:38 >>> x11-libs/libXdmcp-1.1.3
2021-06-07T02:22:37 >>> x11-libs/libXau-1.0.9-r1
2021-06-07T02:22:51 >>> x11-misc/compose-tables-1.7.2
2021-06-07T02:22:52 >>> x11-libs/libxcb-1.14
2021-06-07T02:22:58 >>> x11-libs/libX11-1.7.2
2021-06-07T02:22:42 >>> dev-lang/ocaml-4.11.2
2021-06-07T02:23:09 >>> dev-ml/findlib-1.8.1-r2
2021-06-07T02:23:10 >>> dev-ml/xml-light-2.2-r3
2021-06-07T02:23:10 >>> dev-ml/ocamlbuild-0.14.0-r1
2021-06-07T02:23:17 >>> dev-ml/dune-2.8.4
2021-06-07T02:23:18 >>> dev-ml/camlzip-1.10
2021-06-07T02:23:18 >>> dev-ml/ocaml-expat-1.1.0-r1
2021-06-07T02:23:19 >>> dev-ml/camlbz2-0.7.0
2021-06-07T02:23:30 >>> dev-ml/result-1.5
2021-06-07T02:23:31 >>> dev-ml/cppo-1.6.7
2021-06-07T02:23:32 >>> dev-ml/opam-file-format-2.1.2
2021-06-07T02:23:32 >>> dev-ml/ocaml-base64-3.5.0
2021-06-07T02:23:33 >>> dev-ml/stdlib-shims-0.3.0
2021-06-07T02:23:33 >>> dev-ml/seq-0.2
2021-06-07T02:23:52 >>> dev-ml/csexp-1.3.2-r1
2021-06-07T02:23:52 >>> dev-ml/topkg-1.0.3
2021-06-07T02:23:53 >>> dev-ml/extlib-1.7.8
2021-06-07T02:24:10 >>> dev-ml/re-1.9.0
2021-06-07T02:24:18 >>> dev-ml/dune-private-libs-2.8.4
2021-06-07T02:24:22 >>> dev-ml/cmdliner-1.0.4
2021-06-07T02:24:26 >>> dev-ml/cudf-0.9
2021-06-07T02:24:38 >>> dev-ml/dune-configurator-2.8.4
2021-06-07T02:24:52 >>> dev-ml/graphics-5.1.1
2021-06-07T02:24:51 >>> dev-ml/parmap-1.2.1
2021-06-07T02:24:58 >>> dev-ml/ocamlgraph-2.0.0-r1
2021-06-07T02:25:08 >>> dev-ml/opam-core-2.0.8-r1
2021-06-07T02:25:09 >>> dev-ml/dose3-6.0.1_p2
2021-06-07T02:25:20 >>> dev-ml/opam-format-2.0.8-r3




#######################################
# installed packages (qlist -ICvUSS): #
#######################################
acct-group/audio-0-r1:0
acct-group/cdrom-0-r1:0
acct-group/dialout-0-r1:0
acct-group/disk-0-r1:0
acct-group/input-0-r1:0
acct-group/kmem-0-r1:0
acct-group/kvm-0-r1:0
acct-group/lp-0-r1:0
acct-group/man-0-r1:0
acct-group/messagebus-0-r1:0
acct-group/polkitd-0-r1:0
acct-group/portage-0:0
acct-group/render-0-r1:0
acct-group/sshd-0-r1:0
acct-group/tape-0-r1:0
acct-group/tty-0-r1:0
acct-group/video-0-r1:0
acct-user/man-1-r1:0
acct-user/messagebus-0-r1:0
acct-user/polkitd-0-r1:0
acct-user/portage-0:0
acct-user/sshd-0-r1:0
app-admin/eselect-1.4.17:0 -doc -emacs -vim-syntax
app-admin/perl-cleaner-2.30:0
app-arch/bzip2-1.0.8-r1:0/1 -abi_mips_n32 -abi_mips_n64 -abi_mips_o32 -abi_s390_32 -abi_s390_64 -abi_x86_32 abi_x86_64 -abi_x86_x32 split-usr -static -static-libs
app-arch/gzip-1.10:0 -pic -static
app-arch/libarchive-3.5.1:0/13 -abi_mips_n32 -abi_mips_n64 -abi_mips_o32 -abi_s390_32 -abi_s390_64 -abi_x86_32 abi_x86_64 -abi_x86_x32 acl -blake2 bzip2 e2fsprogs -expat iconv -lz4 lzma -lzo -nettle -static-libs threads xattr zlib -zstd
app-arch/rpm-4.16.1.3:0 acl -caps -dbus -doc -lua -lua_single_target_lua5-2 nls openmp -python -python_single_target_python3_8 python_single_target_python3_9 -selinux -test zstd
app-arch/tar-1.34:0 acl -minimal nls -selinux xattr
app-arch/unzip-6.0_p26:0 bzip2 -natspec unicode
app-arch/xz-utils-5.2.5:0 -abi_mips_n32 -abi_mips_n64 -abi_mips_o32 -abi_s390_32 -abi_s390_64 -abi_x86_32 abi_x86_64 -abi_x86_x32 extra-filters nls split-usr -static-libs threads
app-arch/zstd-1.5.0:0/1 -abi_mips_n32 -abi_mips_n64 -abi_mips_o32 -abi_s390_32 -abi_s390_64 -abi_x86_32 abi_x86_64 -abi_x86_x32 -lz4 -static-libs threads
app-crypt/gnupg-2.2.27:0 bzip2 -doc -ldap nls readline -scd-shared-access -selinux smartcard ssl -tofu -tools -usb -user-socket -wks-server
app-crypt/gpgme-1.15.1:1/11 -common-lisp cxx -python python_targets_python3_8 python_targets_python3_9 -qt5 -static-libs
app-crypt/libb2-0.98.1-r3:0 -abi_mips_n32 -abi_mips_n64 -abi_mips_o32 -abi_s390_32 -abi_s390_64 -abi_x86_32 abi_x86_64 -abi_x86_x32 -native-cflags openmp -static-libs
app-crypt/openpgp-keys-gentoo-release-20200704:0 -test
app-crypt/pinentry-1.1.1-r1:0 -caps -efl -emacs -gnome-keyring -gtk ncurses -qt5
app-crypt/rhash-1.4.1:0 -abi_mips_n32 -abi_mips_n64 -abi_mips_o32 -abi_s390_32 -abi_s390_64 -abi_x86_32 abi_x86_64 -abi_x86_x32 -debug nls ssl -static-libs
app-editors/nano-5.7:0 -debug -justify -magic -minimal ncurses nls spell split-usr -static unicode
app-eselect/eselect-iptables-20200508:0
app-eselect/eselect-lib-bin-symlink-0.1.1-r1:0
app-eselect/eselect-pinentry-0.7.2:0
app-eselect/eselect-python-20200719:0
app-eselect/eselect-rust-20200419:0
app-i18n/man-pages-it-5.06:0
app-i18n/man-pages-ja-20180315:0
app-i18n/man-pages-l10n-4.2.0-r1:0 l10n_de l10n_fr l10n_nl l10n_pl l10n_pt-BR l10n_ro
app-i18n/man-pages-ru-5.03.2390.2390.20191017:0
app-i18n/man-pages-zh_CN-1.6.3.2:0
app-misc/c_rehash-1.7-r1:0
app-misc/ca-certificates-20210119.3.66:0 -cacert
app-misc/editor-wrapper-4-r1:0
app-misc/mime-types-9:0
app-misc/pax-utils-1.3.1:0 -caps -debug -python -python_single_target_python3_8 python_single_target_python3_9 seccomp
app-misc/tmux-3.2-r1:0 -debug -selinux -utempter -vim-syntax
app-portage/eix-0.35.0:0 -debug -doc nls -sqlite
app-portage/elt-patches-20201205:0
app-portage/gemato-16.2:0 gpg python_targets_pypy3 -python_targets_python3_10 python_targets_python3_8 python_targets_python3_9 -test -tools
app-portage/gentoolkit-0.5.1:0 python_targets_pypy3 python_targets_python3_8 python_targets_python3_9 -test
app-portage/portage-utils-0.91:0 nls openmp qmanifest qtegrity -static
app-shells/bash-5.1_p8:0 -afs -bashlogger -examples -mem-scramble net nls -plugins readline
app-shells/push-3.4:0
app-shells/quoter-4.2:0
app-text/ansifilter-2.18:0 -qt5
app-text/build-docbook-catalog-1.21:0
app-text/docbook-xml-dtd-4.5-r2:4.5
app-text/docbook-xml-dtd-4.4-r3:4.4
app-text/docbook-xml-dtd-4.2-r3:4.2
app-text/docbook-xml-dtd-4.1.2-r7:4.1.2
app-text/docbook-xsl-stylesheets-1.79.1-r2:0 -ruby
app-text/manpager-1:0
app-text/opensp-1.5.2-r6:0 -doc nls -static-libs -test
app-text/po4a-0.63:0 -test
app-text/sgml-common-0.6.3-r7:0
app-text/xmlto-0.0.28-r6:0 -latex -text
dev-db/sqlite-3.35.5:3 -abi_mips_n32 -abi_mips_n64 -abi_mips_o32 -abi_s390_32 -abi_s390_64 -abi_x86_32 abi_x86_64 -abi_x86_x32 -debug -doc -icu readline -secure-delete -static-libs -tcl -test -tools
dev-lang/ocaml-4.11.2:0/4.11.2 -emacs -flambda -latex ocamlopt -spacetime -xemacs
dev-lang/perl-5.34.0:0/5.34 berkdb -debug -doc gdbm -ithreads -minimal
dev-lang/python-3.10.0_beta2:3.10 -bluetooth -build -examples gdbm -hardened ipv6 ncurses readline sqlite ssl -test -tk -verify-sig -wininst xml
dev-lang/python-3.9.5_p2:3.9 -bluetooth -build -examples gdbm -hardened ipv6 ncurses readline sqlite ssl -test -tk -verify-sig -wininst xml
dev-lang/python-3.8.10_p2:3.8 -bluetooth -build -examples gdbm -hardened ipv6 ncurses readline sqlite ssl -test -tk -verify-sig -wininst xml
dev-lang/python-2.7.18_p10:2.7 -berkdb -bluetooth -build -examples gdbm -hardened ipv6 ncurses readline sqlite ssl threads -tk -verify-sig wide-unicode -wininst xml
dev-lang/python-exec-2.4.6-r4:2 native-symlinks python_targets_pypy3 python_targets_python3_10 python_targets_python3_8 python_targets_python3_9
dev-lang/python-exec-conf-2.4.6:2 python_targets_pypy3 -python_targets_python3_10 python_targets_python3_8 python_targets_python3_9
dev-lang/rust-1.52.1:stable/1.52 -abi_mips_n32 -abi_mips_n64 -abi_mips_o32 -abi_s390_32 -abi_s390_64 -abi_x86_32 abi_x86_64 -abi_x86_x32 -clippy cpu_flags_x86_sse2 -debug -doc -llvm_targets_AArch64 -llvm_targets_AMDGPU -llvm_targets_ARM -llvm_targets_AVR -llvm_targets_BPF -llvm_targets_Hexagon -llvm_targets_Lanai -llvm_targets_Mips -llvm_targets_MSP430 -llvm_targets_NVPTX -llvm_targets_PowerPC -llvm_targets_RISCV -llvm_targets_Sparc -llvm_targets_SystemZ -llvm_targets_WebAssembly llvm_targets_X86 -llvm_targets_XCore -miri -nightly -parallel-compiler -rls -rustfmt -system-bootstrap -system-llvm -test -verify-sig -wasm
dev-lang/spidermonkey-78.11.0:78 -clang -cpu_flags_arm_neon -debug jit -lto -test
dev-lang/tcl-8.6.11:0/8.6 -abi_mips_n32 -abi_mips_n64 -abi_mips_o32 -abi_s390_32 -abi_s390_64 -abi_x86_32 abi_x86_64 -abi_x86_x32 -debug threads
dev-libs/elfutils-0.185:0 -abi_mips_n32 -abi_mips_n64 -abi_mips_o32 -abi_s390_32 -abi_s390_64 -abi_x86_32 abi_x86_64 -abi_x86_x32 bzip2 -lzma nls -static-libs -test -threads utils -valgrind -zstd
dev-libs/expat-2.4.1:0 -abi_mips_n32 -abi_mips_n64 -abi_mips_o32 -abi_s390_32 -abi_s390_64 -abi_x86_32 abi_x86_64 -abi_x86_x32 -examples split-usr -static-libs unicode
dev-libs/glib-2.68.2:2 -abi_mips_n32 -abi_mips_n64 -abi_mips_o32 -abi_s390_32 -abi_s390_64 -abi_x86_32 abi_x86_64 -abi_x86_x32 -dbus -debug elf -fam -gtk-doc mime -selinux -static-libs -sysprof -systemtap -test -utils xattr
dev-libs/gmp-6.2.1-r1:0/10.4 -abi_mips_n32 -abi_mips_n64 -abi_mips_o32 -abi_s390_32 -abi_s390_64 -abi_x86_32 abi_x86_64 -abi_x86_x32 asm cxx -doc -pic -static-libs
dev-libs/gobject-introspection-1.68.0:0 -doctool -gtk-doc -python_single_target_python3_8 python_single_target_python3_9 -test
dev-libs/gobject-introspection-common-1.68.0:0
dev-libs/icu-69.1:0/69.1 -abi_mips_n32 -abi_mips_n64 -abi_mips_o32 -abi_s390_32 -abi_s390_64 -abi_x86_32 abi_x86_64 -abi_x86_x32 -debug -doc -examples -static-libs
dev-libs/isl-0.24:0/23 -abi_mips_n32 -abi_mips_n64 -abi_mips_o32 -abi_s390_32 -abi_s390_64 -abi_x86_32 abi_x86_64 -abi_x86_x32 -static-libs
dev-libs/jsoncpp-1.9.4:0/24 -doc -test
dev-libs/libassuan-2.5.5:0
dev-libs/libbsd-0.10.0:0 -abi_mips_n32 -abi_mips_n64 -abi_mips_o32 -abi_s390_32 -abi_s390_64 -abi_x86_32 abi_x86_64 -abi_x86_x32 -static-libs
dev-libs/libevent-2.1.12:0/2.1-7 -abi_mips_n32 -abi_mips_n64 -abi_mips_o32 -abi_s390_32 -abi_s390_64 -abi_x86_32 abi_x86_64 -abi_x86_x32 clock-gettime -debug -malloc-replacement ssl -static-libs -test threads -verbose-debug
dev-libs/libffi-3.3-r2:0/7 -abi_mips_n32 -abi_mips_n64 -abi_mips_o32 -abi_s390_32 -abi_s390_64 -abi_x86_32 abi_x86_64 -abi_x86_x32 -debug -pax_kernel -static-libs -test
dev-libs/libgcrypt-1.9.3:0/20 -abi_mips_n32 -abi_mips_n64 -abi_mips_o32 -abi_s390_32 -abi_s390_64 -abi_x86_32 abi_x86_64 -abi_x86_x32 asm -cpu_flags_arm_neon -cpu_flags_x86_aes -cpu_flags_x86_avx -cpu_flags_x86_avx2 -cpu_flags_x86_padlock -cpu_flags_x86_sha -cpu_flags_x86_sse4_1 -doc -o-flag-munging -static-libs
dev-libs/libgpg-error-1.42:0 -abi_mips_n32 -abi_mips_n64 -abi_mips_o32 -abi_s390_32 -abi_s390_64 -abi_x86_32 abi_x86_64 -abi_x86_x32 -common-lisp nls -static-libs
dev-libs/libksba-1.5.1:0 -static-libs
dev-libs/libltdl-2.4.6:0 -abi_mips_n32 -abi_mips_n64 -abi_mips_o32 -abi_s390_32 -abi_s390_64 -abi_x86_32 abi_x86_64 -abi_x86_x32 -static-libs
dev-libs/libpcre-8.44:3 -abi_mips_n32 -abi_mips_n64 -abi_mips_o32 -abi_s390_32 -abi_s390_64 -abi_x86_32 abi_x86_64 -abi_x86_x32 bzip2 cxx jit -libedit pcre16 pcre32 readline recursion-limit split-usr -static-libs unicode zlib
dev-libs/libpcre2-10.37-r1:0/3 -abi_mips_n32 -abi_mips_n64 -abi_mips_o32 -abi_s390_32 -abi_s390_64 -abi_x86_32 abi_x86_64 -abi_x86_x32 bzip2 jit -libedit pcre16 pcre32 readline recursion-limit split-usr -static-libs unicode zlib
dev-libs/libpipeline-1.5.3:0 -static-libs -test
dev-libs/libtasn1-4.17.0:0/6 -abi_mips_n32 -abi_mips_n64 -abi_mips_o32 -abi_s390_32 -abi_s390_64 -abi_x86_32 abi_x86_64 -abi_x86_x32 -doc -static-libs -test -valgrind
dev-libs/libunistring-0.9.10-r1:0/2 -abi_mips_n32 -abi_mips_n64 -abi_mips_o32 -abi_s390_32 -abi_s390_64 -abi_x86_32 abi_x86_64 -abi_x86_x32 -doc -static-libs
dev-libs/libuv-1.41.0:0/1 -abi_mips_n32 -abi_mips_n64 -abi_mips_o32 -abi_s390_32 -abi_s390_64 -abi_x86_32 abi_x86_64 -abi_x86_x32
dev-libs/libxml2-2.9.12-r2:2 -abi_mips_n32 -abi_mips_n64 -abi_mips_o32 -abi_s390_32 -abi_s390_64 -abi_x86_32 abi_x86_64 -abi_x86_x32 -debug -examples -icu ipv6 -lzma python python_targets_python3_8 python_targets_python3_9 readline -static-libs -test -verify-sig
dev-libs/libxslt-1.1.34-r1:0 -abi_mips_n32 -abi_mips_n64 -abi_mips_o32 -abi_s390_32 -abi_s390_64 -abi_x86_32 abi_x86_64 -abi_x86_x32 crypt -debug -examples -static-libs -verify-sig
dev-libs/mpc-1.2.1:0/3 -abi_mips_n32 -abi_mips_n64 -abi_mips_o32 -abi_s390_32 -abi_s390_64 -abi_x86_32 abi_x86_64 -abi_x86_x32 -static-libs
dev-libs/mpfr-4.1.0:0/6 -abi_mips_n32 -abi_mips_n64 -abi_mips_o32 -abi_s390_32 -abi_s390_64 -abi_x86_32 abi_x86_64 -abi_x86_x32 -static-libs
dev-libs/nettle-3.7.2:0/8-6 -abi_mips_n32 -abi_mips_n64 -abi_mips_o32 -abi_s390_32 -abi_s390_64 -abi_x86_32 abi_x86_64 -abi_x86_x32 asm -cpu_flags_arm_neon -cpu_flags_x86_aes -cpu_flags_x86_sha -doc gmp -static-libs -test
dev-libs/npth-1.6-r1:0
dev-libs/nspr-4.31:0 -abi_mips_n32 -abi_mips_n64 -abi_mips_o32 -abi_s390_32 -abi_s390_64 -abi_x86_32 abi_x86_64 -abi_x86_x32 -debug
dev-libs/openssl-1.1.1k:0/1.1 -abi_mips_n32 -abi_mips_n64 -abi_mips_o32 -abi_s390_32 -abi_s390_64 -abi_x86_32 abi_x86_64 -abi_x86_x32 asm -bindist cpu_flags_x86_sse2 -rfc3779 -sctp -sslv3 -static-libs -test -tls-heartbeat -vanilla zlib
dev-libs/popt-1.18:0 -abi_mips_n32 -abi_mips_n64 -abi_mips_o32 -abi_s390_32 -abi_s390_64 -abi_x86_32 abi_x86_64 -abi_x86_x32 nls -static-libs
dev-ml/camlbz2-0.7.0:0/0.7.0 -doc
dev-ml/camlzip-1.10:1/1.10 ocamlopt
dev-ml/cmdliner-1.0.4:0/1.0.4 ocamlopt -test
dev-ml/cppo-1.6.7:0/1.6.7 ocamlopt
dev-ml/csexp-1.3.2-r1:0/1.3.2 ocamlopt -test
dev-ml/cudf-0.9:0/0.9 ocamlopt -test
dev-ml/dose3-6.0.1_p2:0/6.0.1_p2 ocamlopt -test
dev-ml/dune-2.8.4:0/2.8.4 -test
dev-ml/dune-configurator-2.8.4:0/2.8.4 ocamlopt -test
dev-ml/dune-private-libs-2.8.4:0/2.8.4 ocamlopt -test
dev-ml/extlib-1.7.8:0/1.7.8 -doc ocamlopt
dev-ml/findlib-1.8.1-r2:0 -doc ocamlopt -tk
dev-ml/graphics-5.1.1:0 ocamlopt
dev-ml/ocaml-base64-3.5.0:0/3.5.0 ocamlopt -test
dev-ml/ocaml-expat-1.1.0-r1:0/1.1.0 -doc ocamlopt -test
dev-ml/ocamlbuild-0.14.0-r1:0/0.14.0 ocamlopt -test
dev-ml/ocamlgraph-2.0.0-r1:0/2.0.0 ocamlopt
dev-ml/opam-core-2.0.8-r1:0/2.0.8
dev-ml/opam-file-format-2.1.2:0/2.1.2 ocamlopt -test
dev-ml/opam-format-2.0.8-r3:0/2.0.8 ocamlopt
dev-ml/parmap-1.2.1:0/1.2.1 ocamlopt
dev-ml/re-1.9.0:0/1.9.0 ocamlopt -test
dev-ml/result-1.5:0/1.5 ocamlopt
dev-ml/seq-0.2:0 ocamlopt
dev-ml/stdlib-shims-0.3.0:0 ocamlopt
dev-ml/topkg-1.0.3:0/1.0.3
dev-ml/xml-light-2.2-r3:0/2.2 -doc ocamlopt
dev-perl/Encode-EUCJPASCII-0.30.0-r1:0 -test
dev-perl/Encode-HanExtra-0.230.0-r3:0
dev-perl/Encode-Locale-1.50.0:0 -test
dev-perl/File-Listing-6.140.0:0 -test
dev-perl/HTML-Parser-3.720.0:0 -test
dev-perl/HTML-Tagset-3.200.0-r1:0
dev-perl/HTTP-Cookies-6.40.0:0 -test
dev-perl/HTTP-Date-6.20.0-r1:0
dev-perl/HTTP-Message-6.290.0:0 -test
dev-perl/HTTP-Negotiate-6.10.0-r1:0
dev-perl/IO-HTML-1.1.0:0 -test
dev-perl/IO-Socket-INET6-2.720.0-r1:0
dev-perl/IO-Socket-SSL-2.66.0:0 -examples -idn
dev-perl/libwww-perl-6.530.0:0 ssl -test
dev-perl/Locale-gettext-1.70.0:0
dev-perl/LWP-MediaTypes-6.20.0-r1:0
dev-perl/LWP-Protocol-https-6.70.0:0 -test
dev-perl/MIME-Charset-1.12.2:0 l10n_ja l10n_zh
dev-perl/Module-Build-0.422.400:0 -test
dev-perl/Mozilla-CA-20999999:0
dev-perl/Net-HTTP-6.210.0:0 -minimal -test
dev-perl/Net-SSLeay-1.880.0-r1:0 -examples -examples -minimal -test
dev-perl/Pod-Parser-1.630.0-r1:0 -test
dev-perl/SGMLSpm-1.1-r1:0
dev-perl/Socket6-0.280.0:0
dev-perl/Sub-Name-0.210.0:0 -suggested -test
dev-perl/TermReadKey-2.370.0:0 -examples
dev-perl/Text-CharWidth-0.40.0-r1:0
dev-perl/Text-WrapI18N-0.60.0-r1:0
dev-perl/Try-Tiny-0.300.0:0 -minimal -test
dev-perl/Unicode-LineBreak-2019.1.0:0
dev-perl/URI-1.730.0:0 -test
dev-perl/WWW-RobotRules-6.20.0-r1:0
dev-perl/XML-Parser-2.460.0:0
dev-perl/YAML-Tiny-1.730.0:0 -minimal -test
dev-python/certifi-10001-r1:0 python_targets_pypy3 -python_targets_python3_10 python_targets_python3_8 python_targets_python3_9 -test
dev-python/chardet-4.0.0:0 python_targets_pypy3 -python_targets_python3_10 python_targets_python3_8 python_targets_python3_9 -test
dev-python/idna-3.2:0 python_targets_pypy3 -python_targets_python3_10 python_targets_python3_8 python_targets_python3_9
dev-python/jinja-3.0.1:0 -doc -examples python_targets_pypy3 -python_targets_python3_10 python_targets_python3_8 python_targets_python3_9 -test
dev-python/markupsafe-2.0.1:0 python_targets_pypy3 -python_targets_python3_10 python_targets_python3_8 python_targets_python3_9 -test
dev-python/pypy3-7.3.4_p2:0/pypy37-pp73 bzip2 gdbm jit ncurses -sqlite -test -tk
dev-python/pypy3-exe-7.3.4:7.3.4 bzip2 -cpu_flags_x86_sse2 jit -low-memory ncurses
dev-python/PySocks-1.7.1-r1:0 python_targets_pypy3 -python_targets_python3_10 python_targets_python3_8 python_targets_python3_9
dev-python/requests-2.25.1-r2:0 python_targets_pypy3 -python_targets_python3_10 python_targets_python3_8 python_targets_python3_9 -socks5 -test
dev-python/setuptools-57.0.0:0 python_targets_pypy3 -python_targets_python3_10 python_targets_python3_8 python_targets_python3_9 -test
dev-python/setuptools_scm-6.0.1-r1:0 python_targets_pypy3 -python_targets_python3_10 python_targets_python3_8 python_targets_python3_9 -test
dev-python/toml-0.10.2:0 python_targets_pypy3 -python_targets_python3_10 python_targets_python3_8 python_targets_python3_9 -test -test
dev-python/urllib3-1.26.5:0 -brotli python_targets_pypy3 -python_targets_python3_10 python_targets_python3_8 python_targets_python3_9 -test
dev-util/cmake-3.20.3:0 -doc -emacs ncurses -qt5 -test -test
dev-util/desktop-file-utils-0.26-r1:0 -emacs
dev-util/glib-utils-2.68.2:0 -python_single_target_python3_8 python_single_target_python3_9
dev-util/gperf-3.1:0
dev-util/gtk-doc-am-1.33.2:0
dev-util/intltool-0.51.0-r2:0
dev-util/itstool-2.0.6-r1:0 -python_single_target_python3_8 python_single_target_python3_9
dev-util/meson-0.57.2:0 python_targets_python3_8 python_targets_python3_9 -test
dev-util/meson-format-array-0:0 python_targets_python3_8 python_targets_python3_9
dev-util/ninja-1.10.2-r1:0 -doc -emacs -test -vim-syntax
dev-util/pkgconfig-0.29.2:0 -abi_mips_n32 -abi_mips_n64 -abi_mips_o32 -abi_s390_32 -abi_s390_64 -abi_x86_32 abi_x86_64 -abi_x86_x32 -hardened -internal-glib
dev-util/re2c-2.1.1-r1:0 -debug
dev-vcs/git-2.32.0:0 blksha1 -cgi curl -cvs -doc -emacs -gnome-keyring gpg -highlight iconv -mediawiki -mediawiki-experimental nls pcre -perforce -perl -ppcsha1 -python_single_target_python3_10 -python_single_target_python3_8 python_single_target_python3_9 -subversion -test threads -tk webdav -xinetd
net-dns/libidn2-2.3.1:0/2 -abi_mips_n32 -abi_mips_n64 -abi_mips_o32 -abi_s390_32 -abi_s390_64 -abi_x86_32 abi_x86_64 -abi_x86_x32 -static-libs -verify-sig
net-firewall/iptables-1.8.7:0/1.8.3 -conntrack ipv6 -netlink -nftables -pcap split-usr -static-libs
net-libs/gnutls-3.7.2:0/30 -abi_mips_n32 -abi_mips_n64 -abi_mips_o32 -abi_s390_32 -abi_s390_64 -abi_x86_32 abi_x86_64 -abi_x86_x32 cxx -dane -doc -examples -guile idn nls openssl -pkcs11 seccomp -sslv2 -sslv3 -static-libs -test -test-full tls-heartbeat -tools -valgrind
net-libs/libmnl-1.0.4:0/0.2.0 -examples split-usr -static-libs
net-libs/libnsl-1.3.0-r1:0/2 -abi_mips_n32 -abi_mips_n64 -abi_mips_o32 -abi_s390_32 -abi_s390_64 -abi_x86_32 abi_x86_64 -abi_x86_x32 -static-libs
net-libs/libtirpc-1.3.2:0/3 -abi_mips_n32 -abi_mips_n64 -abi_mips_o32 -abi_s390_32 -abi_s390_64 -abi_x86_32 abi_x86_64 -abi_x86_x32 ipv6 -kerberos split-usr -static-libs
net-libs/nghttp2-1.43.0:0/1.14 -abi_mips_n32 -abi_mips_n64 -abi_mips_o32 -abi_s390_32 -abi_s390_64 -abi_x86_32 abi_x86_64 -abi_x86_x32 -cxx -debug -hpack-tools -jemalloc -static-libs -test threads -utils -xml
net-misc/curl-7.77.0:0 -abi_mips_n32 -abi_mips_n64 -abi_mips_o32 -abi_s390_32 -abi_s390_64 -abi_x86_32 abi_x86_64 -abi_x86_x32 -adns -alt-svc -brotli -curl_ssl_gnutls -curl_ssl_mbedtls -curl_ssl_nss curl_ssl_openssl -curl_ssl_winssl ftp -gnutls -gopher -hsts http2 -idn imap ipv6 -kerberos -ldap -mbedtls -metalink -nghttp3 -nss openssl pop3 progress-meter -quiche -rtmp -samba smtp -ssh ssl -sslv3 -static-libs -telnet -test tftp -threads -winssl -zstd
net-misc/iputils-20210202:0 arping -caps -clockdiff -doc filecaps -gcrypt -idn ipv6 -nettle nls -rarpd -rdisc ssl -static -tftpd -tracepath -traceroute6
net-misc/netifrc-0.7.3:0
net-misc/openssh-8.6_p1-r1:0 -abi_mips_n32 -audit -bindist -debug -hpn -kerberos -ldns -libedit -livecd pam pie scp -sctp -security-key -selinux ssl -static -test -X -X509 -xmss
net-misc/rsync-3.2.3-r4:0 acl -examples iconv ipv6 -lz4 ssl -stunnel -system-zlib xattr -xxhash -zstd
net-misc/wget-1.21.1:0 -cookie_check -debug -gnutls -idn ipv6 -metalink nls -ntlm pcre ssl -static -test -uuid zlib
perl-core/File-Temp-0.231.100:0
sys-apps/acl-2.3.1:0 -abi_mips_n32 -abi_mips_n64 -abi_mips_o32 -abi_s390_32 -abi_s390_64 -abi_x86_32 abi_x86_64 -abi_x86_x32 nls split-usr -static-libs
sys-apps/attr-2.5.1:0 -abi_mips_n32 -abi_mips_n64 -abi_mips_o32 -abi_s390_32 -abi_s390_64 -abi_x86_32 abi_x86_64 -abi_x86_x32 -debug nls split-usr -static-libs
sys-apps/baselayout-2.7-r2:0 -build split-usr
sys-apps/busybox-1.33.1:0 -debug ipv6 -livecd -make-symlinks -math -mdev -pam -savedconfig -selinux -sep-usr static -syslog -systemd
sys-apps/coreutils-8.32-r1:0 acl -caps -gmp -hostname -kill -multicall nls -selinux split-usr -static -test -vanilla xattr
sys-apps/dbus-1.12.20-r1:0 -abi_mips_n32 -abi_mips_n64 -abi_mips_o32 -abi_s390_32 -abi_s390_64 -abi_x86_32 abi_x86_64 -abi_x86_x32 -debug -doc elogind -selinux -static-libs -systemd -test -test -user-session -X
sys-apps/debianutils-4.11.2:0 installkernel -static
sys-apps/diffutils-3.7-r1:0 nls -static
sys-apps/file-5.40-r2:0 -abi_mips_n32 -abi_mips_n64 -abi_mips_o32 -abi_s390_32 -abi_s390_64 -abi_x86_32 abi_x86_64 -abi_x86_x32 bzip2 -lzma -python python_targets_python3_8 python_targets_python3_9 -seccomp -static-libs zlib
sys-apps/findutils-4.8.0:0 nls -selinux -static -test
sys-apps/gawk-5.1.0:0 -mpfr nls readline
sys-apps/gentoo-functions-0.14:0
sys-apps/grep-3.6:0 nls pcre -static
sys-apps/groff-1.22.4:0 -examples -uchardet -X
sys-apps/help2man-1.48.3:0 nls
sys-apps/hwids-20201207:0 net pci udev usb
sys-apps/install-xattr-0.8:0
sys-apps/iproute2-5.10.0-r1:0 -atm berkdb -caps -elf iptables ipv6 -libbsd -minimal -selinux
sys-apps/kbd-2.4.0:0 nls pam -test
sys-apps/kmod-29:0 -debug -doc lzma -pkcs7 -python python_targets_python3_8 python_targets_python3_9 -static-libs tools zlib -zstd
sys-apps/less-590:0 pcre unicode
sys-apps/man-db-2.9.4:0 berkdb gdbm manpager nls seccomp -selinux -static-libs zlib
sys-apps/man-pages-5.11:0 l10n_de l10n_fr l10n_it l10n_ja l10n_nl l10n_pl l10n_pt-BR l10n_ro l10n_ru l10n_zh-CN
sys-apps/man-pages-posix-2017a:0
sys-apps/net-tools-2.10:0 arp hostname ipv6 -nis nls -plipconfig -selinux -slattach -static
sys-apps/openrc-0.43.3:0 -audit -bash -debug ncurses netifrc -newnet pam -prefix -selinux -sysv-utils unicode
sys-apps/portage-3.0.18:0 -apidoc -build -doc -gentoo-dev ipc native-extensions python_targets_pypy3 python_targets_python3_8 python_targets_python3_9 rsync-verify -selinux -test xattr
sys-apps/sandbox-2.24:0 -abi_mips_n32 -abi_mips_n64 -abi_mips_o32 -abi_s390_32 -abi_s390_64 abi_x86_32 abi_x86_64 -abi_x86_x32
sys-apps/sed-4.8:0 acl nls -selinux -static
sys-apps/shadow-4.8.1-r3:0 acl -audit -bcrypt -cracklib nls pam -selinux -skey split-usr su xattr
sys-apps/systemd-tmpfiles-246:0 -selinux -test
sys-apps/sysvinit-2.99:0 -ibm -selinux -static
sys-apps/texinfo-6.7:0 nls standalone -static
sys-apps/util-linux-2.37:0 -abi_mips_n32 -abi_mips_n64 -abi_mips_o32 -abi_s390_32 -abi_s390_64 -abi_x86_32 abi_x86_64 -abi_x86_x32 -audit -build -caps cramfs -cryptsetup -fdformat -hardlink -kill logger -magic ncurses nls pam -python python_targets_python3_8 python_targets_python3_9 readline -selinux -slang split-usr -static-libs -su suid -systemd -test -tty-helpers -udev unicode
sys-apps/which-2.21:0
sys-auth/elogind-246.10-r1:0 acl -audit -debug -doc pam policykit -selinux
sys-auth/pambase-20210201.1:0 -caps -debug elogind -gnome-keyring -homed -minimal -mktemp nullok -pam_krb5 -pam_ssh passwdqc -pwhistory -pwquality -securetty -selinux sha512 -systemd
sys-auth/passwdqc-2.0.2:0
sys-auth/polkit-0.119:0 elogind -examples -gtk introspection -kde nls pam -selinux -systemd -test
sys-devel/autoconf-2.69-r5:2.69 -emacs
sys-devel/autoconf-2.13-r1:2.1
sys-devel/autoconf-archive-2021.02.19:0
sys-devel/autoconf-wrapper-15:0
sys-devel/automake-1.16.3-r1:1.16 -test
sys-devel/automake-wrapper-11:0
sys-devel/binutils-2.36.1-r1:2.36 -cet -default-gold -doc gold -multitarget nls plugins -static-libs -test -vanilla
sys-devel/binutils-config-5.4:0 native-symlinks
sys-devel/bison-3.7.6:0 -examples nls -static -test
sys-devel/flex-2.6.4-r1:0 -abi_mips_n32 -abi_mips_n64 -abi_mips_o32 -abi_s390_32 -abi_s390_64 -abi_x86_32 abi_x86_64 -abi_x86_x32 nls -static -test
sys-devel/gcc-11.1.0:11 -ada -custom-cflags cxx -d -debug -doc -fixed-point fortran -go graphite -hardened -jit -libssp lto multilib nls nptl -objc -objc++ -objc-gc openmp pch -pgo pie sanitize ssp -systemtap -test -valgrind -vanilla -vtv -zstd
sys-devel/gcc-config-2.4:0 cc-wrappers native-symlinks
sys-devel/gettext-0.21-r1:0 -abi_mips_n32 -abi_mips_n64 -abi_mips_o32 -abi_s390_32 -abi_s390_64 -abi_x86_32 abi_x86_64 -abi_x86_x32 acl -cvs cxx -doc -emacs -git -java -java ncurses nls openmp -static-libs
sys-devel/gnuconfig-20210107:0
sys-devel/libtool-2.4.6-r6:2 -vanilla
sys-devel/llvm-12.0.0:12 -abi_mips_n32 -abi_mips_n64 -abi_mips_o32 -abi_s390_32 -abi_s390_64 -abi_x86_32 abi_x86_64 -abi_x86_x32 -debug -doc -doc -exegesis -gold -libedit libffi -llvm_targets_AArch64 llvm_targets_AMDGPU -llvm_targets_ARC -llvm_targets_ARM -llvm_targets_AVR llvm_targets_BPF -llvm_targets_CSKY -llvm_targets_Hexagon -llvm_targets_Lanai -llvm_targets_Mips -llvm_targets_MSP430 llvm_targets_NVPTX -llvm_targets_PowerPC -llvm_targets_RISCV -llvm_targets_Sparc -llvm_targets_SystemZ -llvm_targets_VE -llvm_targets_WebAssembly llvm_targets_X86 -llvm_targets_XCore ncurses -test -xar -xml -z3
sys-devel/llvm-common-12.0.0:0
sys-devel/m4-1.4.19:0 -examples nls
sys-devel/make-4.3:0 -guile nls -static
sys-devel/patch-2.7.6-r4:0 -static -test xattr
sys-fs/e2fsprogs-1.46.2:0 -cron -fuse -lto nls split-usr -static-libs threads
sys-fs/udev-248:0 -abi_mips_n32 -abi_mips_n64 -abi_mips_o32 -abi_s390_32 -abi_s390_64 -abi_x86_32 abi_x86_64 -abi_x86_x32 acl kmod -selinux split-usr -static-libs
sys-fs/udev-init-scripts-34:0
sys-kernel/installkernel-gentoo-3:0
sys-kernel/linux-headers-5.12:0 -headers-only
sys-libs/binutils-libs-2.36.1-r1:0/2.36.1 -64-bit-bfd -abi_mips_n32 -abi_mips_n64 -abi_mips_o32 -abi_s390_32 -abi_s390_64 abi_x86_32 abi_x86_64 -abi_x86_x32 -cet -multitarget nls -static-libs
sys-libs/db-6.0.35-r4:6.0 -abi_mips_n32 -abi_mips_n64 -abi_mips_o32 -abi_s390_32 -abi_s390_64 -abi_x86_32 abi_x86_64 -abi_x86_x32 -cxx -doc -doc -examples -java -java -tcl -test -test
sys-libs/e2fsprogs-libs-1.46.2:0 -abi_mips_n32 -abi_mips_n64 -abi_mips_o32 -abi_s390_32 -abi_s390_64 -abi_x86_32 abi_x86_64 -abi_x86_x32 split-usr -static-libs
sys-libs/gdbm-1.19:0/6 -abi_mips_n32 -abi_mips_n64 -abi_mips_o32 -abi_s390_32 -abi_s390_64 -abi_x86_32 abi_x86_64 -abi_x86_x32 berkdb nls readline -static-libs
sys-libs/glibc-2.33:2.2 -audit -caps -cet -compile-locales crypt -custom-cflags -doc -gd -headers-only multiarch multilib -multilib-bootstrap -nscd -profile -selinux ssp static-libs -static-pie -suid -systemtap -test -vanilla
sys-libs/libcap-2.50-r1:0 -abi_mips_n32 -abi_mips_n64 -abi_mips_o32 -abi_s390_32 -abi_s390_64 -abi_x86_32 abi_x86_64 -abi_x86_x32 pam split-usr -static-libs
sys-libs/libseccomp-2.5.1-r1:0 -abi_mips_n32 -abi_mips_n64 -abi_mips_o32 -abi_s390_32 -abi_s390_64 -abi_x86_32 abi_x86_64 -abi_x86_x32 -python python_targets_python3_8 python_targets_python3_9 -static-libs
sys-libs/ncurses-6.2_p20210123:0/6 -abi_mips_n32 -abi_mips_n64 -abi_mips_o32 -abi_s390_32 -abi_s390_64 -abi_x86_32 abi_x86_64 -abi_x86_x32 -ada cxx -debug -doc -gpm -minimal -profile split-usr -static-libs -test -threads tinfo -trace unicode
sys-libs/pam-1.5.1:0 -abi_mips_n32 -abi_mips_n64 -abi_mips_o32 -abi_s390_32 -abi_s390_64 -abi_x86_32 abi_x86_64 -abi_x86_x32 -audit berkdb -debug filecaps -nis -selinux split-usr
sys-libs/readline-8.1_p1:0/8 -abi_mips_n32 -abi_mips_n64 -abi_mips_o32 -abi_s390_32 -abi_s390_64 -abi_x86_32 abi_x86_64 -abi_x86_x32 split-usr -static-libs unicode -utils
sys-libs/timezone-data-2021a:0 -leaps-timezone nls -zic-slim
sys-libs/zlib-1.2.11-r4:0/1 -abi_mips_n32 -abi_mips_n64 -abi_mips_o32 -abi_s390_32 -abi_s390_64 abi_x86_32 abi_x86_64 -abi_x86_x32 minizip split-usr -static-libs
sys-process/procps-3.3.17:0/8 -abi_mips_n32 -abi_mips_n64 -abi_mips_o32 -abi_s390_32 -abi_s390_64 -abi_x86_32 abi_x86_64 -abi_x86_x32 elogind kill -modern-top ncurses nls -selinux split-usr -static-libs -systemd -test unicode
sys-process/psmisc-23.4-r1:0 ipv6 nls -selinux -X
virtual/acl-0-r2:0 -abi_mips_n32 -abi_mips_n64 -abi_mips_o32 -abi_s390_32 -abi_s390_64 -abi_x86_32 abi_x86_64 -abi_x86_x32 -static-libs
virtual/awk-1:0
virtual/dev-manager-0-r2:0
virtual/editor-0-r3:0
virtual/libc-1-r1:0
virtual/libcrypt-1-r1:0/1 -abi_mips_n32 -abi_mips_n64 -abi_mips_o32 -abi_s390_32 -abi_s390_64 -abi_x86_32 abi_x86_64 -abi_x86_x32 static-libs
virtual/libelf-3:0/1 -abi_mips_n32 -abi_mips_n64 -abi_mips_o32 -abi_s390_32 -abi_s390_64 -abi_x86_32 abi_x86_64 -abi_x86_x32
virtual/libiconv-0-r2:0 -abi_mips_n32 -abi_mips_n64 -abi_mips_o32 -abi_s390_32 -abi_s390_64 -abi_x86_32 abi_x86_64 -abi_x86_x32
virtual/libintl-0-r2:0 -abi_mips_n32 -abi_mips_n64 -abi_mips_o32 -abi_s390_32 -abi_s390_64 -abi_x86_32 abi_x86_64 -abi_x86_x32
virtual/libudev-232-r3:0/1 -abi_mips_n32 -abi_mips_n64 -abi_mips_o32 -abi_s390_32 -abi_s390_64 -abi_x86_32 abi_x86_64 -abi_x86_x32 -static-libs -systemd
virtual/man-0-r4:0
virtual/os-headers-0-r2:0
virtual/package-manager-1:0
virtual/pager-0:0
virtual/perl-Carp-1.520.0-r1:0
virtual/perl-Compress-Raw-Bzip2-2.101.0:0
virtual/perl-Compress-Raw-Zlib-2.101.0:0
virtual/perl-CPAN-Meta-2.150.10-r5:0
virtual/perl-CPAN-Meta-Requirements-2.140.0-r7:0
virtual/perl-CPAN-Meta-YAML-0.18.0-r7:0
virtual/perl-Data-Dumper-2.179.0:0
virtual/perl-Digest-MD5-2.580.0:0
virtual/perl-Encode-3.80.0:0
virtual/perl-Exporter-5.760.0:0
virtual/perl-ExtUtils-CBuilder-0.280.236:0
virtual/perl-ExtUtils-Install-2.200.0:0
virtual/perl-ExtUtils-MakeMaker-7.620.0:0
virtual/perl-ExtUtils-Manifest-1.730.0:0
virtual/perl-ExtUtils-ParseXS-3.430.0:0
virtual/perl-File-Spec-3.800.0:0
virtual/perl-File-Temp-0.231.100:0
virtual/perl-Getopt-Long-2.520.0:0
virtual/perl-IO-1.460.0:0
virtual/perl-IO-Compress-2.102.0:0
virtual/perl-IO-Socket-IP-0.410.0:0
virtual/perl-JSON-PP-4.60.0:0
virtual/perl-libnet-3.130.0:0 ssl
virtual/perl-MIME-Base64-3.160.0:0
virtual/perl-Module-Metadata-1.0.37-r1:0
virtual/perl-parent-0.238.0-r1:0
virtual/perl-Parse-CPAN-Meta-2.150.10-r5:0
virtual/perl-Perl-OSType-1.10.0-r5:0
virtual/perl-Pod-Parser-1.630.0-r8:0
virtual/perl-podlators-4.140.0-r2:0
virtual/perl-Scalar-List-Utils-1.550.0-r1:0
virtual/perl-Test-Harness-3.430.0:0
virtual/perl-Text-ParseWords-3.300.0-r8:0
virtual/perl-Time-Local-1.300.0:0
virtual/perl-version-0.992.800:0
virtual/perl-XSLoader-0.300.0-r4:0
virtual/pkgconfig-2:0
virtual/rust-1.52.1:0 -abi_mips_n32 -abi_mips_n64 -abi_mips_o32 -abi_s390_32 -abi_s390_64 -abi_x86_32 abi_x86_64 -abi_x86_x32
virtual/service-manager-1:0
virtual/ssh-0:0 -minimal
virtual/tmpfiles-0-r1:0
virtual/udev-217-r2:0
virtual/yacc-0:0
www-client/pybugz-0.13:0 python_targets_python3_8 python_targets_python3_9 -zsh-completion
x11-base/xcb-proto-1.14.1:0 -abi_mips_n32 -abi_mips_n64 -abi_mips_o32 -abi_s390_32 -abi_s390_64 -abi_x86_32 abi_x86_64 -abi_x86_x32 python_targets_python3_8 python_targets_python3_9
x11-base/xorg-proto-2021.4:0 -test
x11-libs/libX11-1.7.2:0 -abi_mips_n32 -abi_mips_n64 -abi_mips_o32 -abi_s390_32 -abi_s390_64 -abi_x86_32 abi_x86_64 -abi_x86_x32 -doc ipv6 -test
x11-libs/libXau-1.0.9-r1:0 -abi_mips_n32 -abi_mips_n64 -abi_mips_o32 -abi_s390_32 -abi_s390_64 abi_x86_32 abi_x86_64 -abi_x86_x32 -doc
x11-libs/libxcb-1.14:0/1.12 -abi_mips_n32 -abi_mips_n64 -abi_mips_o32 -abi_s390_32 -abi_s390_64 -abi_x86_32 abi_x86_64 -abi_x86_x32 -doc -doc -selinux -test xkb
x11-libs/libXdmcp-1.1.3:0 -abi_mips_n32 -abi_mips_n64 -abi_mips_o32 -abi_s390_32 -abi_s390_64 abi_x86_32 abi_x86_64 -abi_x86_x32 -doc
x11-libs/xtrans-1.4.0:0 -doc
x11-misc/compose-tables-1.7.2:0
x11-misc/shared-mime-info-2.1:0


#######################
# build.log           #
#######################
>>> Unpacking source...
>>> Unpacking opam-2.0.8.tar.gz to /var/tmp/portage/dev-ml/opam-format-2.0.8-r3/work
>>> Source unpacked in /var/tmp/portage/dev-ml/opam-format-2.0.8-r3/work
>>> Preparing source in /var/tmp/portage/dev-ml/opam-format-2.0.8-r3/work/opam-2.0.8 ...
 * Applying debian-Port-to-Dose3-6.0.1.patch ...
 [ ok ]
>>> Source prepared.
>>> Configuring source in /var/tmp/portage/dev-ml/opam-format-2.0.8-r3/work/opam-2.0.8 ...
./configure --prefix=/usr --build=x86_64-pc-linux-gnu --host=x86_64-pc-linux-gnu --mandir=/usr/share/man --infodir=/usr/share/info --datadir=/usr/share --sysconfdir=/etc --localstatedir=/var/lib --docdir=/usr/share/doc/opam-format-2.0.8-r3 --htmldir=/usr/share/doc/opam-format-2.0.8-r3/html --libdir=/usr/lib64
checking for x86_64-pc-linux-gnu-ocamlc... no
checking for ocamlc... ocamlc
OCaml version is 4.11.2
OCaml library path is /usr/lib64/ocaml
checking for x86_64-pc-linux-gnu-ocamlopt... no
checking for ocamlopt... ocamlopt
checking for x86_64-pc-linux-gnu-ocamlc.opt... no
checking for ocamlc.opt... ocamlc.opt
checking for x86_64-pc-linux-gnu-ocamlopt.opt... no
checking for ocamlopt.opt... ocamlopt.opt
checking for x86_64-pc-linux-gnu-ocaml... no
checking for ocaml... ocaml
checking for x86_64-pc-linux-gnu-ocamldep... no
checking for ocamldep... ocamldep
checking for x86_64-pc-linux-gnu-ocamldep.opt... no
checking for ocamldep.opt... ocamldep.opt
checking for x86_64-pc-linux-gnu-ocamlmktop... no
checking for ocamlmktop... ocamlmktop
checking for x86_64-pc-linux-gnu-ocamlmklib... no
checking for ocamlmklib... ocamlmklib
checking for x86_64-pc-linux-gnu-ocamldoc... no
checking for ocamldoc... ocamldoc
checking for x86_64-pc-linux-gnu-ocamldoc.opt... no
checking for ocamldoc.opt... ocamldoc.opt
checking for x86_64-pc-linux-gnu-ocamlbuild... no
checking for ocamlbuild... ocamlbuild
checking OCaml Sys.os_type... Unix
checking for gawk... gawk
checking for compiler type... cc
checking for compiler architecture... amd64
checking for compiler system... linux
checking for x86_64-pc-linux-gnu-x86_64-pc-linux-gnu-gcc... no
checking for x86_64-pc-linux-gnu-gcc... x86_64-pc-linux-gnu-gcc
checking whether the C compiler works... yes
checking for C compiler default output file name... a.out
checking for suffix of executables... 
checking whether we are cross compiling... no
checking for suffix of object files... o
checking whether we are using the GNU C compiler... yes
checking whether x86_64-pc-linux-gnu-gcc accepts -g... yes
checking for x86_64-pc-linux-gnu-gcc option to accept ISO C89... none needed
checking for x86_64-pc-linux-gnu-ocamlobjinfo... no
checking for ocamlobjinfo... ocamlobjinfo
checking for x86_64-pc-linux-gnu-ocamlfind... no
checking for ocamlfind... ocamlfind
checking for curl... curl
checking for x86_64-pc-linux-gnu-dune... no
checking for dune... dune
checking for x86_64-pc-linux-gnu-cppo... no
checking for cppo... cppo
checking for x86_64-pc-linux-gnu-patch... no
checking for patch... patch
checking for x86_64-pc-linux-gnu-bunzip2... no
checking for bunzip2... bunzip2

checking for OCaml findlib package unix... found
checking for OCaml findlib package bigarray... found
checking for OCaml findlib package extlib... found
checking for OCaml findlib package re... found
checking for OCaml findlib package re.glob... found
checking for OCaml findlib package cmdliner... found
checking for OCaml findlib package ocamlgraph... found
checking for OCaml findlib package cudf... found
checking for OCaml findlib package dose3.common... found
checking for OCaml findlib package dose3.algo... found
checking for OCaml findlib package opam-file-format... found
checking for OCaml findlib package mccs... not found
checking for x86_64-pc-linux-gnu-g++... x86_64-pc-linux-gnu-g++
checking whether we are using the GNU C++ compiler... yes
checking whether x86_64-pc-linux-gnu-g++ accepts -g... yes

============================================================================
Some dependencies are missing. If you are just interested in the stand-alone
'opam' binary, run 'make lib-ext' to download and include them.
============================================================================

configure: creating ./config.status
config.status: creating Makefile.config
config.status: creating src/client/opamManifest.inc

Opam will be built WITH a built-in solver

Executables will be installed in /usr/bin
Manual pages will be installed in /usr/share/man
>>> Source configured.
>>> Compiling source in /var/tmp/portage/dev-ml/opam-format-2.0.8-r3/work/opam-2.0.8 ...
File "src/core/opamProcess.ml", line 382, characters 9-24:
382 |     (let open OpamCompat in
               ^^^^^^^^^^^^^^^
Warning 33: unused open OpamCompat.
File "src/core/opamUrl.ml", line 56, characters 10-20:
56 |     match Re.get_all (Re.exec re u) with
               ^^^^^^^^^^
Alert deprecated: Re.get_all
Use Group.all
File "src/core/opamUrl.ml", line 109, characters 12-18:
109 |       Some (Re.get sub 1 ^ try "/" ^ Re.get sub 2 with Not_found -> "")
                  ^^^^^^
Alert deprecated: Re.get
Use Group.get
File "src/core/opamUrl.ml", line 109, characters 37-43:
109 |       Some (Re.get sub 1 ^ try "/" ^ Re.get sub 2 with Not_found -> "")
                                           ^^^^^^
Alert deprecated: Re.get
Use Group.get
File "src/core/opamUrl.ml", line 219, characters 6-12:
219 |       Re.get (Re.exec re t.path) 1
            ^^^^^^
Alert deprecated: Re.get
Use Group.get
File "src/core/opamProcess.ml", line 382, characters 9-24:
382 |     (let open OpamCompat in
               ^^^^^^^^^^^^^^^
Warning 33: unused open OpamCompat.
File "src/core/opamStd.ml", line 431, characters 32-46:
431 |       let subs = Array.to_list (Re.get_all_ofs subs) in
                                      ^^^^^^^^^^^^^^
Alert deprecated: Re.get_all_ofs
Use Group.all_offset
File "src/core/opamUrl.ml", line 56, characters 10-20:
56 |     match Re.get_all (Re.exec re u) with
               ^^^^^^^^^^
Alert deprecated: Re.get_all
Use Group.all
File "src/core/opamUrl.ml", line 109, characters 12-18:
109 |       Some (Re.get sub 1 ^ try "/" ^ Re.get sub 2 with Not_found -> "")
                  ^^^^^^
Alert deprecated: Re.get
Use Group.get
File "src/core/opamUrl.ml", line 109, characters 37-43:
109 |       Some (Re.get sub 1 ^ try "/" ^ Re.get sub 2 with Not_found -> "")
                                           ^^^^^^
Alert deprecated: Re.get
Use Group.get
File "src/core/opamUrl.ml", line 219, characters 6-12:
219 |       Re.get (Re.exec re t.path) 1
            ^^^^^^
Alert deprecated: Re.get
Use Group.get
File "src/core/opamStd.ml", line 431, characters 32-46:
431 |       let subs = Array.to_list (Re.get_all_ofs subs) in
                                      ^^^^^^^^^^^^^^
Alert deprecated: Re.get_all_ofs
Use Group.all_offset
File "src/format/opamFormula.ml", line 31, characters 7-24:
31 |       (OpamPrinter.relop r)
            ^^^^^^^^^^^^^^^^^
Alert deprecated: OpamPrinter.relop
Use OpamPrinter.FullPos.relop instead.
File "src/format/opamFormula.ml", line 43, characters 7-24:
43 |       (OpamPrinter.relop r)
            ^^^^^^^^^^^^^^^^^
Alert deprecated: OpamPrinter.relop
Use OpamPrinter.FullPos.relop instead.
File "src/format/opamFormula.ml", line 234, characters 28-45:
234 |     Printf.sprintf "%s %s" (OpamPrinter.relop relop)
                                  ^^^^^^^^^^^^^^^^^
Alert deprecated: OpamPrinter.relop
Use OpamPrinter.FullPos.relop instead.
File "src/format/opamFormula.ml", line 31, characters 7-24:
31 |       (OpamPrinter.relop r)
            ^^^^^^^^^^^^^^^^^
Alert deprecated: OpamPrinter.relop
Use OpamPrinter.FullPos.relop instead.
File "src/format/opamFormula.ml", line 43, characters 7-24:
43 |       (OpamPrinter.relop r)
            ^^^^^^^^^^^^^^^^^
Alert deprecated: OpamPrinter.relop
Use OpamPrinter.FullPos.relop instead.
File "src/format/opamFormula.ml", line 234, characters 28-45:
234 |     Printf.sprintf "%s %s" (OpamPrinter.relop relop)
                                  ^^^^^^^^^^^^^^^^^
Alert deprecated: OpamPrinter.relop
Use OpamPrinter.FullPos.relop instead.
File "src/format/opamFilter.ml", line 44, characters 36-53:
44 |            (aux ~context:`Relop e) (OpamPrinter.relop s) (aux ~context:`Relop f))
                                         ^^^^^^^^^^^^^^^^^
Alert deprecated: OpamPrinter.relop
Use OpamPrinter.FullPos.relop instead.
File "src/format/opamFilter.ml", line 109, characters 11-18:
109 |         if Re.test ss 2 then
                 ^^^^^^^
Alert deprecated: Re.test
Use Group.test
File "src/format/opamFilter.ml", line 110, characters 15-21:
110 |           aux (Re.get ss 1 :: acc)
                     ^^^^^^
Alert deprecated: Re.get
Use Group.get
File "src/format/opamFilter.ml", line 111, characters 18-28:
111 |             (fst (Re.get_ofs ss 0) + String.length (Re.get ss 0))
                        ^^^^^^^^^^
Alert deprecated: Re.get_ofs
Use Group.offset
File "src/format/opamFilter.ml", line 111, characters 52-58:
111 |             (fst (Re.get_ofs ss 0) + String.length (Re.get ss 0))
                                                          ^^^^^^
Alert deprecated: Re.get
Use Group.get
File "src/format/opamFilter.ml", line 524, characters 38-55:
524 |           Printf.sprintf "%s \"%s\"" (OpamPrinter.relop op) s
                                            ^^^^^^^^^^^^^^^^^
Alert deprecated: OpamPrinter.relop
Use OpamPrinter.FullPos.relop instead.
File "src/format/opamFilter.ml", line 526, characters 34-51:
526 |           Printf.sprintf "%s %s" (OpamPrinter.relop op) (to_string v)
                                        ^^^^^^^^^^^^^^^^^
Alert deprecated: OpamPrinter.relop
Use OpamPrinter.FullPos.relop instead.
File "src/format/opamFilter.ml", line 528, characters 36-53:
528 |           Printf.sprintf "%s (%s)" (OpamPrinter.relop op) (to_string v)
                                          ^^^^^^^^^^^^^^^^^
Alert deprecated: OpamPrinter.relop
Use OpamPrinter.FullPos.relop instead.
File "src/format/opamFormat.ml", line 820, characters 21-48:
820 |            let str = OpamPrinter.Normalise.items items in
                           ^^^^^^^^^^^^^^^^^^^^^^^^^^^
Alert deprecated: module OpamPrinter.Normalise
Use OpamPrinter.FullPos.Normalise instead.
File "src/format/opamFormat.ml", line 827, characters 28-55:
827 |          assert (check sgs (OpamPrinter.Normalise.items items));
                                  ^^^^^^^^^^^^^^^^^^^^^^^^^^^
Alert deprecated: module OpamPrinter.Normalise
Use OpamPrinter.FullPos.Normalise instead.
File "src/format/opamFilter.ml", line 44, characters 36-53:
44 |            (aux ~context:`Relop e) (OpamPrinter.relop s) (aux ~context:`Relop f))
                                         ^^^^^^^^^^^^^^^^^
Alert deprecated: OpamPrinter.relop
Use OpamPrinter.FullPos.relop instead.
File "src/format/opamFilter.ml", line 109, characters 11-18:
109 |         if Re.test ss 2 then
                 ^^^^^^^
Alert deprecated: Re.test
Use Group.test
File "src/format/opamFilter.ml", line 110, characters 15-21:
110 |           aux (Re.get ss 1 :: acc)
                     ^^^^^^
Alert deprecated: Re.get
Use Group.get
File "src/format/opamFilter.ml", line 111, characters 18-28:
111 |             (fst (Re.get_ofs ss 0) + String.length (Re.get ss 0))
                        ^^^^^^^^^^
Alert deprecated: Re.get_ofs
Use Group.offset
File "src/format/opamFilter.ml", line 111, characters 52-58:
111 |             (fst (Re.get_ofs ss 0) + String.length (Re.get ss 0))
                                                          ^^^^^^
Alert deprecated: Re.get
Use Group.get
File "src/format/opamFilter.ml", line 524, characters 38-55:
524 |           Printf.sprintf "%s \"%s\"" (OpamPrinter.relop op) s
                                            ^^^^^^^^^^^^^^^^^
Alert deprecated: OpamPrinter.relop
Use OpamPrinter.FullPos.relop instead.
File "src/format/opamFilter.ml", line 526, characters 34-51:
526 |           Printf.sprintf "%s %s" (OpamPrinter.relop op) (to_string v)
                                        ^^^^^^^^^^^^^^^^^
Alert deprecated: OpamPrinter.relop
Use OpamPrinter.FullPos.relop instead.
File "src/format/opamFilter.ml", line 528, characters 36-53:
528 |           Printf.sprintf "%s (%s)" (OpamPrinter.relop op) (to_string v)
                                          ^^^^^^^^^^^^^^^^^
Alert deprecated: OpamPrinter.relop
Use OpamPrinter.FullPos.relop instead.
File "src/format/opamFormat.ml", line 820, characters 21-48:
820 |            let str = OpamPrinter.Normalise.items items in
                           ^^^^^^^^^^^^^^^^^^^^^^^^^^^
Alert deprecated: module OpamPrinter.Normalise
Use OpamPrinter.FullPos.Normalise instead.
File "src/format/opamFormat.ml", line 827, characters 28-55:
827 |          assert (check sgs (OpamPrinter.Normalise.items items));
                                  ^^^^^^^^^^^^^^^^^^^^^^^^^^^
Alert deprecated: module OpamPrinter.Normalise
Use OpamPrinter.FullPos.Normalise instead.
File "src/state/opamPinned.ml", line 126, characters 34-51:
126 |                                  (OpamPrinter.relop op) (OpamPackage.Version.to_string vc))
                                        ^^^^^^^^^^^^^^^^^
Alert deprecated: OpamPrinter.relop
Use OpamPrinter.FullPos.relop instead.
File "src/solver/opamCudf.ml", line 222, characters 47-64:
222 |     | Some (r,v) -> Printf.sprintf " (%s %d)" (OpamPrinter.relop r) v in
                                                     ^^^^^^^^^^^^^^^^^
Alert deprecated: OpamPrinter.relop
Use OpamPrinter.FullPos.relop instead.
File "src/format/opamFile.ml", line 545, characters 10-33:
545 |          (OpamLexer.env_update_op, OpamPrinter.env_update_op) ^+
                ^^^^^^^^^^^^^^^^^^^^^^^
Alert deprecated: OpamLexer.env_update_op
Use OpamLexer.FullPos.env_update_op instead.
File "src/format/opamFile.ml", line 545, characters 35-60:
545 |          (OpamLexer.env_update_op, OpamPrinter.env_update_op) ^+
                                         ^^^^^^^^^^^^^^^^^^^^^^^^^
Alert deprecated: OpamPrinter.env_update_op
Use OpamPrinter.FullPos.env_update_op instead.
File "src/format/opamFile.ml", line 723, characters 8-23:
723 |     try OpamParser.main OpamLexer.token lexbuf filename with
              ^^^^^^^^^^^^^^^
Alert deprecated: OpamParser.main
Use OpamParser.FullPos.main instead.
File "src/format/opamFile.ml", line 735, characters 9-36:
735 |          OpamPrinter.format_opamfile fmt file)
               ^^^^^^^^^^^^^^^^^^^^^^^^^^^
Alert deprecated: OpamPrinter.format_opamfile
Use OpamPrinter.FullPos.format_opamfile instead.
File "src/format/opamFile.ml", line 748, characters 4-24:
748 |     OpamPrinter.opamfile t
          ^^^^^^^^^^^^^^^^^^^^
Alert deprecated: OpamPrinter.opamfile
Use OpamPrinter.FullPos.opamfile instead.
File "src/format/opamFile.ml", line 823, characters 19-36:
823 |                    OpamPrinter.items [f] :: strs
                         ^^^^^^^^^^^^^^^^^
Alert deprecated: OpamPrinter.items
Use OpamPrinter.FullPos.items instead.
File "src/format/opamFile.ml", line 854, characters 17-34:
854 |                  OpamPrinter.items f :: strs
                       ^^^^^^^^^^^^^^^^^
Alert deprecated: OpamPrinter.items
Use OpamPrinter.FullPos.items instead.
File "src/format/opamFile.ml", line 862, characters 38-55:
862 |          (if rem = [] then [""] else [OpamPrinter.items rem;""]))
                                            ^^^^^^^^^^^^^^^^^
Alert deprecated: OpamPrinter.items
Use OpamPrinter.FullPos.items instead.
File "src/state/opamPinned.ml", line 126, characters 34-51:
126 |                                  (OpamPrinter.relop op) (OpamPackage.Version.to_string vc))
                                        ^^^^^^^^^^^^^^^^^
Alert deprecated: OpamPrinter.relop
Use OpamPrinter.FullPos.relop instead.
File "src/solver/opamCudf.ml", line 222, characters 47-64:
222 |     | Some (r,v) -> Printf.sprintf " (%s %d)" (OpamPrinter.relop r) v in
                                                     ^^^^^^^^^^^^^^^^^
Alert deprecated: OpamPrinter.relop
Use OpamPrinter.FullPos.relop instead.
File "src/state/opamSwitchState.ml", line 664, characters 41-58:
664 |       (match relop with `Eq -> "" | r -> OpamPrinter.relop r)
                                               ^^^^^^^^^^^^^^^^^
Alert deprecated: OpamPrinter.relop
Use OpamPrinter.FullPos.relop instead.
File "src/client/opamAdminRepoUpgrade.ml", line 11, characters 0-23:
11 | module Algo = Dose_algo
     ^^^^^^^^^^^^^^^^^^^^^^^
Warning 60: unused module Algo.
File "src/client/opamAdminRepoUpgrade.ml", line 11, characters 0-23:
11 | module Algo = Dose_algo
     ^^^^^^^^^^^^^^^^^^^^^^^
Warning 60: unused module Algo.
File "src/state/opamSwitchState.ml", line 664, characters 41-58:
664 |       (match relop with `Eq -> "" | r -> OpamPrinter.relop r)
                                               ^^^^^^^^^^^^^^^^^
Alert deprecated: OpamPrinter.relop
Use OpamPrinter.FullPos.relop instead.
File "src/client/opamListCommand.ml", line 471, characters 20-47:
471 |   if normalise then OpamPrinter.Normalise.value else
                          ^^^^^^^^^^^^^^^^^^^^^^^^^^^
Alert deprecated: module OpamPrinter.Normalise
Use OpamPrinter.FullPos.Normalise instead.
File "src/client/opamListCommand.ml", line 477, characters 19-41:
477 |   | List (_, l) -> OpamPrinter.value_list l
                         ^^^^^^^^^^^^^^^^^^^^^^
Alert deprecated: OpamPrinter.value_list
Use OpamPrinter.FullPos.value_list instead.
File "src/client/opamListCommand.ml", line 478, characters 9-36:
478 |   | f -> OpamPrinter.Normalise.value f
               ^^^^^^^^^^^^^^^^^^^^^^^^^^^
Alert deprecated: module OpamPrinter.Normalise
Use OpamPrinter.FullPos.Normalise instead.
File "src/client/opamArg.ml", line 488, characters 45-51:
488 |       let name = OpamPackage.Name.of_string (Re.get sub 1) in
                                                   ^^^^^^
Alert deprecated: Re.get
Use Group.get
File "src/client/opamArg.ml", line 490, characters 49-55:
490 |         try Some (OpamPackage.Version.of_string (Re.get sub 2))
                                                       ^^^^^^
Alert deprecated: Re.get
Use Group.get
File "src/client/opamArg.ml", line 526, characters 18-24:
526 |       let sname = Re.get sub 1 in
                        ^^^^^^
Alert deprecated: Re.get
Use Group.get
File "src/client/opamArg.ml", line 527, characters 16-22:
527 |       let sop = Re.get sub 2 in
                      ^^^^^^
Alert deprecated: Re.get
Use Group.get
File "src/client/opamArg.ml", line 528, characters 21-27:
528 |       let sversion = Re.get sub 3 in
                           ^^^^^^
Alert deprecated: Re.get
Use Group.get
File "src/client/opamArg.ml", line 531, characters 15-30:
531 |       let op = OpamLexer.relop sop in
                     ^^^^^^^^^^^^^^^
Alert deprecated: OpamLexer.relop
Use OpamLexer.FullPos.relop instead.
File "src/client/opamListCommand.ml", line 471, characters 20-47:
471 |   if normalise then OpamPrinter.Normalise.value else
                          ^^^^^^^^^^^^^^^^^^^^^^^^^^^
Alert deprecated: module OpamPrinter.Normalise
Use OpamPrinter.FullPos.Normalise instead.
File "src/client/opamListCommand.ml", line 477, characters 19-41:
477 |   | List (_, l) -> OpamPrinter.value_list l
                         ^^^^^^^^^^^^^^^^^^^^^^
Alert deprecated: OpamPrinter.value_list
Use OpamPrinter.FullPos.value_list instead.
File "src/client/opamListCommand.ml", line 478, characters 9-36:
478 |   | f -> OpamPrinter.Normalise.value f
               ^^^^^^^^^^^^^^^^^^^^^^^^^^^
Alert deprecated: module OpamPrinter.Normalise
Use OpamPrinter.FullPos.Normalise instead.
File "src/client/opamArg.ml", line 488, characters 45-51:
488 |       let name = OpamPackage.Name.of_string (Re.get sub 1) in
                                                   ^^^^^^
Alert deprecated: Re.get
Use Group.get
File "src/client/opamArg.ml", line 490, characters 49-55:
490 |         try Some (OpamPackage.Version.of_string (Re.get sub 2))
                                                       ^^^^^^
Alert deprecated: Re.get
Use Group.get
File "src/client/opamArg.ml", line 526, characters 18-24:
526 |       let sname = Re.get sub 1 in
                        ^^^^^^
Alert deprecated: Re.get
Use Group.get
File "src/client/opamArg.ml", line 527, characters 16-22:
527 |       let sop = Re.get sub 2 in
                      ^^^^^^
Alert deprecated: Re.get
Use Group.get
File "src/client/opamArg.ml", line 528, characters 21-27:
528 |       let sversion = Re.get sub 3 in
                           ^^^^^^
Alert deprecated: Re.get
Use Group.get
File "src/client/opamArg.ml", line 531, characters 15-30:
531 |       let op = OpamLexer.relop sop in
                     ^^^^^^^^^^^^^^^
Alert deprecated: OpamLexer.relop
Use OpamLexer.FullPos.relop instead.
File "src/format/opamFile.ml", line 545, characters 10-33:
545 |          (OpamLexer.env_update_op, OpamPrinter.env_update_op) ^+
                ^^^^^^^^^^^^^^^^^^^^^^^
Alert deprecated: OpamLexer.env_update_op
Use OpamLexer.FullPos.env_update_op instead.
File "src/format/opamFile.ml", line 545, characters 35-60:
545 |          (OpamLexer.env_update_op, OpamPrinter.env_update_op) ^+
                                         ^^^^^^^^^^^^^^^^^^^^^^^^^
Alert deprecated: OpamPrinter.env_update_op
Use OpamPrinter.FullPos.env_update_op instead.
File "src/format/opamFile.ml", line 723, characters 8-23:
723 |     try OpamParser.main OpamLexer.token lexbuf filename with
              ^^^^^^^^^^^^^^^
Alert deprecated: OpamParser.main
Use OpamParser.FullPos.main instead.
File "src/format/opamFile.ml", line 735, characters 9-36:
735 |          OpamPrinter.format_opamfile fmt file)
               ^^^^^^^^^^^^^^^^^^^^^^^^^^^
Alert deprecated: OpamPrinter.format_opamfile
Use OpamPrinter.FullPos.format_opamfile instead.
File "src/format/opamFile.ml", line 748, characters 4-24:
748 |     OpamPrinter.opamfile t
          ^^^^^^^^^^^^^^^^^^^^
Alert deprecated: OpamPrinter.opamfile
Use OpamPrinter.FullPos.opamfile instead.
File "src/format/opamFile.ml", line 823, characters 19-36:
823 |                    OpamPrinter.items [f] :: strs
                         ^^^^^^^^^^^^^^^^^
Alert deprecated: OpamPrinter.items
Use OpamPrinter.FullPos.items instead.
File "src/format/opamFile.ml", line 854, characters 17-34:
854 |                  OpamPrinter.items f :: strs
                       ^^^^^^^^^^^^^^^^^
Alert deprecated: OpamPrinter.items
Use OpamPrinter.FullPos.items instead.
File "src/format/opamFile.ml", line 862, characters 38-55:
862 |          (if rem = [] then [""] else [OpamPrinter.items rem;""]))
                                            ^^^^^^^^^^^^^^^^^
Alert deprecated: OpamPrinter.items
Use OpamPrinter.FullPos.items instead.
>>> Source compiled.      
>>> Test phase: dev-ml/opam-format-2.0.8-r3
        make alias tests/runtest (exit 2)
(cd _build/default/tests && /usr/bin/make all)
/usr/bin/make --no-print-directory REPOKIND=local run
  00 init                 ..................................... [ OK ]
  01 upload               ..................................... [FAIL]
  02 install-remove       ..................................... [FAIL]
  03 list                 ..................................... [ OK ]
  04 install-opt          ..................................... [FAIL]
  05 list                 ..................................... [ OK ]
  06 install              ..................................... [FAIL]
  07 list                 ..................................... [ OK ]
  08 reinstall            ..................................... [FAIL]
  09 list                 ..................................... [ OK ]
  10 upload-new           ..................................... [ OK ]
  11 list                 ..................................... [ OK ]
  12 upgrade              ..................................... [FAIL]
  13 list                 ..................................... [ OK ]
  14 downgrade            ..................................... [FAIL]
  15 list                 ..................................... [ OK ]
  16 switch-alias         ..................................... [FAIL]
  17 list                 ..................................... [ OK ]
  18 switch-env-packages  ..................................... [FAIL]
  19 repo                 ..................................... [FAIL]
  20 list                 ..................................... [ OK ]
FAILED! Logs in /var/tmp/portage/dev-ml/opam-format-2.0.8-r3/work/opam-2.0.8/_build/default/tests/failed-local.log
make[1]: *** [Makefile:83: run] Error 1
make: *** [Makefile:89: local] Error 2
 * ERROR: dev-ml/opam-format-2.0.8-r3::gentoo failed (test phase):
 *   (no error message)
 * 
 * Call stack:
 *     ebuild.sh, line 125:  Called src_test
 *   environment, line 642:  Called dune_src_test
 *   environment, line 395:  Called die
 * The specific snippet of code:
 *       dune runtest || die
 * 
 * If you need support, post the output of `emerge --info '=dev-ml/opam-format-2.0.8-r3::gentoo'`,
 * the complete build log and the output of `emerge -pqv '=dev-ml/opam-format-2.0.8-r3::gentoo'`.
 * The complete build log is located at '/var/log/emerge-log/build/dev-ml/opam-format-2.0.8-r3:20210607-002544.log'.
 * For convenience, a symlink to the build log is located at '/var/tmp/portage/dev-ml/opam-format-2.0.8-r3/temp/build.log'.
 * The ebuild environment file is located at '/var/tmp/portage/dev-ml/opam-format-2.0.8-r3/temp/environment'.
 * Working directory: '/var/tmp/portage/dev-ml/opam-format-2.0.8-r3/work/opam-2.0.8'
 * S: '/var/tmp/portage/dev-ml/opam-format-2.0.8-r3/work/opam-2.0.8'