Go to:
Gentoo Home
Documentation
Forums
Lists
Bugs
Planet
Store
Wiki
Get Gentoo!
Gentoo's Bugzilla – Attachment 910509 Details for
Bug 944149
dev-scheme/racket-8.15 fails to compile: rktio_process.c:452:39: error: passing argument 2 of rktio_set_signal_handler from incompatible pointer type [-Wincompatible-pointer-types]
Home
|
New
–
[Ex]
|
Browse
|
Search
|
Privacy Policy
|
[?]
|
Reports
|
Requests
|
Help
|
New Account
|
Log In
[x]
|
Forgot Password
Login:
[x]
build.log
build.log (text/plain), 117.55 KB, created by
Agostino Sarubbo
on 2024-11-20 15:25:43 UTC
(
hide
)
Description:
build.log
Filename:
MIME Type:
Creator:
Agostino Sarubbo
Created:
2024-11-20 15:25:43 UTC
Size:
117.55 KB
patch
obsolete
> * Package: dev-scheme/racket-8.15:0/8.15 > * Repository: gentoo > * Maintainer: scheme@gentoo.org > * Upstream: https://github.com/racket/racket/issues/ > * USE: abi_x86_64 amd64 chez doc elibc_glibc futures iconv jit kernel_linux ncurses places threads > * FEATURES: network-sandbox preserve-libs sandbox userpriv usersandbox > > >@@@@@ PLEASE PAY ATTENTION HERE!!! @@@@@ >This information may help you to understand if this is a duplicate or if this bug exists after you pushed a fix; >This ebuild was merged at the following commit: >https://github.com/gentoo-mirror/gentoo/commit/e722221339e0f1d847b9919ca27711577b449014 (Wed Nov 20 14:03:33 UTC 2024) >@@@@@ END @@@@@ > > > >################## ># emerge --info: # >################## >Portage 3.0.66.1 (python 3.12.7-final-0, default/linux/amd64/23.0/split-usr, gcc-15, glibc-2.40-r5, 6.1.114-gentoo-dist x86_64) >================================================================= >System uname: Linux-6.1.114-gentoo-dist-x86_64-AMD_EPYC_7513_32-Core_Processor-with-glibc2.40 >KiB Mem: 263449476 total, 69455368 free >KiB Swap: 0 total, 0 free >Timestamp of repository gentoo: Wed, 20 Nov 2024 14:03:32 +0000 >sh bash 5.2_p37 >ld GNU ld (Gentoo 2.43 p3) 2.43.1 >app-misc/pax-utils: 1.3.8::gentoo >app-shells/bash: 5.2_p37::gentoo >dev-build/autoconf: 2.72-r1::gentoo >dev-build/automake: 1.17-r1::gentoo >dev-build/cmake: 3.31.0::gentoo >dev-build/libtool: 2.5.3::gentoo >dev-build/make: 4.4.1-r100::gentoo >dev-build/meson: 1.6.0::gentoo >dev-lang/perl: 5.40.0::gentoo >dev-lang/python: 3.10.15_p2::gentoo, 3.11.10_p1::gentoo, 3.12.7_p1::gentoo, 3.13.0::gentoo >sys-apps/baselayout: 2.17::gentoo >sys-apps/sandbox: 2.40::gentoo >sys-devel/binutils: 2.43-r2::gentoo >sys-devel/binutils-config: 5.5.2::gentoo >sys-devel/gcc: 15.0.0_pre20241117-r2::gentoo >sys-devel/gcc-config: 2.11::gentoo >sys-kernel/linux-headers: 6.11::gentoo (virtual/os-headers) >sys-libs/glibc: 2.40-r5::gentoo >Repositories: > >gentoo > location: /usr/portage > sync-type: rsync > sync-uri: rsync://rsync.gentoo.org/gentoo-portage > priority: -1000 > volatile: True > sync-rsync-verify-metamanifest: yes > sync-rsync-verify-max-age: 3 > sync-rsync-extra-opts: > sync-rsync-verify-jobs: 1 > >ACCEPT_KEYWORDS="amd64 ~amd64" >ACCEPT_LICENSE="* Apache-2.0 MIT" >CBUILD="x86_64-pc-linux-gnu" >CFLAGS="-O2 -march=x86-64 -pipe -pipe -frecord-gcc-switches -fno-diagnostics-color -fmessage-length=0" >CHOST="x86_64-pc-linux-gnu" >CONFIG_PROTECT="/etc /usr/share/gnupg/qualified.txt" >CONFIG_PROTECT_MASK="/etc/ca-certificates.conf /etc/env.d /etc/fonts/fonts.conf /etc/gconf /etc/gentoo-release /etc/revdep-rebuild /etc/sandbox.d /etc/terminfo" >CXXFLAGS="-O2 -march=x86-64 -pipe -pipe -frecord-gcc-switches -fno-diagnostics-color -fmessage-length=0" >DISTDIR="/var/tmp/portage/dev-scheme/racket-8.15/distdir" >EMERGE_DEFAULT_OPTS="--complete-graph y --with-bdeps=y -1 -k -b --backtrack=100" >ENV_UNSET="CARGO_HOME DBUS_SESSION_BUS_ADDRESS DISPLAY GDK_PIXBUF_MODULE_FILE GOBIN GOPATH PERL5LIB PERL5OPT PERLPREFIX PERL_CORE PERL_MB_OPT PERL_MM_OPT XAUTHORITY XDG_CACHE_HOME XDG_CONFIG_HOME XDG_DATA_HOME XDG_RUNTIME_DIR XDG_STATE_HOME" >FCFLAGS="-O2 -march=x86-64 -pipe -pipe -frecord-gcc-switches -fno-diagnostics-color -fmessage-length=0" >FEATURES="assume-digests binpkg-docompress binpkg-dostrip binpkg-logs binpkg-multi-instance buildpkg buildpkg-live config-protect-if-modified distlocks ebuild-locks fixlafiles ipc-sandbox merge-sync merge-wait multilib-strict network-sandbox news parallel-fetch pid-sandbox pkgdir-index-trusted preserve-libs protect-owned qa-unresolved-soname-deps sandbox sfperms sign split-log strict unknown-features-warn unmerge-logs unmerge-orphans userfetch userpriv usersandbox usersync xattr" >FFLAGS="-O2 -march=x86-64 -pipe -pipe -frecord-gcc-switches -fno-diagnostics-color -fmessage-length=0" >GENTOO_MIRRORS="http://mirror.leaseweb.com/gentoo/ http://ftp.snt.utwente.nl/pub/os/linux/gentoo/ http://ftp.belnet.be/pub/rsync.gentoo.org/gentoo/ http://distfiles.gentoo.org" >LANG="C.UTF8" >LDFLAGS="-Wl,-O1 -Wl,--as-needed -Wl,-z,pack-relative-relocs -Wl,--defsym=__gentoo_check_ldflags__=0" >LEX="flex" >MAKEOPTS="-j32" >PKGDIR="/root/tbci/binpkg" >PORTAGE_CONFIGROOT="/" >PORTAGE_RSYNC_OPTS="--recursive --links --safe-links --perms --times --omit-dir-times --compress --force --whole-file --delete --stats --human-readable --timeout=180 --exclude=/distfiles --exclude=/local --exclude=/packages --exclude=/.git" >PORTAGE_TMPDIR="/var/tmp" >SHELL="/bin/bash" >USE="acl amd64 bzip2 cet chez crypt debug doc elogind futures gdbm iconv ipv6 jit jumbo-build libtirpc multilib native-symlinks ncurses nls openmp pam pcre places readline seccomp split-usr ssl test-rust threads unicode verify-sig xattr zlib" ABI_X86="64" ELIBC="glibc" KERNEL="linux" >Unset: ADDR2LINE, AR, ARFLAGS, AS, ASFLAGS, CC, CCLD, CONFIG_SHELL, CPP, CPPFLAGS, CTARGET, CXX, CXXFILT, ELFEDIT, EXTRA_ECONF, F77FLAGS, FC, GCOV, GPROF, INSTALL_MASK, LC_ALL, LD, LFLAGS, LIBTOOL, LINGUAS, MAKE, MAKEFLAGS, NM, OBJCOPY, OBJDUMP, PORTAGE_BINHOST, PORTAGE_BUNZIP2_COMMAND, PORTAGE_COMPRESS, PORTAGE_COMPRESS_FLAGS, PORTAGE_RSYNC_EXTRA_OPTS, PYTHONPATH, RANLIB, READELF, RUSTFLAGS, SIZE, STRINGS, STRIP, YACC, YFLAGS > > > > > >############################## ># emerge history (qlop -mv): # >############################## >2024-11-20T15:50:22 >>> acct-group/mail-0-r3 >2024-11-20T15:50:22 >>> app-eselect/eselect-ctags-1.19 >2024-11-20T15:50:23 >>> media-libs/libjpeg-turbo-3.0.4 >2024-11-20T15:50:23 >>> dev-libs/fribidi-1.0.13 >2024-11-20T15:50:23 >>> dev-lang/nasm-2.16.03 >2024-11-20T15:50:37 >>> app-eselect/eselect-emacs-1.19 >2024-11-20T15:50:37 >>> net-libs/liblockfile-1.17 >2024-11-20T15:50:38 >>> x11-libs/pango-1.52.2 > > > > >####################################### ># installed packages (qlist -ICvUSS): # >####################################### >acct-group/audio-0-r3:0 >acct-group/cdrom-0-r3:0 >acct-group/dialout-0-r3:0 >acct-group/disk-0-r3:0 >acct-group/floppy-0-r1:0 >acct-group/input-0-r3:0 >acct-group/kmem-0-r3:0 >acct-group/kvm-0-r3:0 >acct-group/lp-0-r3:0 >acct-group/mail-0-r3:0 >acct-group/man-0-r3:0 >acct-group/messagebus-0-r3:0 >acct-group/polkitd-0-r3:0 >acct-group/portage-0-r2:0 >acct-group/render-0-r3:0 >acct-group/root-0-r2:0 >acct-group/sgx-0-r2:0 >acct-group/sshd-0-r3:0 >acct-group/tape-0-r3:0 >acct-group/tty-0-r3:0 >acct-group/usb-0-r3:0 >acct-group/video-0-r3:0 >acct-user/man-1-r3:0 >acct-user/messagebus-0-r3:0 >acct-user/polkitd-0-r3:0 >acct-user/portage-0-r3:0 >acct-user/sshd-0-r3:0 >app-admin/eselect-1.4.28:0 -doc -emacs -vim-syntax >app-admin/perl-cleaner-2.31-r2:0 -pkgcore >app-alternatives/awk-4:0 -busybox gawk -mawk -nawk split-usr >app-alternatives/bc-0:0 -gh gnu >app-alternatives/bzip2-1:0 -lbzip2 -pbzip2 reference split-usr >app-alternatives/cpio-0:0 gnu -libarchive split-usr >app-alternatives/gzip-1:0 -pigz reference split-usr >app-alternatives/lex-0-r1:0 flex -reflex >app-alternatives/ninja-1:0 reference -samurai >app-alternatives/sh-0:0 bash -busybox -dash -ksh -lksh -mksh >app-alternatives/tar-0:0 gnu -libarchive split-usr >app-alternatives/yacc-1-r2:0 bison -byacc -reference >app-arch/bzip2-1.0.8-r5:0/1 -abi_mips_n32 -abi_mips_n64 -abi_mips_o32 -abi_s390_32 -abi_s390_64 -abi_x86_32 abi_x86_64 -abi_x86_x32 -static -static-libs verify-sig >app-arch/cpio-2.15:0 nls >app-arch/gzip-1.13-r1:0 -pic -static verify-sig >app-arch/libarchive-3.7.7:0/13 -abi_mips_n32 -abi_mips_n64 -abi_mips_o32 -abi_s390_32 -abi_s390_64 -abi_x86_32 abi_x86_64 -abi_x86_x32 acl -blake2 bzip2 e2fsprogs -expat iconv -lz4 lzma -lzo -nettle -static-libs -test verify-sig xattr zstd >app-arch/tar-1.35:0 acl -minimal nls -selinux verify-sig xattr >app-arch/unzip-6.0_p27-r1:0 bzip2 -natspec unicode >app-arch/xz-utils-5.6.3:0 -abi_mips_n32 -abi_mips_n64 -abi_mips_o32 -abi_s390_32 -abi_s390_64 -abi_x86_32 abi_x86_64 -abi_x86_x32 -cpu_flags_arm_crc32 -doc extra-filters nls -pgo -static-libs verify-sig >app-arch/zstd-1.5.6:0/1 -abi_mips_n32 -abi_mips_n64 -abi_mips_o32 -abi_s390_32 -abi_s390_64 -abi_x86_32 abi_x86_64 -abi_x86_x32 -lz4 lzma -static-libs -test zlib >app-crypt/gnupg-2.4.6-r1:0 bzip2 -doc -ldap nls readline -selinux smartcard ssl -test tofu -tools -tpm -usb -user-socket verify-sig -wks-server >app-crypt/gpgme-1.24.0:1/11.6.15.2 -common-lisp cxx debug -python python_targets_python3_10 python_targets_python3_11 python_targets_python3_12 -python_targets_python3_13 -qt5 -qt6 -static-libs -test verify-sig >app-crypt/libb2-0.98.1-r3:0 -abi_mips_n32 -abi_mips_n64 -abi_mips_o32 -abi_s390_32 -abi_s390_64 -abi_x86_32 abi_x86_64 -abi_x86_x32 -native-cflags openmp -static-libs >app-crypt/libmd-1.1.0:0 -abi_mips_n32 -abi_mips_n64 -abi_mips_o32 -abi_s390_32 -abi_s390_64 -abi_x86_32 abi_x86_64 -abi_x86_x32 >app-crypt/pinentry-1.3.1:0 -X -caps -efl -emacs -gtk -keyring ncurses -qt5 -qt6 verify-sig -wayland >app-crypt/rhash-1.4.5:0/1 -abi_mips_n32 -abi_mips_n64 -abi_mips_o32 -abi_s390_32 -abi_s390_64 -abi_x86_32 abi_x86_64 -abi_x86_x32 debug nls ssl -static-libs >app-editors/nano-8.2:0 -debug -justify -magic -minimal ncurses nls spell unicode >app-eselect/eselect-ctags-1.19:0 >app-eselect/eselect-emacs-1.19:0 >app-eselect/eselect-fontconfig-20220403:0 >app-eselect/eselect-iptables-20220320:0 >app-eselect/eselect-lib-bin-symlink-0.1.1-r1:0 >app-eselect/eselect-pinentry-0.7.4:0 >app-i18n/man-pages-ja-20180315-r2:0 >app-i18n/man-pages-l10n-4.19.0:0 l10n_cs l10n_da l10n_de l10n_el l10n_es l10n_fi l10n_fr l10n_hu l10n_id l10n_it l10n_mk l10n_nb l10n_nl l10n_pl l10n_pt-BR l10n_ro l10n_ru l10n_sr l10n_sv l10n_uk l10n_vi >app-i18n/man-pages-zh_CN-1.6.4.0:0 >app-misc/ca-certificates-20240203.3.98:0 -cacert >app-misc/editor-wrapper-4-r1:0 >app-misc/mime-types-2.1.54:0 -nginx >app-misc/pax-utils-1.3.8:0 -caps -man -python -python_single_target_python3_10 -python_single_target_python3_11 python_single_target_python3_12 -python_single_target_python3_13 -seccomp -test >app-misc/tmux-3.5a:0 debug -jemalloc -selinux -systemd -utempter -vim-syntax >app-portage/eix-0.36.7-r1:0 debug -doc nls -sqlite >app-portage/elt-patches-20240912:0 >app-portage/gemato-20.6:0 gpg -pretty-log python_targets_pypy3 python_targets_python3_10 python_targets_python3_11 python_targets_python3_12 -python_targets_python3_13 -test -tools >app-portage/gentoolkit-0.6.8:0 python_targets_pypy3 python_targets_python3_10 python_targets_python3_11 python_targets_python3_12 -python_targets_python3_13 -test >app-portage/getuto-1.13:0 -test >app-portage/portage-utils-0.97:0 openmp qmanifest -static >app-shells/bash-5.2_p37:0 -afs -bashlogger -examples -mem-scramble net nls -pgo -plugins readline verify-sig >app-shells/bash-completion-2.14.0-r1:0 eselect -test >app-shells/gentoo-bashcomp-20240625:0 >app-shells/push-3.4:0 >app-shells/quoter-4.2:0 >app-text/ansifilter-2.21:0 -gui verify-sig >app-text/asciidoc-10.2.1:0 -python_single_target_pypy3 -python_single_target_python3_10 -python_single_target_python3_11 python_single_target_python3_12 -python_single_target_python3_13 -test >app-text/build-docbook-catalog-2.4:0 >app-text/docbook-xml-dtd-4.5-r2:4.5 >app-text/docbook-xml-dtd-4.4-r3:4.4 >app-text/docbook-xml-dtd-4.2-r3:4.2 >app-text/docbook-xml-dtd-4.1.2-r7:4.1.2 >app-text/docbook-xsl-stylesheets-1.79.1-r4:0 -ruby >app-text/manpager-1:0 >app-text/opensp-1.5.2-r10:0 -doc nls -static-libs -test >app-text/po4a-0.73:0 -perl_features_debug -perl_features_ithreads -perl_features_quadmath -test -test >app-text/sgml-common-0.6.3-r7:0 >app-text/xmlto-0.0.28-r11:0 -latex text >dev-build/autoconf-2.72-r1:2.72 -emacs verify-sig >dev-build/autoconf-archive-2024.10.16:0 >dev-build/autoconf-wrapper-20231224:0 >dev-build/automake-1.17-r1:1.17 -test verify-sig >dev-build/automake-wrapper-20240607:0 >dev-build/cmake-3.31.0:0 -dap -doc -gui ncurses -qt6 -test verify-sig >dev-build/gtk-doc-am-1.33.2:0 >dev-build/libtool-2.5.3:2 -vanilla >dev-build/make-4.4.1-r100:0 -doc -guile -guile_single_target_2-2 guile_single_target_3-0 nls -static -test verify-sig >dev-build/meson-1.6.0:0 python_targets_pypy3 python_targets_python3_10 python_targets_python3_11 python_targets_python3_12 -python_targets_python3_13 -test verify-sig >dev-build/meson-format-array-0:0 python_targets_python3_10 python_targets_python3_11 python_targets_python3_12 -python_targets_python3_13 >dev-build/ninja-1.12.1:0 -doc -test >dev-db/sqlite-3.47.0-r1:3 -abi_mips_n32 -abi_mips_n64 -abi_mips_o32 -abi_s390_32 -abi_s390_64 -abi_x86_32 abi_x86_64 -abi_x86_x32 debug -doc -icu readline -secure-delete -static-libs -tcl -test -tools >dev-lang/duktape-2.7.0-r3:0/2.7.0 >dev-lang/nasm-2.16.03:0 -doc >dev-lang/perl-5.40.0:0/5.40 -berkdb -doc gdbm -minimal -perl_features_debug -perl_features_ithreads -perl_features_quadmath >dev-lang/pypy-3.10.7.3.17_p2:3.10/pypy310-pp73-384 ensurepip gdbm jit ncurses sqlite symlink test-install -tk >dev-lang/python-3.13.0:3.13 -bluetooth -build debug ensurepip -examples gdbm -jit -libedit llvm_slot_18 ncurses -pgo readline sqlite ssl -test -tk -valgrind verify-sig >dev-lang/python-3.12.7_p1:3.12 -bluetooth -build debug ensurepip -examples gdbm -libedit ncurses -pgo readline sqlite ssl -test -tk -valgrind verify-sig >dev-lang/python-3.11.10_p1:3.11 -bluetooth -build debug ensurepip -examples gdbm -libedit ncurses -pgo readline sqlite ssl -test -tk -valgrind verify-sig >dev-lang/python-3.10.15_p2:3.10 -bluetooth -build debug ensurepip -examples gdbm -libedit ncurses -pgo readline sqlite ssl -test -tk -valgrind verify-sig >dev-lang/python-exec-2.4.10:2 native-symlinks python_targets_pypy3 python_targets_python3_10 python_targets_python3_11 python_targets_python3_12 python_targets_python3_13 python_targets_python3_13t -test >dev-lang/python-exec-conf-2.4.6:2 python_targets_pypy3 python_targets_python3_10 python_targets_python3_11 python_targets_python3_12 -python_targets_python3_13 -python_targets_python3_13t >dev-lang/tcl-8.6.15:0/8.6 -abi_mips_n32 -abi_mips_n64 -abi_mips_o32 -abi_s390_32 -abi_s390_64 -abi_x86_32 abi_x86_64 -abi_x86_x32 debug threads >dev-libs/boehm-gc-8.2.8:0 -abi_mips_n32 -abi_mips_n64 -abi_mips_o32 -abi_s390_32 -abi_s390_64 abi_x86_32 abi_x86_64 -abi_x86_x32 -cxx large -static-libs threads >dev-libs/elfutils-0.192-r1:0 -abi_mips_n32 -abi_mips_n64 -abi_mips_o32 -abi_s390_32 -abi_s390_64 -abi_x86_32 abi_x86_64 -abi_x86_x32 bzip2 -debuginfod -lzma nls -stacktrace -static-libs -test utils -valgrind verify-sig -zstd >dev-libs/expat-2.6.4:0 -abi_mips_n32 -abi_mips_n64 -abi_mips_o32 -abi_s390_32 -abi_s390_64 -abi_x86_32 abi_x86_64 -abi_x86_x32 -examples -static-libs -test unicode >dev-libs/fribidi-1.0.13:0 -abi_mips_n32 -abi_mips_n64 -abi_mips_o32 -abi_s390_32 -abi_s390_64 -abi_x86_32 abi_x86_64 -abi_x86_x32 -doc -test >dev-libs/glib-2.78.6:2 -abi_mips_n32 -abi_mips_n64 -abi_mips_o32 -abi_s390_32 -abi_s390_64 -abi_x86_32 abi_x86_64 -abi_x86_x32 -dbus debug elf -gtk-doc mime -selinux -static-libs -sysprof -systemtap -test -utils xattr >dev-libs/gmp-6.3.0-r1:0/10.4 -abi_mips_n32 -abi_mips_n64 -abi_mips_o32 -abi_s390_32 -abi_s390_64 -abi_x86_32 abi_x86_64 -abi_x86_x32 asm cpudetection cxx -doc -pic -static-libs >dev-libs/gobject-introspection-1.78.1-r2:0 -doctool -gtk-doc -python_single_target_python3_10 -python_single_target_python3_11 python_single_target_python3_12 -python_single_target_python3_13 -test >dev-libs/gobject-introspection-common-1.78.1:0 >dev-libs/isl-0.27:0/23 -abi_mips_n32 -abi_mips_n64 -abi_mips_o32 -abi_s390_32 -abi_s390_64 -abi_x86_32 abi_x86_64 -abi_x86_x32 -static-libs >dev-libs/jsoncpp-1.9.6-r2:0/26 -abi_mips_n32 -abi_mips_n64 -abi_mips_o32 -abi_s390_32 -abi_s390_64 -abi_x86_32 abi_x86_64 -abi_x86_x32 -doc -test >dev-libs/libassuan-3.0.0:0/3.0 verify-sig >dev-libs/libatomic_ops-7.8.2:0 -abi_mips_n32 -abi_mips_n64 -abi_mips_o32 -abi_s390_32 -abi_s390_64 abi_x86_32 abi_x86_64 -abi_x86_x32 >dev-libs/libevent-2.1.12-r1:0/2.1-7 -abi_mips_n32 -abi_mips_n64 -abi_mips_o32 -abi_s390_32 -abi_s390_64 -abi_x86_32 abi_x86_64 -abi_x86_x32 clock-gettime debug -malloc-replacement ssl -static-libs -test -verbose-debug verify-sig >dev-libs/libffi-3.4.6-r2:0/8 -abi_mips_n32 -abi_mips_n64 -abi_mips_o32 -abi_s390_32 -abi_s390_64 -abi_x86_32 abi_x86_64 -abi_x86_x32 debug -exec-static-trampoline -pax-kernel -static-libs -test >dev-libs/libgcrypt-1.11.0-r1:0/20 -abi_mips_n32 -abi_mips_n64 -abi_mips_o32 -abi_s390_32 -abi_s390_64 -abi_x86_32 abi_x86_64 -abi_x86_x32 asm -cpu_flags_arm_aes -cpu_flags_arm_neon -cpu_flags_arm_sha1 -cpu_flags_arm_sha2 -cpu_flags_arm_sve -cpu_flags_ppc_altivec -cpu_flags_ppc_vsx2 -cpu_flags_ppc_vsx3 cpu_flags_x86_aes cpu_flags_x86_avx cpu_flags_x86_avx2 -cpu_flags_x86_avx512f -cpu_flags_x86_padlock -cpu_flags_x86_sha cpu_flags_x86_sse4_1 -doc getentropy -static-libs verify-sig >dev-libs/libgpg-error-1.51:0 -abi_mips_n32 -abi_mips_n64 -abi_mips_o32 -abi_s390_32 -abi_s390_64 -abi_x86_32 abi_x86_64 -abi_x86_x32 -common-lisp nls -static-libs -test verify-sig >dev-libs/libksba-1.6.7:0 -static-libs verify-sig >dev-libs/libpcre2-10.44-r1:0/3 -abi_mips_n32 -abi_mips_n64 -abi_mips_o32 -abi_s390_32 -abi_s390_64 -abi_x86_32 abi_x86_64 -abi_x86_x32 bzip2 jit -libedit pcre16 pcre32 readline -static-libs unicode -valgrind verify-sig zlib >dev-libs/libpipeline-1.5.8:0 -test >dev-libs/libtasn1-4.19.0:0/6 -abi_mips_n32 -abi_mips_n64 -abi_mips_o32 -abi_s390_32 -abi_s390_64 -abi_x86_32 abi_x86_64 -abi_x86_x32 -static-libs -test verify-sig >dev-libs/libunistring-1.2:0/5 -abi_mips_n32 -abi_mips_n64 -abi_mips_o32 -abi_s390_32 -abi_s390_64 -abi_x86_32 abi_x86_64 -abi_x86_x32 -doc -static-libs >dev-libs/libuv-1.49.2:0/1 verify-sig >dev-libs/libxml2-2.13.5:2 -abi_mips_n32 -abi_mips_n64 -abi_mips_o32 -abi_s390_32 -abi_s390_64 -abi_x86_32 abi_x86_64 -abi_x86_x32 -examples -icu -lzma python python_targets_python3_10 python_targets_python3_11 python_targets_python3_12 -python_targets_python3_13 readline -static-libs -test >dev-libs/libxslt-1.1.42:0 -abi_mips_n32 -abi_mips_n64 -abi_mips_o32 -abi_s390_32 -abi_s390_64 -abi_x86_32 abi_x86_64 -abi_x86_x32 crypt debug -examples -python python_targets_python3_10 python_targets_python3_11 python_targets_python3_12 -python_targets_python3_13 -static-libs >dev-libs/lzo-2.10:2 -abi_mips_n32 -abi_mips_n64 -abi_mips_o32 -abi_s390_32 -abi_s390_64 -abi_x86_32 abi_x86_64 -abi_x86_x32 -examples split-usr -static-libs >dev-libs/mpc-1.3.1:0/3 -abi_mips_n32 -abi_mips_n64 -abi_mips_o32 -abi_s390_32 -abi_s390_64 -abi_x86_32 abi_x86_64 -abi_x86_x32 -static-libs >dev-libs/mpdecimal-4.0.0:4 -cxx -test >dev-libs/mpfr-4.2.1:0/6 -abi_mips_n32 -abi_mips_n64 -abi_mips_o32 -abi_s390_32 -abi_s390_64 -abi_x86_32 abi_x86_64 -abi_x86_x32 -static-libs verify-sig >dev-libs/nettle-3.10:0/8-6 -abi_mips_n32 -abi_mips_n64 -abi_mips_o32 -abi_s390_32 -abi_s390_64 -abi_x86_32 abi_x86_64 -abi_x86_x32 asm -cpu_flags_arm_aes -cpu_flags_arm_neon -cpu_flags_arm_sha1 -cpu_flags_arm_sha2 -cpu_flags_ppc_altivec -cpu_flags_ppc_vsx2 -cpu_flags_ppc_vsx3 cpu_flags_x86_aes cpu_flags_x86_pclmul -cpu_flags_x86_sha -doc gmp -static-libs verify-sig >dev-libs/npth-1.8:0 -test >dev-libs/openssl-3.3.2-r1:0/3 -abi_mips_n32 -abi_mips_n64 -abi_mips_o32 -abi_s390_32 -abi_s390_64 -abi_x86_32 abi_x86_64 -abi_x86_x32 asm cpu_flags_x86_sse2 -fips -ktls quic -rfc3779 -sctp -static-libs -test -tls-compression -vanilla verify-sig -verify-sig -weak-ssl-ciphers >dev-libs/popt-1.19-r1:0 -abi_mips_n32 -abi_mips_n64 -abi_mips_o32 -abi_s390_32 -abi_s390_64 -abi_x86_32 abi_x86_64 -abi_x86_x32 nls -static-libs >dev-perl/Capture-Tiny-0.480.0-r1:0 -examples -perl_features_debug -perl_features_ithreads -perl_features_quadmath -test >dev-perl/Class-Inspector-1.360.0:0 -perl_features_debug -perl_features_ithreads -perl_features_quadmath -test >dev-perl/Config-AutoConf-0.320.0:0 -perl_features_debug -perl_features_ithreads -perl_features_quadmath -test >dev-perl/Encode-EUCJPASCII-0.30.0-r1:0 -perl_features_debug -perl_features_ithreads -perl_features_quadmath -test >dev-perl/Encode-HanExtra-0.230.0-r3:0 -perl_features_debug -perl_features_ithreads -perl_features_quadmath >dev-perl/Encode-Locale-1.50.0-r1:0 -perl_features_debug -perl_features_ithreads -perl_features_quadmath -test >dev-perl/Exporter-Tiny-1.6.2:0 -examples -perl_features_debug -perl_features_ithreads -perl_features_quadmath -test >dev-perl/ExtUtils-CChecker-0.120.0-r1:0 -perl_features_debug -perl_features_ithreads -perl_features_quadmath -test >dev-perl/File-BaseDir-0.90.0:0 -perl_features_debug -perl_features_ithreads -perl_features_quadmath -test >dev-perl/File-DesktopEntry-0.220.0-r1:0 -perl_features_debug -perl_features_ithreads -perl_features_quadmath -test >dev-perl/File-MimeInfo-0.330.0:0 -perl_features_debug -perl_features_ithreads -perl_features_quadmath -test >dev-perl/File-ShareDir-1.118.0:0 -minimal -perl_features_debug -perl_features_ithreads -perl_features_quadmath -test >dev-perl/File-ShareDir-Install-0.140.0:0 -perl_features_debug -perl_features_ithreads -perl_features_quadmath -test -test >dev-perl/File-Slurper-0.14.0:0 -examples -perl_features_debug -perl_features_ithreads -perl_features_quadmath -test >dev-perl/IO-Socket-SSL-2.89.0:0 -examples -idn -perl_features_debug -perl_features_ithreads -perl_features_quadmath -test >dev-perl/IPC-System-Simple-1.300.0:0 -perl_features_debug -perl_features_ithreads -perl_features_quadmath -test >dev-perl/List-MoreUtils-0.430.0:0 -perl_features_debug -perl_features_ithreads -perl_features_quadmath -test xs >dev-perl/List-MoreUtils-XS-0.430.0:0 -perl_features_debug -perl_features_ithreads -perl_features_quadmath -test >dev-perl/Locale-gettext-1.70.0-r1:0 -perl_features_debug -perl_features_ithreads -perl_features_quadmath -test >dev-perl/MIME-Base32-1.303.0-r1:0 -perl_features_debug -perl_features_ithreads -perl_features_quadmath -test >dev-perl/MIME-Charset-1.13.1:0 l10n_ja l10n_zh -perl_features_debug -perl_features_ithreads -perl_features_quadmath -test >dev-perl/Module-Build-0.423.400:0 -perl_features_debug -perl_features_ithreads -perl_features_quadmath -test >dev-perl/Net-SSLeay-1.940.0:0 -examples -examples -minimal -perl_features_debug -perl_features_ithreads -perl_features_quadmath -test >dev-perl/Params-Util-1.102.0:0 -perl_features_debug -perl_features_ithreads -perl_features_quadmath -test >dev-perl/PerlIO-utf8_strict-0.10.0:0 -perl_features_debug -perl_features_ithreads -perl_features_quadmath -test >dev-perl/Pod-Parser-1.660.0:0 -perl_features_debug -perl_features_ithreads -perl_features_quadmath -test >dev-perl/Regexp-IPv6-0.30.0-r2:0 -perl_features_debug -perl_features_ithreads -perl_features_quadmath -test >dev-perl/SGMLSpm-1.1-r2:0 -perl_features_debug -perl_features_ithreads -perl_features_quadmath -test >dev-perl/Syntax-Keyword-Try-0.300.0:0 -perl_features_debug -perl_features_ithreads -perl_features_quadmath -test >dev-perl/TermReadKey-2.380.0-r1:0 -examples -perl_features_debug -perl_features_ithreads -perl_features_quadmath -test >dev-perl/Text-CharWidth-0.40.0-r2:0 -perl_features_debug -perl_features_ithreads -perl_features_quadmath -test >dev-perl/Text-WrapI18N-0.60.0-r2:0 -perl_features_debug -perl_features_ithreads -perl_features_quadmath -test >dev-perl/Unicode-LineBreak-2019.1.0:0 -perl_features_debug -perl_features_ithreads -perl_features_quadmath >dev-perl/URI-5.300.0:0 -perl_features_debug -perl_features_ithreads -perl_features_quadmath -test >dev-perl/XS-Parse-Keyword-0.460.0:0 -perl_features_debug -perl_features_ithreads -perl_features_quadmath -test >dev-perl/YAML-Tiny-1.740.0:0 -minimal -perl_features_debug -perl_features_ithreads -perl_features_quadmath -test >dev-python/backports-tarfile-1.2.0:0 python_targets_pypy3 python_targets_python3_10 python_targets_python3_11 -test >dev-python/certifi-3024.7.22:0 python_targets_pypy3 python_targets_python3_10 python_targets_python3_11 python_targets_python3_12 -python_targets_python3_13 -test >dev-python/charset-normalizer-3.4.0:0 python_targets_pypy3 python_targets_python3_10 python_targets_python3_11 python_targets_python3_12 -python_targets_python3_13 -test >dev-python/cython-3.0.11:0 debug -doc python_targets_pypy3 python_targets_python3_10 python_targets_python3_11 python_targets_python3_12 -python_targets_python3_13 -test >dev-python/editables-0.5:0 python_targets_pypy3 python_targets_python3_10 python_targets_python3_11 python_targets_python3_12 -python_targets_python3_13 -python_targets_python3_13t -test >dev-python/ensurepip-pip-24.3.1:0 >dev-python/ensurepip-setuptools-75.5.0:0 >dev-python/ensurepip-wheels-100:0 >dev-python/flit-core-3.10.1:0 python_targets_pypy3 python_targets_python3_10 python_targets_python3_11 python_targets_python3_12 -python_targets_python3_13 -python_targets_python3_13t -test >dev-python/gentoo-common-1:0 >dev-python/gpep517-16:0 python_targets_pypy3 python_targets_python3_10 python_targets_python3_11 python_targets_python3_12 -python_targets_python3_13 -python_targets_python3_13t -test >dev-python/hatch-vcs-0.4.0:0 python_targets_pypy3 python_targets_python3_10 python_targets_python3_11 python_targets_python3_12 -python_targets_python3_13 -python_targets_python3_13t -test >dev-python/hatchling-1.26.3:0 python_targets_pypy3 python_targets_python3_10 python_targets_python3_11 python_targets_python3_12 -python_targets_python3_13 -python_targets_python3_13t -test >dev-python/idna-3.10:0 python_targets_pypy3 python_targets_python3_10 python_targets_python3_11 python_targets_python3_12 -python_targets_python3_13 -test >dev-python/installer-0.7.0:0 python_targets_pypy3 python_targets_python3_10 python_targets_python3_11 python_targets_python3_12 -python_targets_python3_13 -python_targets_python3_13t -test >dev-python/jaraco-collections-5.1.0:0 python_targets_pypy3 python_targets_python3_10 python_targets_python3_11 python_targets_python3_12 -python_targets_python3_13 -python_targets_python3_13t -test >dev-python/jaraco-context-6.0.1:0 python_targets_pypy3 python_targets_python3_10 python_targets_python3_11 python_targets_python3_12 -python_targets_python3_13 -python_targets_python3_13t -test >dev-python/jaraco-functools-4.1.0:0 python_targets_pypy3 python_targets_python3_10 python_targets_python3_11 python_targets_python3_12 -python_targets_python3_13 -python_targets_python3_13t -test >dev-python/jaraco-text-4.0.0:0 python_targets_pypy3 python_targets_python3_10 python_targets_python3_11 python_targets_python3_12 -python_targets_python3_13 -python_targets_python3_13t -test >dev-python/jinja2-3.1.4:0 -doc python_targets_pypy3 python_targets_python3_10 python_targets_python3_11 python_targets_python3_12 -python_targets_python3_13 -test >dev-python/lxml-5.3.0:0 debug -doc -examples python_targets_pypy3 python_targets_python3_10 python_targets_python3_11 python_targets_python3_12 -python_targets_python3_13 -test threads >dev-python/markupsafe-3.0.2:0 debug native-extensions python_targets_pypy3 python_targets_python3_10 python_targets_python3_11 python_targets_python3_12 -python_targets_python3_13 -python_targets_python3_13t -test >dev-python/more-itertools-10.5.0:0 -doc python_targets_pypy3 python_targets_python3_10 python_targets_python3_11 python_targets_python3_12 -python_targets_python3_13 -python_targets_python3_13t -test >dev-python/packaging-24.2:0 python_targets_pypy3 python_targets_python3_10 python_targets_python3_11 python_targets_python3_12 -python_targets_python3_13 -python_targets_python3_13t -test >dev-python/pathspec-0.12.1:0 python_targets_pypy3 python_targets_python3_10 python_targets_python3_11 python_targets_python3_12 -python_targets_python3_13 -python_targets_python3_13t -test >dev-python/platformdirs-4.3.6:0 python_targets_pypy3 python_targets_python3_10 python_targets_python3_11 python_targets_python3_12 -python_targets_python3_13 -python_targets_python3_13t -test >dev-python/pluggy-1.5.0:0 python_targets_pypy3 python_targets_python3_10 python_targets_python3_11 python_targets_python3_12 -python_targets_python3_13 -python_targets_python3_13t -test >dev-python/pypy3-7.3.17-r100:0/pypy310-pp73-384 gdbm ncurses sqlite test-install -tk >dev-python/pypy3_10-exe-bin-7.3.17:7.3.17 >dev-python/PySocks-1.7.1-r2:0 python_targets_pypy3 python_targets_python3_10 python_targets_python3_11 python_targets_python3_12 -python_targets_python3_13 >dev-python/requests-2.32.3:0 python_targets_pypy3 python_targets_python3_10 python_targets_python3_11 python_targets_python3_12 -python_targets_python3_13 -socks5 -test test-rust >dev-python/setuptools-75.5.0:0 python_targets_pypy3 python_targets_python3_10 python_targets_python3_11 python_targets_python3_12 -python_targets_python3_13 -python_targets_python3_13t -test >dev-python/setuptools-scm-8.1.0:0 python_targets_pypy3 python_targets_python3_10 python_targets_python3_11 python_targets_python3_12 -python_targets_python3_13 -python_targets_python3_13t -test >dev-python/tomli-2.1.0:0 python_targets_pypy3 python_targets_python3_10 python_targets_python3_11 python_targets_python3_12 -python_targets_python3_13 -test >dev-python/trove-classifiers-2024.10.21.16:0 python_targets_pypy3 python_targets_python3_10 python_targets_python3_11 python_targets_python3_12 -python_targets_python3_13 -python_targets_python3_13t -test >dev-python/urllib3-2.2.3:0 -brotli -http2 python_targets_pypy3 python_targets_python3_10 python_targets_python3_11 python_targets_python3_12 -python_targets_python3_13 -test -zstd >dev-python/wheel-0.45.0:0 python_targets_pypy3 python_targets_python3_10 python_targets_python3_11 python_targets_python3_12 -python_targets_python3_13 -python_targets_python3_13t -test >dev-util/checkbashisms-2.23.5:0 >dev-util/desktop-file-utils-0.28:0 >dev-util/glib-utils-2.78.6:0 -python_single_target_python3_10 -python_single_target_python3_11 python_single_target_python3_12 -python_single_target_python3_13 >dev-util/gperf-3.1-r2:0 >dev-util/patchelf-0.18.0:0 >dev-util/pkgconf-2.3.0:0/5 -abi_mips_n32 -abi_mips_n64 -abi_mips_o32 -abi_s390_32 -abi_s390_64 -abi_x86_32 abi_x86_64 -abi_x86_x32 native-symlinks -test >dev-util/re2c-3.1:0 debug -test >dev-vcs/git-2.47.0-r1:0 blksha1 -cgi curl -cvs -doc gpg -highlight iconv -keyring -mediawiki nls pcre -perforce -perl -python_single_target_python3_10 -python_single_target_python3_11 python_single_target_python3_12 -python_single_target_python3_13 safe-directory -selinux -subversion -test -tk webdav -xinetd >media-fonts/liberation-fonts-2.1.5:0 -X -X -fontforge >media-gfx/graphite2-1.3.14_p20210810-r3:0 -abi_mips_n32 -abi_mips_n64 -abi_mips_o32 -abi_s390_32 -abi_s390_64 -abi_x86_32 abi_x86_64 -abi_x86_x32 -perl -test >media-libs/fontconfig-2.15.0-r1:1.0 -abi_mips_n32 -abi_mips_n64 -abi_mips_o32 -abi_s390_32 -abi_s390_64 -abi_x86_32 abi_x86_64 -abi_x86_x32 -doc nls -test >media-libs/freetype-2.13.3:2 -X -abi_mips_n32 -abi_mips_n64 -abi_mips_o32 -abi_s390_32 -abi_s390_64 -abi_x86_32 abi_x86_64 -abi_x86_x32 adobe-cff -brotli bzip2 cleartype-hinting debug -doc -fontforge harfbuzz png -static-libs -svg -utils >media-libs/harfbuzz-10.1.0:0/6.0.0 -abi_mips_n32 -abi_mips_n64 -abi_mips_o32 -abi_s390_32 -abi_s390_64 -abi_x86_32 abi_x86_64 -abi_x86_x32 cairo debug -doc -experimental glib graphite -icu introspection -test truetype >media-libs/libjpeg-turbo-3.0.4:0/0.2 -abi_mips_n32 -abi_mips_n64 -abi_mips_o32 -abi_s390_32 -abi_s390_64 -abi_x86_32 abi_x86_64 -abi_x86_x32 -cpu_flags_arm_neon -java -java -static-libs >media-libs/libpng-1.6.44:0/16 -abi_mips_n32 -abi_mips_n64 -abi_mips_o32 -abi_s390_32 -abi_s390_64 -abi_x86_32 abi_x86_64 -abi_x86_x32 -apng cpu_flags_x86_sse -static-libs -test >net-dns/c-ares-1.34.3:0/2 -abi_mips_n32 -abi_mips_n64 -abi_mips_o32 -abi_s390_32 -abi_s390_64 -abi_x86_32 abi_x86_64 -abi_x86_x32 -static-libs -test verify-sig >net-dns/libidn2-2.3.7:0/2 -abi_mips_n32 -abi_mips_n64 -abi_mips_o32 -abi_s390_32 -abi_s390_64 -abi_x86_32 abi_x86_64 -abi_x86_x32 nls -static-libs verify-sig >net-firewall/iptables-1.8.11:0/1.8.3 -conntrack -netlink -nftables -pcap -static-libs -test >net-libs/gnutls-3.8.7.1-r1:0/30.30 -abi_mips_n32 -abi_mips_n64 -abi_mips_o32 -abi_s390_32 -abi_s390_64 -abi_x86_32 abi_x86_64 -abi_x86_x32 -brotli cxx -dane -doc -examples idn nls openssl -pkcs11 seccomp -sslv2 -sslv3 -static-libs -test -test-full tls-heartbeat -tools verify-sig zlib -zstd >net-libs/liblockfile-1.17:0 -static-libs >net-libs/libmnl-1.0.5:0/0.2.0 -examples verify-sig >net-libs/libnsl-2.0.1:0/3 -abi_mips_n32 -abi_mips_n64 -abi_mips_o32 -abi_s390_32 -abi_s390_64 -abi_x86_32 abi_x86_64 -abi_x86_x32 -static-libs >net-libs/libpsl-0.21.5:0 -abi_mips_n32 -abi_mips_n64 -abi_mips_o32 -abi_s390_32 -abi_s390_64 -abi_x86_32 abi_x86_64 -abi_x86_x32 -icu idn -static-libs -test >net-libs/libtirpc-1.3.5:0/3 -abi_mips_n32 -abi_mips_n64 -abi_mips_o32 -abi_s390_32 -abi_s390_64 -abi_x86_32 abi_x86_64 -abi_x86_x32 -kerberos -static-libs >net-libs/nghttp2-1.64.0:0/1.14 -abi_mips_n32 -abi_mips_n64 -abi_mips_o32 -abi_s390_32 -abi_s390_64 -abi_x86_32 abi_x86_64 -abi_x86_x32 debug -hpack-tools -jemalloc -static-libs -systemd -test -utils -xml >net-libs/nghttp3-1.6.0:0/0 -abi_mips_n32 -abi_mips_n64 -abi_mips_o32 -abi_s390_32 -abi_s390_64 -abi_x86_32 abi_x86_64 -abi_x86_x32 -static-libs -test >net-misc/curl-8.11.0:0 -abi_mips_n32 -abi_mips_n64 -abi_mips_o32 -abi_s390_32 -abi_s390_64 -abi_x86_32 abi_x86_64 -abi_x86_x32 adns alt-svc -brotli -curl_quic_ngtcp2 curl_quic_openssl -curl_ssl_gnutls -curl_ssl_mbedtls curl_ssl_openssl -curl_ssl_rustls debug ftp -gnutls -gopher hsts http2 http3 -idn imap -kerberos -ldap -mbedtls openssl pop3 progress-meter psl quic -rtmp -rustls -samba smtp -ssh ssl -sslv3 -static-libs -telnet -test tftp verify-sig websockets -zstd >net-misc/dhcpcd-10.1.0:0 debug embedded ipv6 -privsep udev >net-misc/iputils-20240905:0 arping -caps -clockdiff -doc filecaps -idn nls -test -tracepath >net-misc/netifrc-0.7.12:0 dhcp >net-misc/openssh-contrib-9.7_p1-r4:0 -X -X509 -abi_mips_n32 -audit debug -hpn -kerberos -ldns -libedit -livecd pam -pie -security-key -selinux ssl -static -test verify-sig -xmss >net-misc/rsync-3.3.0-r1:0 acl -examples iconv -lz4 -python_single_target_python3_10 -python_single_target_python3_11 python_single_target_python3_12 -python_single_target_python3_13 -rrsync ssl -stunnel -system-zlib verify-sig xattr -xxhash -zstd >net-misc/wget-1.25.0:0 -cookie-check debug -gnutls -idn ipv6 -libproxy -metalink nls -ntlm pcre ssl -static -test -uuid verify-sig zlib >perl-core/File-Temp-0.231.100-r1:0 -perl_features_debug -perl_features_ithreads -perl_features_quadmath >perl-core/Getopt-Long-2.580.0:0 -perl_features_debug -perl_features_ithreads -perl_features_quadmath >perl-core/Scalar-List-Utils-1.680.0:0 -perl_features_debug -perl_features_ithreads -perl_features_quadmath >perl-core/Test-Harness-3.500.0:0 -perl_features_debug -perl_features_ithreads -perl_features_quadmath -test >sec-keys/openpgp-keys-alejandro-colomar-20231031:0 >sec-keys/openpgp-keys-andresimon-20240906:0 >sec-keys/openpgp-keys-bison-20220407:0 >sec-keys/openpgp-keys-bradhouse-20240624:0 >sec-keys/openpgp-keys-bradking-20240902:0 >sec-keys/openpgp-keys-bzip2-20220406:0 >sec-keys/openpgp-keys-chetramey-20220406:0 >sec-keys/openpgp-keys-coreutils-20220407:0 >sec-keys/openpgp-keys-danielstenberg-20220330:0 >sec-keys/openpgp-keys-diffutils-20220407:0 >sec-keys/openpgp-keys-elfutils-20240301:0 >sec-keys/openpgp-keys-file-20220611:0 >sec-keys/openpgp-keys-findutils-20220407:0 >sec-keys/openpgp-keys-gawk-20220407:0 >sec-keys/openpgp-keys-gdbm-20220407:0 >sec-keys/openpgp-keys-gentoo-release-20240703:0 -test >sec-keys/openpgp-keys-gettext-20220407:0 >sec-keys/openpgp-keys-gnupg-20220210:0 >sec-keys/openpgp-keys-gnutls-20240415:0 >sec-keys/openpgp-keys-grep-20220407:0 >sec-keys/openpgp-keys-gzip-20220406:0 >sec-keys/openpgp-keys-jimmeyering-20220407:0 >sec-keys/openpgp-keys-jpakkane-20231105:0 >sec-keys/openpgp-keys-karelzak-20230517:0 >sec-keys/openpgp-keys-lassecollin-20240529:0 >sec-keys/openpgp-keys-libarchive-20221209:0 >sec-keys/openpgp-keys-libevent-0:0 >sec-keys/openpgp-keys-libidn-20240114:0 >sec-keys/openpgp-keys-libtasn1-20220824:0 >sec-keys/openpgp-keys-libuv-20240209:0 >sec-keys/openpgp-keys-m4-20220407:0 >sec-keys/openpgp-keys-madler-20220328:0 >sec-keys/openpgp-keys-make-20220407:0 >sec-keys/openpgp-keys-netfilter-20220326:0 >sec-keys/openpgp-keys-nettle-20220603:0 >sec-keys/openpgp-keys-openssh-20220316:0 >sec-keys/openpgp-keys-openssl-20240920:0 >sec-keys/openpgp-keys-patch-20220407:0 >sec-keys/openpgp-keys-philiphazel-20220416:0 >sec-keys/openpgp-keys-python-20221025:0 >sec-keys/openpgp-keys-sed-20220407:0 >sec-keys/openpgp-keys-sysvinit-20220413:0 >sec-keys/openpgp-keys-tar-20220406:0 >sec-keys/openpgp-keys-thomasdickey-20240114:0 >sec-keys/openpgp-keys-vincentlefevre-20221213:0 >sec-keys/openpgp-keys-waynedavison-20220329:0 >sec-keys/openpgp-keys-wget-20241111:0 >sec-keys/openpgp-keys-zackweinberg-20231223:0 >sys-apps/acl-2.3.2-r1:0 -abi_mips_n32 -abi_mips_n64 -abi_mips_o32 -abi_s390_32 -abi_s390_64 -abi_x86_32 abi_x86_64 -abi_x86_x32 nls -static-libs >sys-apps/attr-2.5.2-r1:0 -abi_mips_n32 -abi_mips_n64 -abi_mips_o32 -abi_s390_32 -abi_s390_64 -abi_x86_32 abi_x86_64 -abi_x86_x32 debug nls -static-libs >sys-apps/baselayout-2.17:0 -build split-usr >sys-apps/coreutils-9.5:0 acl -caps -gmp -hostname -kill -multicall nls openssl -selinux split-usr -static -test -vanilla verify-sig xattr >sys-apps/dbus-1.15.8:0 -X -abi_mips_n32 -abi_mips_n64 -abi_mips_o32 -abi_s390_32 -abi_s390_64 -abi_x86_32 abi_x86_64 -abi_x86_x32 debug -doc elogind -selinux -static-libs -systemd -test -test -valgrind >sys-apps/diffutils-3.10:0 nls verify-sig >sys-apps/file-5.45-r4:0 -abi_mips_n32 -abi_mips_n64 -abi_mips_o32 -abi_s390_32 -abi_s390_64 -abi_x86_32 abi_x86_64 -abi_x86_x32 bzip2 -lzip -lzma -python python_targets_python3_10 python_targets_python3_11 python_targets_python3_12 -python_targets_python3_13 -seccomp -static-libs verify-sig zlib -zstd >sys-apps/findutils-4.10.0:0 nls -selinux -static -test verify-sig >sys-apps/gawk-5.3.1:0 -mpfr nls -pma readline verify-sig >sys-apps/gentoo-functions-1.7.3:0 -test >sys-apps/grep-3.11-r1:0 egrep-fgrep nls pcre -static verify-sig >sys-apps/groff-1.23.0:0 -X -examples -uchardet >sys-apps/help2man-1.49.3:0 nls >sys-apps/install-xattr-0.8-r1:0 >sys-apps/iproute2-6.11.0-r2:0 -atm -berkdb -bpf -caps -elf iptables -minimal -nfs -selinux >sys-apps/kbd-2.6.4:0 nls pam -selinux -test >sys-apps/kmod-33:0 debug -doc lzma -pkcs7 -static-libs tools zlib zstd >sys-apps/less-668:0 pcre -test >sys-apps/locale-gen-2.23-r1:0 >sys-apps/man-db-2.13.0:0 manpager nls seccomp -selinux -static-libs zlib >sys-apps/man-pages-6.06:0 l10n_cs l10n_da l10n_de l10n_el l10n_es l10n_fi l10n_fr l10n_hu l10n_id l10n_it l10n_ja l10n_mk l10n_nb l10n_nl l10n_pl l10n_pt-BR l10n_ro l10n_ru l10n_sr l10n_sv l10n_uk l10n_vi l10n_zh-CN verify-sig >sys-apps/miscfiles-1.5-r4:0 -minimal >sys-apps/net-tools-2.10:0 arp hostname ipv6 -nis nls -plipconfig -selinux -slattach -static >sys-apps/openrc-navi-0.60_beta4:0 -audit -bash -caps debug netifrc -newnet pam -s6 -selinux -sysv-utils sysvinit unicode >sys-apps/portage-3.0.66.1-r1:0 -apidoc -build -doc -gentoo-dev ipc native-extensions python_targets_pypy3 python_targets_python3_10 python_targets_python3_11 python_targets_python3_12 -python_targets_python3_13 rsync-verify -selinux -test xattr >sys-apps/sandbox-2.40:0 -abi_mips_n32 -abi_mips_n64 -abi_mips_o32 -abi_s390_32 -abi_s390_64 abi_x86_32 abi_x86_64 -abi_x86_x32 nnp >sys-apps/sed-4.9-r1:0 acl nls -selinux -static verify-sig >sys-apps/shadow-4.14.8:0/4 acl -audit -cracklib nls pam -selinux -skey split-usr -su -systemd verify-sig xattr >sys-apps/systemd-utils-255.13:0 -abi_mips_n32 -abi_mips_n64 -abi_mips_o32 -abi_s390_32 -abi_s390_64 -abi_x86_32 abi_x86_64 -abi_x86_x32 acl -boot -kernel-install kmod -python_single_target_python3_10 -python_single_target_python3_11 python_single_target_python3_12 -python_single_target_python3_13 -secureboot -selinux split-usr -sysusers -test tmpfiles udev -ukify >sys-apps/sysvinit-3.11:0 -ibm nls -selinux -static verify-sig >sys-apps/texinfo-7.1.1:0 nls standalone -static >sys-apps/util-linux-2.40.2:0 -abi_mips_n32 -abi_mips_n64 -abi_mips_o32 -abi_s390_32 -abi_s390_64 -abi_x86_32 abi_x86_64 -abi_x86_x32 -audit -build -caps cramfs -cryptsetup -fdformat hardlink -kill logger -magic ncurses nls pam -python python_targets_python3_10 python_targets_python3_11 python_targets_python3_12 readline -rtas -selinux -slang -static-libs su suid -systemd -test -tty-helpers -udev unicode -uuidd verify-sig >sys-apps/which-2.21:0 >sys-auth/elogind-255.5-r1:0 acl -audit -cgroup-hybrid debug -doc pam policykit -selinux -test >sys-auth/pambase-20240128:0 -caps -debug elogind -gnome-keyring -homed -minimal -mktemp nullok -pam_krb5 -pam_ssh passwdqc -pwhistory -pwquality -securetty -selinux sha512 -sssd -systemd -yescrypt >sys-auth/passwdqc-2.0.3-r1:0 >sys-auth/polkit-123-r1:0 daemon -examples -gtk introspection -kde pam -selinux -systemd -test >sys-devel/bc-1.07.1-r6:0 -libedit readline -static >sys-devel/binutils-2.43-r2:2.43 cet -debuginfod -doc -gold -gprofng -hardened -multitarget nls -pgo plugins -static-libs -test -vanilla zstd >sys-devel/binutils-config-5.5.2:0 native-symlinks >sys-devel/bison-3.8.2-r2:0 -examples nls -static -test verify-sig >sys-devel/flex-2.6.4-r6:0 -abi_mips_n32 -abi_mips_n64 -abi_mips_o32 -abi_s390_32 -abi_s390_64 -abi_x86_32 abi_x86_64 -abi_x86_x32 nls -static -test >sys-devel/gcc-15.0.0_pre20241117-r2:15 -ada cet -custom-cflags cxx -d debug default-stack-clash-protection default-znow -doc -fixed-point fortran -go graphite -hardened -ieee-long-double -jit -libssp lto -modula2 multilib nls -objc -objc++ -objc-gc openmp -pch -pgo pie -rust sanitize ssp -systemtap -test -time64 -valgrind -vanilla -vtv zstd >sys-devel/gcc-config-2.11:0 cc-wrappers native-symlinks >sys-devel/gettext-0.22.5:0 -abi_mips_n32 -abi_mips_n64 -abi_mips_o32 -abi_s390_32 -abi_s390_64 -abi_x86_32 abi_x86_64 -abi_x86_x32 acl cxx -doc -emacs -git -java -java ncurses nls openmp -static-libs verify-sig xattr >sys-devel/gnuconfig-20240728:0 >sys-devel/m4-1.4.19-r2:0 -examples nls verify-sig >sys-devel/patch-2.7.6-r6:0 -static -test verify-sig xattr >sys-fs/e2fsprogs-1.47.1:0 -abi_mips_n32 -abi_mips_n64 -abi_mips_o32 -abi_s390_32 -abi_s390_64 -abi_x86_32 abi_x86_64 -abi_x86_x32 -archive -cron -fuse nls -static-libs -test tools >sys-fs/udev-init-scripts-35:0 >sys-kernel/dracut-105-r4:0 -selinux -test >sys-kernel/gentoo-kernel-bin-6.1.118:6.1.118 initramfs -test >sys-kernel/installkernel-48-r1:0 dracut -efistub -grub -refind -systemd -systemd-boot -ugrd -uki -ukify >sys-kernel/linux-headers-6.11:0 -headers-only >sys-libs/gdbm-1.24:0/6 -abi_mips_n32 -abi_mips_n64 -abi_mips_o32 -abi_s390_32 -abi_s390_64 -abi_x86_32 abi_x86_64 -abi_x86_x32 berkdb nls readline -static-libs -test verify-sig >sys-libs/glibc-2.40-r5:2.2 -audit -caps cet -compile-locales -custom-cflags -doc -gd -hash-sysv-compat -headers-only multiarch multilib -multilib-bootstrap -nscd -perl -profile -selinux ssp stack-realign static-libs -suid -systemd -systemtap -test -vanilla >sys-libs/libcap-2.71:0 -abi_mips_n32 -abi_mips_n64 -abi_mips_o32 -abi_s390_32 -abi_s390_64 -abi_x86_32 abi_x86_64 -abi_x86_x32 pam -static-libs -tools >sys-libs/libseccomp-2.5.5-r2:0 -abi_mips_n32 -abi_mips_n64 -abi_mips_o32 -abi_s390_32 -abi_s390_64 -abi_x86_32 abi_x86_64 -abi_x86_x32 debug -experimental-loong -python python_targets_python3_10 python_targets_python3_11 python_targets_python3_12 -static-libs -test >sys-libs/libxcrypt-4.4.36-r3:0/1 -abi_mips_n32 -abi_mips_n64 -abi_mips_o32 -abi_s390_32 -abi_s390_64 abi_x86_32 abi_x86_64 -abi_x86_x32 compat -headers-only -static-libs system -test >sys-libs/ncurses-6.5_p20241109:0/6 -abi_mips_n32 -abi_mips_n64 -abi_mips_o32 -abi_s390_32 -abi_s390_64 -abi_x86_32 abi_x86_64 -abi_x86_x32 -ada -cxx debug -doc -gpm -minimal -profile split-usr -split-usr stack-realign -static-libs -test tinfo -trace verify-sig >sys-libs/pam-1.6.1:0 -abi_mips_n32 -abi_mips_n64 -abi_mips_o32 -abi_s390_32 -abi_s390_64 -abi_x86_32 abi_x86_64 -abi_x86_x32 -audit -berkdb -debug -examples filecaps -nis -selinux >sys-libs/readline-8.2_p13:0/8 -abi_mips_n32 -abi_mips_n64 -abi_mips_o32 -abi_s390_32 -abi_s390_64 -abi_x86_32 abi_x86_64 -abi_x86_x32 -static-libs unicode -utils verify-sig >sys-libs/timezone-data-2024a-r1:0 -leaps-timezone nls -zic-slim >sys-libs/zlib-1.3.1-r1:0/1 -abi_mips_n32 -abi_mips_n64 -abi_mips_o32 -abi_s390_32 -abi_s390_64 -abi_x86_32 abi_x86_64 -abi_x86_x32 minizip -static-libs verify-sig >sys-process/procps-4.0.4-r1:0/0-ng -abi_mips_n32 -abi_mips_n64 -abi_mips_o32 -abi_s390_32 -abi_s390_64 -abi_x86_32 abi_x86_64 -abi_x86_x32 elogind kill -modern-top ncurses nls -selinux -static-libs -systemd -test unicode >sys-process/psmisc-23.7:0 -X -apparmor nls -selinux -test >virtual/acl-0-r2:0 -abi_mips_n32 -abi_mips_n64 -abi_mips_o32 -abi_s390_32 -abi_s390_64 -abi_x86_32 abi_x86_64 -abi_x86_x32 -static-libs >virtual/dev-manager-0-r2:0 >virtual/dist-kernel-6.1.118:0/6.1.118 >virtual/editor-0-r7:0 >virtual/libc-1-r1:0 >virtual/libcrypt-2-r1:0/2 -abi_mips_n32 -abi_mips_n64 -abi_mips_o32 -abi_s390_32 -abi_s390_64 abi_x86_32 abi_x86_64 -abi_x86_x32 -static-libs >virtual/libelf-3-r1:0/1 -abi_mips_n32 -abi_mips_n64 -abi_mips_o32 -abi_s390_32 -abi_s390_64 -abi_x86_32 abi_x86_64 -abi_x86_x32 >virtual/libiconv-0-r2:0 -abi_mips_n32 -abi_mips_n64 -abi_mips_o32 -abi_s390_32 -abi_s390_64 -abi_x86_32 abi_x86_64 -abi_x86_x32 >virtual/libintl-0-r2:0 -abi_mips_n32 -abi_mips_n64 -abi_mips_o32 -abi_s390_32 -abi_s390_64 -abi_x86_32 abi_x86_64 -abi_x86_x32 >virtual/libudev-251-r2:0/1 -abi_mips_n32 -abi_mips_n64 -abi_mips_o32 -abi_s390_32 -abi_s390_64 -abi_x86_32 abi_x86_64 -abi_x86_x32 -systemd >virtual/man-0-r4:0 >virtual/openssh-0:0 ssl >virtual/os-headers-0-r2:0 >virtual/package-manager-1:0 >virtual/pager-0-r1:0 >virtual/perl-Carp-1.540.0-r1:0 >virtual/perl-CPAN-2.360.0-r1:0 >virtual/perl-CPAN-Meta-2.150.10-r8:0 >virtual/perl-CPAN-Meta-YAML-0.18.0-r10:0 >virtual/perl-Data-Dumper-2.189.0:0 >virtual/perl-Encode-3.210.0-r1:0 >virtual/perl-Exporter-5.780.0:0 >virtual/perl-ExtUtils-CBuilder-0.280.240:0 >virtual/perl-ExtUtils-Install-2.220.0-r1:0 >virtual/perl-ExtUtils-MakeMaker-7.700.0-r1:0 >virtual/perl-ExtUtils-Manifest-1.750.0:0 >virtual/perl-ExtUtils-ParseXS-3.510.0-r1:0 >virtual/perl-File-Path-2.180.0-r3:0 >virtual/perl-File-Spec-3.900.0:0 >virtual/perl-File-Temp-0.231.100-r1:0 >virtual/perl-Getopt-Long-2.580.0:0 >virtual/perl-IO-1.550.0:0 >virtual/perl-IPC-Cmd-1.40.0-r4:0 >virtual/perl-JSON-PP-4.160.0-r2:0 >virtual/perl-libnet-3.150.0-r1:0 ssl >virtual/perl-Math-BigInt-2.3.2:0 >virtual/perl-MIME-Base64-3.160.100_rc-r1:0 >virtual/perl-Module-Metadata-1.0.38:0 >virtual/perl-parent-0.241.0-r1:0 >virtual/perl-Parse-CPAN-Meta-2.150.10-r8:0 >virtual/perl-Perl-OSType-1.10.0-r8:0 >virtual/perl-podlators-5.10.200_rc:0 >virtual/perl-Scalar-List-Utils-1.680.0:0 >virtual/perl-Test-Harness-3.500.0:0 >virtual/perl-Text-ParseWords-3.310.0-r3:0 >virtual/perl-Unicode-Collate-1.310.0-r2:0 >virtual/perl-version-0.993.0:0 >virtual/perl-XSLoader-0.320.0-r1:0 >virtual/pkgconfig-3:0 native-symlinks >virtual/service-manager-1-r3:0 >virtual/ssh-0-r2:0 -minimal >virtual/tmpfiles-0-r5:0 -systemd >virtual/ttf-fonts-1-r2:0 >virtual/udev-217-r7:0 -systemd >virtual/w3m-1:0 >www-client/w3m-0.5.3_p20230121:0 -X -fbcon -gdk-pixbuf -gpm -imlib l10n_ja -lynxkeymap nls -nntp ssl unicode -xface >x11-base/xcb-proto-1.17.0:0 python_targets_python3_10 python_targets_python3_11 python_targets_python3_12 -python_targets_python3_13 >x11-base/xorg-proto-2024.1:0 -test >x11-libs/cairo-1.18.2-r1:0 X -abi_mips_n32 -abi_mips_n64 -abi_mips_o32 -abi_s390_32 -abi_s390_64 -abi_x86_32 abi_x86_64 -abi_x86_x32 -aqua -debug glib -gtk-doc -test >x11-libs/libX11-1.8.10:0 -abi_mips_n32 -abi_mips_n64 -abi_mips_o32 -abi_s390_32 -abi_s390_64 -abi_x86_32 abi_x86_64 -abi_x86_x32 -doc -test >x11-libs/libXau-1.0.11:0 -abi_mips_n32 -abi_mips_n64 -abi_mips_o32 -abi_s390_32 -abi_s390_64 -abi_x86_32 abi_x86_64 -abi_x86_x32 -doc >x11-libs/libxcb-1.17.0:0/1.12 -abi_mips_n32 -abi_mips_n64 -abi_mips_o32 -abi_s390_32 -abi_s390_64 -abi_x86_32 abi_x86_64 -abi_x86_x32 -doc -doc -selinux -test xkb >x11-libs/libXdmcp-1.1.5:0 -abi_mips_n32 -abi_mips_n64 -abi_mips_o32 -abi_s390_32 -abi_s390_64 -abi_x86_32 abi_x86_64 -abi_x86_x32 -doc >x11-libs/libXext-1.3.6:0 -abi_mips_n32 -abi_mips_n64 -abi_mips_o32 -abi_s390_32 -abi_s390_64 -abi_x86_32 abi_x86_64 -abi_x86_x32 -doc >x11-libs/libXrender-0.9.11:0 -abi_mips_n32 -abi_mips_n64 -abi_mips_o32 -abi_s390_32 -abi_s390_64 -abi_x86_32 abi_x86_64 -abi_x86_x32 >x11-libs/pango-1.52.2:0 -X -abi_mips_n32 -abi_mips_n64 -abi_mips_o32 -abi_s390_32 -abi_s390_64 -abi_x86_32 abi_x86_64 -abi_x86_x32 debug introspection -sysprof -test >x11-libs/pixman-0.44.0:0 -abi_mips_n32 -abi_mips_n64 -abi_mips_o32 -abi_s390_32 -abi_s390_64 -abi_x86_32 abi_x86_64 -abi_x86_x32 -cpu_flags_arm_neon -cpu_flags_ppc_altivec cpu_flags_x86_mmxext cpu_flags_x86_sse2 cpu_flags_x86_ssse3 -loongson2f -static-libs -test >x11-libs/xtrans-1.5.2:0 -doc >x11-misc/compose-tables-1.8.10:0 >x11-misc/shared-mime-info-2.4-r1:0 -test >x11-misc/xdg-utils-1.2.1-r6:0 -X -dbus -doc -gnome -plasma > > >############# ># build.log # >############# > > * Checking for at least 1700 MiB disk space at "/var/tmp/portage/dev-scheme/racket-8.15/temp" ... > [ ok ] >>>> Unpacking source... >>>> Unpacking racket-8.15-src-builtpkgs.tgz to /var/tmp/portage/dev-scheme/racket-8.15/work >>>> Source unpacked in /var/tmp/portage/dev-scheme/racket-8.15/work >>>> Preparing source in /var/tmp/portage/dev-scheme/racket-8.15/work/racket-8.15/src ... >>>> Source prepared. >>>> Configuring source in /var/tmp/portage/dev-scheme/racket-8.15/work/racket-8.15/src ... > * Configuring Zuo in /var/tmp/portage/dev-scheme/racket-8.15/work/racket-8.15/src/zuo > * econf: updating racket-8.15/src/lt/config.sub with /usr/share/gnuconfig/config.sub > * econf: updating racket-8.15/src/lt/config.guess with /usr/share/gnuconfig/config.guess >./configure --prefix=/usr --build=x86_64-pc-linux-gnu --host=x86_64-pc-linux-gnu --mandir=/usr/share/man --infodir=/usr/share/info --datadir=/usr/share --sysconfdir=/etc --localstatedir=/var/lib --datarootdir=/usr/share --docdir=/usr/share/doc/racket-8.15 --htmldir=/usr/share/doc/racket-8.15/html --libdir=/usr/lib64 >checking whether make sets $(MAKE)... yes >checking for x86_64-pc-linux-gnu-gcc... x86_64-pc-linux-gnu-gcc >checking whether the C compiler works... yes >checking for C compiler default output file name... a.out >checking for suffix of executables... >checking whether we are cross compiling... no >checking for suffix of object files... o >checking whether we are using the GNU C compiler... yes >checking whether x86_64-pc-linux-gnu-gcc accepts -g... yes >checking for x86_64-pc-linux-gnu-gcc option to accept ISO C89... none needed >configure: zuo libraries to embed: "zuo" >configure: creating ./config.status >config.status: creating Makefile >config.status: creating main.zuo > * Configuring Racket in /var/tmp/portage/dev-scheme/racket-8.15/work/racket-8.15/src > * econf: updating racket-8.15/src/lt/config.guess with /usr/share/gnuconfig/config.guess > * econf: updating racket-8.15/src/lt/config.sub with /usr/share/gnuconfig/config.sub >./configure --prefix=/usr --build=x86_64-pc-linux-gnu --host=x86_64-pc-linux-gnu --mandir=/usr/share/man --infodir=/usr/share/info --datadir=/usr/share --sysconfdir=/etc --localstatedir=/var/lib --libdir=/usr/lib64 --disable-shared --disable-strip --docdir=/usr/share/doc/racket-8.15 --enable-libs --enable-cs --enable-csonly --enable-docs --enable-iconv --enable-curses >=== Racket CS enabled >checking build system type... x86_64-pc-linux-gnu >checking host system type... x86_64-pc-linux-gnu >checking target system type... x86_64-pc-linux-gnu >=== iconv enabled >=== curses enabled >=== CS executables without suffix enabled >=== Installation of static libraries (if any) enabled >=== Debug-symbol stripping disabled >checking for x86_64-pc-linux-gnu-gcc... x86_64-pc-linux-gnu-gcc >checking whether the C compiler works... yes >checking for C compiler default output file name... a.out >checking for suffix of executables... >checking whether we are cross compiling... no >checking for suffix of object files... o >checking whether we are using the GNU C compiler... yes >checking whether x86_64-pc-linux-gnu-gcc accepts -g... yes >checking for x86_64-pc-linux-gnu-gcc option to accept ISO C89... none needed >checking for fmod in -lm... yes >checking for dlopen in -ldl... yes >checking for x86_64-pc-linux-gnu-ranlib... x86_64-pc-linux-gnu-ranlib >checking for x86_64-pc-linux-gnu-ar... yes >checking how to run the C preprocessor... x86_64-pc-linux-gnu-gcc -E >checking for grep that handles long lines and -e... /bin/grep >checking for egrep... /bin/grep -E >checking for ANSI C header files... yes >checking for sys/types.h... yes >checking for sys/stat.h... yes >checking for stdlib.h... yes >checking for string.h... yes >checking for memory.h... yes >checking for strings.h... yes >checking for inttypes.h... yes >checking for stdint.h... yes >checking for unistd.h... yes >checking iconv.h usability... yes >checking iconv.h presence... yes >checking for iconv.h... yes >checking iconv is usable... yes >checking for nl_langinfo (CODESET)... yes >checking curses.h usability... yes >checking curses.h presence... yes >checking for curses.h... yes >checking term.h usability... yes >checking term.h presence... yes >checking for term.h... yes >checking curses is usable... yes -lncurses -ltinfo >checking for libz... yes >checking for liblz4... no >Building own liblz4 >checking size of void *... 8 >configure: creating ./config.status >config.status: creating Makefile >config.status: creating cs_config.h >>>> Installation targets: > executables : ${exec_prefix}/bin/... > core docs : /usr/share/doc/racket-8.15/... > C libraries : /usr/lib64/... > C headers : ${prefix}/include/${PACKAGE}/... > platform libraries : /usr/lib64/${PACKAGE}/... > common libraries : /usr/share/${PACKAGE}/... > base collections : ${exec_prefix}/share/${PACKAGE}/collects/... > installed pkgs : ${datadir}/${PACKAGE}/pkgs/... > configuration : /etc/${PACKAGE}/... > .desktop files : ${exec_prefix}/share/applications/... > man pages : /usr/share/man/... > where prefix = /usr > and datarootdir = ${prefix}/share > and exec_prefix = ${prefix} > and PACKAGE = racket >>>> Source configured. >>>> Compiling source in /var/tmp/portage/dev-scheme/racket-8.15/work/racket-8.15/src ... >make -j32 >mkdir -p bin >x86_64-pc-linux-gnu-gcc -O2 -DZUO_LIB_PATH='"'".././zuo/lib"'"' -o bin/zuo ./zuo/zuo.c >bin/zuo . all MAKE="make" >cd cs/c/rktio/ && ../../../rktio/configure --prefix=/usr --build=x86_64-pc-linux-gnu --host=x86_64-pc-linux-gnu --mandir=/usr/share/man --infodir=/usr/share/info --datadir=/usr/share --sysconfdir=/etc --localstatedir=/var/lib --libdir=/usr/lib64 --docdir=/usr/share/doc/racket-8.15 build_alias=x86_64-pc-linux-gnu host_alias=x86_64-pc-linux-gnu CC=x86_64-pc-linux-gnu-gcc CFLAGS=-O2" "-march=x86-64" "-pipe" "-pipe" "-frecord-gcc-switches" "-fno-diagnostics-color" "-fmessage-length=0 LDFLAGS=-Wl,-O1" "-Wl,--as-needed" "-Wl,-z,pack-relative-relocs" "-Wl,--defsym=__gentoo_check_ldflags__=0 CC=x86_64-pc-linux-gnu-gcc CFLAGS=-O2" "-march=x86-64" "-pipe" "-pipe" "-frecord-gcc-switches" "-fno-diagnostics-color" "-fmessage-length=0 LDFLAGS=-Wl,-O1" "-Wl,--as-needed" "-Wl,-z,pack-relative-relocs" "-Wl,--defsym=__gentoo_check_ldflags__=0" "-pthread LIBS=-ldl" "-lm" "-lrt" "-lncurses" "-ltinfo" "-lz AR=x86_64-pc-linux-gnu-ar ARFLAGS=rc RANLIB=x86_64-pc-linux-gnu-ranlib WINDRES=windres CPPFLAGS=" "-pthread --enable-pthread --enable-iconv >checking build system type... x86_64-pc-linux-gnu >checking host system type... x86_64-pc-linux-gnu >checking target system type... x86_64-pc-linux-gnu >checking for x86_64-pc-linux-gnu-gcc... x86_64-pc-linux-gnu-gcc >checking whether the C compiler works... yes >checking for C compiler default output file name... a.out >checking for suffix of executables... >checking whether we are cross compiling... no >checking for suffix of object files... o >checking whether we are using the GNU C compiler... yes >checking whether x86_64-pc-linux-gnu-gcc accepts -g... yes >checking for x86_64-pc-linux-gnu-gcc option to accept ISO C89... none needed >checking for x86_64-pc-linux-gnu-ranlib... x86_64-pc-linux-gnu-ranlib >checking for fmod in -lm... yes >checking for dlopen in -ldl... yes >checking how to run the C preprocessor... x86_64-pc-linux-gnu-gcc -E >checking for grep that handles long lines and -e... /bin/grep >checking for egrep... /bin/grep -E >checking for ANSI C header files... yes >checking for sys/types.h... yes >checking for sys/stat.h... yes >checking for stdlib.h... yes >checking for string.h... yes >checking for memory.h... yes >checking for strings.h... yes >checking for inttypes.h... yes >checking for stdint.h... yes >checking for unistd.h... yes >checking for intptr_t... yes >checking for uintptr_t... yes >checking whether byte ordering is bigendian... no >checking for struct dirent.d_namelen... no >checking for struct dirent.d_namlen... no >checking for xlocale.h... no >checking for xlocale functions... yes >checking for getaddrinfo... yes >checking iconv.h usability... yes >checking iconv.h presence... yes >checking for iconv.h... yes >checking iconv is usable... yes >checking for nl_langinfo (CODESET)... yes >checking for mbsrtowcs... yes >checking for poll... yes >checking for epoll... yes >checking for inotify... yes >checking whether O_CLOEXEC is declared... yes >configure: creating ./config.status >config.status: creating Makefile >config.status: creating rktio_config.h >cd cs/c/ChezScheme/pb/lz4/lib && make liblz4.a >make[1]: Entering directory '/var/tmp/portage/dev-scheme/racket-8.15/work/racket-8.15/src/cs/c/ChezScheme/pb/lz4/lib' >compiling static library >make[1]: Leaving directory '/var/tmp/portage/dev-scheme/racket-8.15/work/racket-8.15/src/cs/c/ChezScheme/pb/lz4/lib' >x86_64-pc-linux-gnu-gcc -pthread -DPORTABLE_BYTECODE -Ics/c/ChezScheme/pb/boot/pb -Ics/c/ChezScheme/pb/c -IChezScheme/c/ -Ics/c/ChezScheme/pb/lz4/lib -O2 -march=x86-64 -pipe -pipe -frecord-gcc-switches -fno-diagnostics-color -fmessage-length=0 -pthread -o cs/c/ChezScheme/pb/c/statics.o -c ChezScheme/c/statics.c >x86_64-pc-linux-gnu-gcc -pthread -DPORTABLE_BYTECODE -Ics/c/ChezScheme/pb/boot/pb -Ics/c/ChezScheme/pb/c -IChezScheme/c/ -Ics/c/ChezScheme/pb/lz4/lib -O2 -march=x86-64 -pipe -pipe -frecord-gcc-switches -fno-diagnostics-color -fmessage-length=0 -pthread -o cs/c/ChezScheme/pb/c/segment.o -c ChezScheme/c/segment.c >x86_64-pc-linux-gnu-gcc -pthread -DPORTABLE_BYTECODE -Ics/c/ChezScheme/pb/boot/pb -Ics/c/ChezScheme/pb/c -IChezScheme/c/ -Ics/c/ChezScheme/pb/lz4/lib -O2 -march=x86-64 -pipe -pipe -frecord-gcc-switches -fno-diagnostics-color -fmessage-length=0 -pthread -o cs/c/ChezScheme/pb/c/alloc.o -c ChezScheme/c/alloc.c >x86_64-pc-linux-gnu-gcc -pthread -DPORTABLE_BYTECODE -Ics/c/ChezScheme/pb/boot/pb -Ics/c/ChezScheme/pb/c -IChezScheme/c/ -Ics/c/ChezScheme/pb/lz4/lib -O2 -march=x86-64 -pipe -pipe -frecord-gcc-switches -fno-diagnostics-color -fmessage-length=0 -pthread -o cs/c/ChezScheme/pb/c/symbol.o -c ChezScheme/c/symbol.c >x86_64-pc-linux-gnu-gcc -pthread -DPORTABLE_BYTECODE -Ics/c/ChezScheme/pb/boot/pb -Ics/c/ChezScheme/pb/c -IChezScheme/c/ -Ics/c/ChezScheme/pb/lz4/lib -O2 -march=x86-64 -pipe -pipe -frecord-gcc-switches -fno-diagnostics-color -fmessage-length=0 -pthread -o cs/c/ChezScheme/pb/c/intern.o -c ChezScheme/c/intern.c >x86_64-pc-linux-gnu-gcc -pthread -DPORTABLE_BYTECODE -Ics/c/ChezScheme/pb/boot/pb -Ics/c/ChezScheme/pb/c -IChezScheme/c/ -Ics/c/ChezScheme/pb/lz4/lib -O2 -march=x86-64 -pipe -pipe -frecord-gcc-switches -fno-diagnostics-color -fmessage-length=0 -pthread -o cs/c/ChezScheme/pb/c/gcwrapper.o -c ChezScheme/c/gcwrapper.c >x86_64-pc-linux-gnu-gcc -pthread -DPORTABLE_BYTECODE -Ics/c/ChezScheme/pb/boot/pb -Ics/c/ChezScheme/pb/c -IChezScheme/c/ -Ics/c/ChezScheme/pb/lz4/lib -O2 -march=x86-64 -pipe -pipe -frecord-gcc-switches -fno-diagnostics-color -fmessage-length=0 -pthread -o cs/c/ChezScheme/pb/c/gc-011.o -c ChezScheme/c/gc-011.c >x86_64-pc-linux-gnu-gcc -pthread -DPORTABLE_BYTECODE -Ics/c/ChezScheme/pb/boot/pb -Ics/c/ChezScheme/pb/c -IChezScheme/c/ -Ics/c/ChezScheme/pb/lz4/lib -O2 -march=x86-64 -pipe -pipe -frecord-gcc-switches -fno-diagnostics-color -fmessage-length=0 -pthread -o cs/c/ChezScheme/pb/c/gc-par.o -c ChezScheme/c/gc-par.c >x86_64-pc-linux-gnu-gcc -pthread -DPORTABLE_BYTECODE -Ics/c/ChezScheme/pb/boot/pb -Ics/c/ChezScheme/pb/c -IChezScheme/c/ -Ics/c/ChezScheme/pb/lz4/lib -O2 -march=x86-64 -pipe -pipe -frecord-gcc-switches -fno-diagnostics-color -fmessage-length=0 -pthread -o cs/c/ChezScheme/pb/c/gc-ocd.o -c ChezScheme/c/gc-ocd.c >x86_64-pc-linux-gnu-gcc -pthread -DPORTABLE_BYTECODE -Ics/c/ChezScheme/pb/boot/pb -Ics/c/ChezScheme/pb/c -IChezScheme/c/ -Ics/c/ChezScheme/pb/lz4/lib -O2 -march=x86-64 -pipe -pipe -frecord-gcc-switches -fno-diagnostics-color -fmessage-length=0 -pthread -o cs/c/ChezScheme/pb/c/gc-oce.o -c ChezScheme/c/gc-oce.c >x86_64-pc-linux-gnu-gcc -pthread -DPORTABLE_BYTECODE -Ics/c/ChezScheme/pb/boot/pb -Ics/c/ChezScheme/pb/c -IChezScheme/c/ -Ics/c/ChezScheme/pb/lz4/lib -O2 -march=x86-64 -pipe -pipe -frecord-gcc-switches -fno-diagnostics-color -fmessage-length=0 -pthread -o cs/c/ChezScheme/pb/c/number.o -c ChezScheme/c/number.c >x86_64-pc-linux-gnu-gcc -pthread -DPORTABLE_BYTECODE -Ics/c/ChezScheme/pb/boot/pb -Ics/c/ChezScheme/pb/c -IChezScheme/c/ -Ics/c/ChezScheme/pb/lz4/lib -O2 -march=x86-64 -pipe -pipe -frecord-gcc-switches -fno-diagnostics-color -fmessage-length=0 -pthread -o cs/c/ChezScheme/pb/c/schsig.o -c ChezScheme/c/schsig.c >x86_64-pc-linux-gnu-gcc -pthread -DPORTABLE_BYTECODE -Ics/c/ChezScheme/pb/boot/pb -Ics/c/ChezScheme/pb/c -IChezScheme/c/ -Ics/c/ChezScheme/pb/lz4/lib -O2 -march=x86-64 -pipe -pipe -frecord-gcc-switches -fno-diagnostics-color -fmessage-length=0 -pthread -o cs/c/ChezScheme/pb/c/io.o -c ChezScheme/c/io.c >x86_64-pc-linux-gnu-gcc -pthread -DPORTABLE_BYTECODE -Ics/c/ChezScheme/pb/boot/pb -Ics/c/ChezScheme/pb/c -IChezScheme/c/ -Ics/c/ChezScheme/pb/lz4/lib -O2 -march=x86-64 -pipe -pipe -frecord-gcc-switches -fno-diagnostics-color -fmessage-length=0 -pthread -o cs/c/ChezScheme/pb/c/new-io.o -c ChezScheme/c/new-io.c >x86_64-pc-linux-gnu-gcc -pthread -DPORTABLE_BYTECODE -Ics/c/ChezScheme/pb/boot/pb -Ics/c/ChezScheme/pb/c -IChezScheme/c/ -Ics/c/ChezScheme/pb/lz4/lib -O2 -march=x86-64 -pipe -pipe -frecord-gcc-switches -fno-diagnostics-color -fmessage-length=0 -pthread -o cs/c/ChezScheme/pb/c/print.o -c ChezScheme/c/print.c >x86_64-pc-linux-gnu-gcc -pthread -DPORTABLE_BYTECODE -Ics/c/ChezScheme/pb/boot/pb -Ics/c/ChezScheme/pb/c -IChezScheme/c/ -Ics/c/ChezScheme/pb/lz4/lib -O2 -march=x86-64 -pipe -pipe -frecord-gcc-switches -fno-diagnostics-color -fmessage-length=0 -pthread -o cs/c/ChezScheme/pb/c/fasl.o -c ChezScheme/c/fasl.c >x86_64-pc-linux-gnu-gcc -pthread -DPORTABLE_BYTECODE -Ics/c/ChezScheme/pb/boot/pb -Ics/c/ChezScheme/pb/c -IChezScheme/c/ -Ics/c/ChezScheme/pb/lz4/lib -O2 -march=x86-64 -pipe -pipe -frecord-gcc-switches -fno-diagnostics-color -fmessage-length=0 -pthread -o cs/c/ChezScheme/pb/c/vfasl.o -c ChezScheme/c/vfasl.c >x86_64-pc-linux-gnu-gcc -pthread -DPORTABLE_BYTECODE -Ics/c/ChezScheme/pb/boot/pb -Ics/c/ChezScheme/pb/c -IChezScheme/c/ -Ics/c/ChezScheme/pb/lz4/lib -O2 -march=x86-64 -pipe -pipe -frecord-gcc-switches -fno-diagnostics-color -fmessage-length=0 -pthread -o cs/c/ChezScheme/pb/c/stats.o -c ChezScheme/c/stats.c >x86_64-pc-linux-gnu-gcc -pthread -DPORTABLE_BYTECODE -Ics/c/ChezScheme/pb/boot/pb -Ics/c/ChezScheme/pb/c -IChezScheme/c/ -Ics/c/ChezScheme/pb/lz4/lib -O2 -march=x86-64 -pipe -pipe -frecord-gcc-switches -fno-diagnostics-color -fmessage-length=0 -pthread -o cs/c/ChezScheme/pb/c/foreign.o -c ChezScheme/c/foreign.c >x86_64-pc-linux-gnu-gcc -pthread -DPORTABLE_BYTECODE -Ics/c/ChezScheme/pb/boot/pb -Ics/c/ChezScheme/pb/c -IChezScheme/c/ -Ics/c/ChezScheme/pb/lz4/lib -O2 -march=x86-64 -pipe -pipe -frecord-gcc-switches -fno-diagnostics-color -fmessage-length=0 -pthread -o cs/c/ChezScheme/pb/c/prim.o -c ChezScheme/c/prim.c >x86_64-pc-linux-gnu-gcc -pthread -DPORTABLE_BYTECODE -Ics/c/ChezScheme/pb/boot/pb -Ics/c/ChezScheme/pb/c -IChezScheme/c/ -Ics/c/ChezScheme/pb/lz4/lib -O2 -march=x86-64 -pipe -pipe -frecord-gcc-switches -fno-diagnostics-color -fmessage-length=0 -pthread -o cs/c/ChezScheme/pb/c/prim5.o -c ChezScheme/c/prim5.c >x86_64-pc-linux-gnu-gcc -pthread -DPORTABLE_BYTECODE -Ics/c/ChezScheme/pb/boot/pb -Ics/c/ChezScheme/pb/c -IChezScheme/c/ -Ics/c/ChezScheme/pb/lz4/lib -O2 -march=x86-64 -pipe -pipe -frecord-gcc-switches -fno-diagnostics-color -fmessage-length=0 -pthread -o cs/c/ChezScheme/pb/c/flushcache.o -c ChezScheme/c/flushcache.c >x86_64-pc-linux-gnu-gcc -pthread -DPORTABLE_BYTECODE -Ics/c/ChezScheme/pb/boot/pb -Ics/c/ChezScheme/pb/c -IChezScheme/c/ -Ics/c/ChezScheme/pb/lz4/lib -O2 -march=x86-64 -pipe -pipe -frecord-gcc-switches -fno-diagnostics-color -fmessage-length=0 -pthread -o cs/c/ChezScheme/pb/c/schlib.o -c ChezScheme/c/schlib.c >x86_64-pc-linux-gnu-gcc -pthread -DPORTABLE_BYTECODE -Ics/c/ChezScheme/pb/boot/pb -Ics/c/ChezScheme/pb/c -IChezScheme/c/ -Ics/c/ChezScheme/pb/lz4/lib -O2 -march=x86-64 -pipe -pipe -frecord-gcc-switches -fno-diagnostics-color -fmessage-length=0 -pthread -o cs/c/ChezScheme/pb/c/thread.o -c ChezScheme/c/thread.c >x86_64-pc-linux-gnu-gcc -pthread -DPORTABLE_BYTECODE -Ics/c/ChezScheme/pb/boot/pb -Ics/c/ChezScheme/pb/c -IChezScheme/c/ -Ics/c/ChezScheme/pb/lz4/lib -O2 -march=x86-64 -pipe -pipe -frecord-gcc-switches -fno-diagnostics-color -fmessage-length=0 -pthread -o cs/c/ChezScheme/pb/c/expeditor.o -c ChezScheme/c/expeditor.c >x86_64-pc-linux-gnu-gcc -pthread -DPORTABLE_BYTECODE -Ics/c/ChezScheme/pb/boot/pb -Ics/c/ChezScheme/pb/c -IChezScheme/c/ -Ics/c/ChezScheme/pb/lz4/lib -O2 -march=x86-64 -pipe -pipe -frecord-gcc-switches -fno-diagnostics-color -fmessage-length=0 -pthread -o cs/c/ChezScheme/pb/c/scheme.o -c ChezScheme/c/scheme.c >x86_64-pc-linux-gnu-gcc -pthread -DPORTABLE_BYTECODE -Ics/c/ChezScheme/pb/boot/pb -Ics/c/ChezScheme/pb/c -IChezScheme/c/ -Ics/c/ChezScheme/pb/lz4/lib -O2 -march=x86-64 -pipe -pipe -frecord-gcc-switches -fno-diagnostics-color -fmessage-length=0 -pthread -o cs/c/ChezScheme/pb/c/compress-io.o -c ChezScheme/c/compress-io.c >x86_64-pc-linux-gnu-gcc -pthread -DPORTABLE_BYTECODE -Ics/c/ChezScheme/pb/boot/pb -Ics/c/ChezScheme/pb/c -IChezScheme/c/ -Ics/c/ChezScheme/pb/lz4/lib -O2 -march=x86-64 -pipe -pipe -frecord-gcc-switches -fno-diagnostics-color -fmessage-length=0 -pthread -o cs/c/ChezScheme/pb/c/random.o -c ChezScheme/c/random.c >x86_64-pc-linux-gnu-gcc -pthread -DPORTABLE_BYTECODE -Ics/c/ChezScheme/pb/boot/pb -Ics/c/ChezScheme/pb/c -IChezScheme/c/ -Ics/c/ChezScheme/pb/lz4/lib -O2 -march=x86-64 -pipe -pipe -frecord-gcc-switches -fno-diagnostics-color -fmessage-length=0 -pthread -o cs/c/ChezScheme/pb/c/ffi.o -c ChezScheme/c/ffi.c >x86_64-pc-linux-gnu-gcc -pthread -DPORTABLE_BYTECODE -Ics/c/ChezScheme/pb/boot/pb -Ics/c/ChezScheme/pb/c -IChezScheme/c/ -Ics/c/ChezScheme/pb/lz4/lib -O2 -march=x86-64 -pipe -pipe -frecord-gcc-switches -fno-diagnostics-color -fmessage-length=0 -pthread -o cs/c/ChezScheme/pb/c/self-exe.o -c ChezScheme/c/self-exe.c >x86_64-pc-linux-gnu-gcc -pthread -DPORTABLE_BYTECODE -Ics/c/ChezScheme/pb/boot/pb -Ics/c/ChezScheme/pb/c -IChezScheme/c/ -Ics/c/ChezScheme/pb/lz4/lib -O2 -march=x86-64 -pipe -pipe -frecord-gcc-switches -fno-diagnostics-color -fmessage-length=0 -pthread -o cs/c/ChezScheme/pb/c/pb.o -c ChezScheme/c/pb.c >x86_64-pc-linux-gnu-ar rc cs/c/ChezScheme/pb/boot/pb/libkernel.a cs/c/ChezScheme/pb/c/statics.o cs/c/ChezScheme/pb/c/segment.o cs/c/ChezScheme/pb/c/alloc.o cs/c/ChezScheme/pb/c/symbol.o cs/c/ChezScheme/pb/c/intern.o cs/c/ChezScheme/pb/c/gcwrapper.o cs/c/ChezScheme/pb/c/gc-011.o cs/c/ChezScheme/pb/c/gc-par.o cs/c/ChezScheme/pb/c/gc-ocd.o cs/c/ChezScheme/pb/c/gc-oce.o cs/c/ChezScheme/pb/c/number.o cs/c/ChezScheme/pb/c/schsig.o cs/c/ChezScheme/pb/c/io.o cs/c/ChezScheme/pb/c/new-io.o cs/c/ChezScheme/pb/c/print.o cs/c/ChezScheme/pb/c/fasl.o cs/c/ChezScheme/pb/c/vfasl.o cs/c/ChezScheme/pb/c/stats.o cs/c/ChezScheme/pb/c/foreign.o cs/c/ChezScheme/pb/c/prim.o cs/c/ChezScheme/pb/c/prim5.o cs/c/ChezScheme/pb/c/flushcache.o cs/c/ChezScheme/pb/c/schlib.o cs/c/ChezScheme/pb/c/thread.o cs/c/ChezScheme/pb/c/expeditor.o cs/c/ChezScheme/pb/c/scheme.o cs/c/ChezScheme/pb/c/compress-io.o cs/c/ChezScheme/pb/c/random.o cs/c/ChezScheme/pb/c/ffi.o cs/c/ChezScheme/pb/c/self-exe.o cs/c/ChezScheme/pb/c/pb.o >x86_64-pc-linux-gnu-gcc -pthread -DPORTABLE_BYTECODE -Ics/c/ChezScheme/pb/boot/pb -Ics/c/ChezScheme/pb/c -IChezScheme/c/ -Ics/c/ChezScheme/pb/lz4/lib -O2 -march=x86-64 -pipe -pipe -frecord-gcc-switches -fno-diagnostics-color -fmessage-length=0 -pthread -o cs/c/ChezScheme/pb/boot/pb/main.o -c ChezScheme/c/main.c >x86_64-pc-linux-gnu-gcc -O2 -march=x86-64 -pipe -pipe -frecord-gcc-switches -fno-diagnostics-color -fmessage-length=0 -pthread -o cs/c/ChezScheme/pb/bin/pb/scheme cs/c/ChezScheme/pb/boot/pb/main.o cs/c/ChezScheme/pb/boot/pb/libkernel.a cs/c/ChezScheme/pb/lz4/lib/liblz4.a -Wl,-O1 -Wl,--as-needed -Wl,-z,pack-relative-relocs -Wl,--defsym=__gentoo_check_ldflags__=0 -pthread -ldl -lm -lrt -lncurses -ltinfo -lz -lz >building boot files for ta6le using pb >running cs/c/ChezScheme/pb/bin/pb/scheme to build cs/c/ChezScheme/xc-ta6le/s/cmacros.so >compiling ChezScheme/s/cmacros.ss with output to cs/c/ChezScheme/xc-ta6le/s/cmacros.so >running cs/c/ChezScheme/pb/bin/pb/scheme to build cs/c/ChezScheme/xc-ta6le/s/priminfo.so >compiling ChezScheme/s/priminfo.ss with output to cs/c/ChezScheme/xc-ta6le/s/priminfo.so >running cs/c/ChezScheme/pb/bin/pb/scheme to build cs/c/ChezScheme/xc-ta6le/s/primvars.so >compiling ChezScheme/s/primvars.ss with output to cs/c/ChezScheme/xc-ta6le/s/primvars.so >running cs/c/ChezScheme/pb/bin/pb/scheme to build cs/c/ChezScheme/xc-ta6le/s/env.so >compiling ChezScheme/s/env.ss with output to cs/c/ChezScheme/xc-ta6le/s/env.so >running cs/c/ChezScheme/pb/bin/pb/scheme to build cs/c/ChezScheme/xc-ta6le/s/setup.so >compiling ChezScheme/s/setup.ss with output to cs/c/ChezScheme/xc-ta6le/s/setup.so >running cs/c/ChezScheme/pb/bin/pb/scheme to build cs/c/ChezScheme/xc-ta6le/s/nanopass.so >compiling ChezScheme/nanopass/nanopass.ss with output to cs/c/ChezScheme/xc-ta6le/s/nanopass.so >compiling ChezScheme/nanopass/nanopass/language.ss with output to cs/c/ChezScheme/xc-ta6le/s/nanopass/language.so >compiling ChezScheme/nanopass/nanopass/helpers.ss with output to cs/c/ChezScheme/xc-ta6le/s/nanopass/helpers.so >compiling ChezScheme/nanopass/nanopass/implementation-helpers.chezscheme.sls with output to cs/c/ChezScheme/xc-ta6le/s/nanopass/implementation-helpers.chezscheme.so >compiling ChezScheme/nanopass/nanopass/language-helpers.ss with output to cs/c/ChezScheme/xc-ta6le/s/nanopass/language-helpers.so >compiling ChezScheme/nanopass/nanopass/records.ss with output to cs/c/ChezScheme/xc-ta6le/s/nanopass/records.so >compiling ChezScheme/nanopass/nanopass/syntaxconvert.ss with output to cs/c/ChezScheme/xc-ta6le/s/nanopass/syntaxconvert.so >compiling ChezScheme/nanopass/nanopass/unparser.ss with output to cs/c/ChezScheme/xc-ta6le/s/nanopass/unparser.so >compiling ChezScheme/nanopass/nanopass/meta-parser.ss with output to cs/c/ChezScheme/xc-ta6le/s/nanopass/meta-parser.so >compiling ChezScheme/nanopass/nanopass/meta-syntax-dispatch.ss with output to cs/c/ChezScheme/xc-ta6le/s/nanopass/meta-syntax-dispatch.so >compiling ChezScheme/nanopass/nanopass/parser.ss with output to cs/c/ChezScheme/xc-ta6le/s/nanopass/parser.so >compiling ChezScheme/nanopass/nanopass/nano-syntax-dispatch.ss with output to cs/c/ChezScheme/xc-ta6le/s/nanopass/nano-syntax-dispatch.so >compiling ChezScheme/nanopass/nanopass/language-node-counter.ss with output to cs/c/ChezScheme/xc-ta6le/s/nanopass/language-node-counter.so >compiling ChezScheme/nanopass/nanopass/pass.ss with output to cs/c/ChezScheme/xc-ta6le/s/nanopass/pass.so >running cs/c/ChezScheme/pb/bin/pb/scheme to build cs/c/ChezScheme/xc-ta6le/s/patch.patch >compiling ChezScheme/s/patch.ss with output to cs/c/ChezScheme/xc-ta6le/s/patch.patch >(time (compile-file "ChezScheme/s/patch.ss" ...)) > no collections > 0.010772214s elapsed cpu time > 0.010807490s elapsed real time > 785456 bytes allocated > 46514176 bytes peak memory use >running cs/c/ChezScheme/pb/bin/pb/scheme to build cs/c/ChezScheme/xc-ta6le/s/cpnanopass.patch >compiling ChezScheme/s/cpnanopass.ss with output to cs/c/ChezScheme/xc-ta6le/s/cpnanopass.patch >(time (compile-file "ChezScheme/s/cpnanopass.ss" ...)) > 141 collections > 34.263636963s elapsed cpu time, including 1.567468572s collecting > 34.400246432s elapsed real time, including 1.575595041s collecting > 2368309936 bytes allocated, including 2192015776 bytes reclaimed > 335183872 bytes peak memory use >running cs/c/ChezScheme/pb/bin/pb/scheme to build cs/c/ChezScheme/xc-ta6le/s/cpprim.patch >compiling ChezScheme/s/cpprim.ss with output to cs/c/ChezScheme/xc-ta6le/s/cpprim.patch >(time (compile-file "ChezScheme/s/cpprim.ss" ...)) > 107 collections > 25.615554123s elapsed cpu time, including 0.963553734s collecting > 25.717249622s elapsed real time, including 0.968563445s collecting > 1806244640 bytes allocated, including 1667376896 bytes reclaimed > 267264000 bytes peak memory use >running cs/c/ChezScheme/pb/bin/pb/scheme to build cs/c/ChezScheme/xc-ta6le/s/cprep.patch >compiling ChezScheme/s/cprep.ss with output to cs/c/ChezScheme/xc-ta6le/s/cprep.patch >(time (compile-file "ChezScheme/s/cprep.ss" ...)) > 5 collections > 1.167814787s elapsed cpu time, including 0.018803786s collecting > 1.172918573s elapsed real time, including 0.018915942s collecting > 81369328 bytes allocated, including 74594752 bytes reclaimed > 55296000 bytes peak memory use >running cs/c/ChezScheme/pb/bin/pb/scheme to build cs/c/ChezScheme/xc-ta6le/s/cpcheck.patch >compiling ChezScheme/s/cpcheck.ss with output to cs/c/ChezScheme/xc-ta6le/s/cpcheck.patch >(time (compile-file "ChezScheme/s/cpcheck.ss" ...)) > 2 collections > 0.563319998s elapsed cpu time, including 0.008385065s collecting > 0.565814533s elapsed real time, including 0.008434896s collecting > 42624768 bytes allocated, including 26621200 bytes reclaimed > 48881664 bytes peak memory use >running cs/c/ChezScheme/pb/bin/pb/scheme to build cs/c/ChezScheme/xc-ta6le/s/cp0.patch >compiling ChezScheme/s/cp0.ss with output to cs/c/ChezScheme/xc-ta6le/s/cp0.patch >(time (compile-file "ChezScheme/s/cp0.ss" ...)) > 33 collections > 6.769913725s elapsed cpu time, including 0.243892185s collecting > 6.797106428s elapsed real time, including 0.245242517s collecting > 552953664 bytes allocated, including 510331312 bytes reclaimed > 132268032 bytes peak memory use >running cs/c/ChezScheme/pb/bin/pb/scheme to build cs/c/ChezScheme/xc-ta6le/s/cpvalid.patch >compiling ChezScheme/s/cpvalid.ss with output to cs/c/ChezScheme/xc-ta6le/s/cpvalid.patch >(time (compile-file "ChezScheme/s/cpvalid.ss" ...)) > 3 collections > 0.751858582s elapsed cpu time, including 0.015417581s collecting > 0.754822881s elapsed real time, including 0.015500640s collecting > 58320400 bytes allocated, including 43653488 bytes reclaimed > 57434112 bytes peak memory use >running cs/c/ChezScheme/pb/bin/pb/scheme to build cs/c/ChezScheme/xc-ta6le/s/cptypes.patch >compiling ChezScheme/s/cptypes.ss with output to cs/c/ChezScheme/xc-ta6le/s/cptypes.patch >(time (compile-file "ChezScheme/s/cptypes.ss" ...)) > 16 collections > 3.453415318s elapsed cpu time, including 0.085810395s collecting > 3.467084474s elapsed real time, including 0.086255784s collecting > 269910816 bytes allocated, including 248668256 bytes reclaimed > 91643904 bytes peak memory use >running cs/c/ChezScheme/pb/bin/pb/scheme to build cs/c/ChezScheme/xc-ta6le/s/cpcommonize.patch >compiling ChezScheme/s/cpcommonize.ss with output to cs/c/ChezScheme/xc-ta6le/s/cpcommonize.patch >(time (compile-file "ChezScheme/s/cpcommonize.ss" ...)) > 6 collections > 1.362324953s elapsed cpu time, including 0.021310901s collecting > 1.367892655s elapsed real time, including 0.021435917s collecting > 98686544 bytes allocated, including 88467920 bytes reclaimed > 57434112 bytes peak memory use >running cs/c/ChezScheme/pb/bin/pb/scheme to build cs/c/ChezScheme/xc-ta6le/s/cpletrec.patch >compiling ChezScheme/s/cpletrec.ss with output to cs/c/ChezScheme/xc-ta6le/s/cpletrec.patch >(time (compile-file "ChezScheme/s/cpletrec.ss" ...)) > 3 collections > 0.687102738s elapsed cpu time, including 0.016536011s collecting > 0.689992073s elapsed real time, including 0.016623962s collecting > 51898096 bytes allocated, including 42750832 bytes reclaimed > 55296000 bytes peak memory use >running cs/c/ChezScheme/pb/bin/pb/scheme to build cs/c/ChezScheme/xc-ta6le/s/reloc.patch >compiling ChezScheme/s/reloc.ss with output to cs/c/ChezScheme/xc-ta6le/s/reloc.patch >(time (compile-file "ChezScheme/s/reloc.ss" ...)) > no collections > 0.033122740s elapsed cpu time > 0.033266580s elapsed real time > 2812256 bytes allocated > 46514176 bytes peak memory use >running cs/c/ChezScheme/pb/bin/pb/scheme to build cs/c/ChezScheme/xc-ta6le/s/compile.patch >compiling ChezScheme/s/compile.ss with output to cs/c/ChezScheme/xc-ta6le/s/compile.patch >(time (compile-file "ChezScheme/s/compile.ss" ...)) > 10 collections > 1.989510608s elapsed cpu time, including 0.040054263s collecting > 1.997584118s elapsed real time, including 0.040286815s collecting > 165799872 bytes allocated, including 147199168 bytes reclaimed > 61710336 bytes peak memory use >running cs/c/ChezScheme/pb/bin/pb/scheme to build cs/c/ChezScheme/xc-ta6le/s/fasl.patch >compiling ChezScheme/s/fasl.ss with output to cs/c/ChezScheme/xc-ta6le/s/fasl.patch >(time (compile-file "ChezScheme/s/fasl.ss" ...)) > 3 collections > 0.574280551s elapsed cpu time, including 0.011932641s collecting > 0.576617173s elapsed real time, including 0.012001388s collecting > 46973648 bytes allocated, including 44679584 bytes reclaimed > 51019776 bytes peak memory use >running cs/c/ChezScheme/pb/bin/pb/scheme to build cs/c/ChezScheme/xc-ta6le/s/vfasl.patch >compiling ChezScheme/s/vfasl.ss with output to cs/c/ChezScheme/xc-ta6le/s/vfasl.patch >(time (compile-file "ChezScheme/s/vfasl.ss" ...)) > 3 collections > 0.621866181s elapsed cpu time, including 0.011654408s collecting > 0.623781312s elapsed real time, including 0.011709239s collecting > 49469424 bytes allocated, including 44466384 bytes reclaimed > 51019776 bytes peak memory use >running cs/c/ChezScheme/pb/bin/pb/scheme to build cs/c/ChezScheme/xc-ta6le/s/pbchunk.patch >compiling ChezScheme/s/pbchunk.ss with output to cs/c/ChezScheme/xc-ta6le/s/pbchunk.patch >(time (compile-file "ChezScheme/s/pbchunk.ss" ...)) > no collections > 0.017399267s elapsed cpu time > 0.017455965s elapsed real time > 814832 bytes allocated > 46514176 bytes peak memory use >running cs/c/ChezScheme/pb/bin/pb/scheme to build cs/c/ChezScheme/xc-ta6le/s/syntax.patch >compiling ChezScheme/s/syntax.ss with output to cs/c/ChezScheme/xc-ta6le/s/syntax.patch >(time (compile-file "ChezScheme/s/syntax.ss" ...)) > 39 collections > 8.057461440s elapsed cpu time, including 0.244576316s collecting > 8.083051562s elapsed real time, including 0.245664653s collecting > 660992032 bytes allocated, including 633562400 bytes reclaimed > 119439360 bytes peak memory use >running cs/c/ChezScheme/pb/bin/pb/scheme to build cs/c/ChezScheme/xc-ta6le/s/env.patch >compiling ChezScheme/s/env.ss with output to cs/c/ChezScheme/xc-ta6le/s/env.patch >(time (compile-file "ChezScheme/s/env.ss" ...)) > no collections > 0.002068612s elapsed cpu time > 0.002074094s elapsed real time > 144032 bytes allocated > 44376064 bytes peak memory use >running cs/c/ChezScheme/pb/bin/pb/scheme to build cs/c/ChezScheme/xc-ta6le/s/read.patch >compiling ChezScheme/s/read.ss with output to cs/c/ChezScheme/xc-ta6le/s/read.patch >(time (compile-file "ChezScheme/s/read.ss" ...)) > 8 collections > 1.738013572s elapsed cpu time, including 0.041771227s collecting > 1.743765455s elapsed real time, including 0.041982424s collecting > 141914992 bytes allocated, including 121336832 bytes reclaimed > 63848448 bytes peak memory use >running cs/c/ChezScheme/pb/bin/pb/scheme to build cs/c/ChezScheme/xc-ta6le/s/interpret.patch >compiling ChezScheme/s/interpret.ss with output to cs/c/ChezScheme/xc-ta6le/s/interpret.patch >(time (compile-file "ChezScheme/s/interpret.ss" ...)) > 5 collections > 1.062011654s elapsed cpu time, including 0.018296535s collecting > 1.066207107s elapsed real time, including 0.018400375s collecting > 78758128 bytes allocated, including 74490080 bytes reclaimed > 55296000 bytes peak memory use >running cs/c/ChezScheme/pb/bin/pb/scheme to build cs/c/ChezScheme/xc-ta6le/s/ftype.patch >compiling ChezScheme/s/ftype.ss with output to cs/c/ChezScheme/xc-ta6le/s/ftype.patch >(time (compile-file "ChezScheme/s/ftype.ss" ...)) > 8 collections > 1.583817067s elapsed cpu time, including 0.042319697s collecting > 1.590397473s elapsed real time, including 0.042569668s collecting > 132426224 bytes allocated, including 118782368 bytes reclaimed > 70262784 bytes peak memory use >running cs/c/ChezScheme/pb/bin/pb/scheme to build cs/c/ChezScheme/xc-ta6le/s/strip.patch >compiling ChezScheme/s/strip.ss with output to cs/c/ChezScheme/xc-ta6le/s/strip.patch >(time (compile-file "ChezScheme/s/strip.ss" ...)) > 7 collections > 1.619168957s elapsed cpu time, including 0.030852026s collecting > 1.626028009s elapsed real time, including 0.031040384s collecting > 125156784 bytes allocated, including 106541056 bytes reclaimed > 61710336 bytes peak memory use >running cs/c/ChezScheme/pb/bin/pb/scheme to build cs/c/ChezScheme/xc-ta6le/s/ubify.patch >compiling ChezScheme/s/ubify.ss with output to cs/c/ChezScheme/xc-ta6le/s/ubify.patch >(time (compile-file "ChezScheme/s/ubify.ss" ...)) > no collections > 0.013293103s elapsed cpu time > 0.013347747s elapsed real time > 1072128 bytes allocated > 46514176 bytes peak memory use >running cs/c/ChezScheme/pb/bin/pb/scheme to build cs/c/ChezScheme/xc-ta6le/s/back.patch >compiling ChezScheme/s/back.ss with output to cs/c/ChezScheme/xc-ta6le/s/back.patch >(time (compile-file "ChezScheme/s/back.ss" ...)) > no collections > 0.085980531s elapsed cpu time > 0.086362739s elapsed real time > 7182304 bytes allocated > 46514176 bytes peak memory use >running cs/c/ChezScheme/pb/bin/pb/scheme to build all at once >loading ta6le cross compiler >compiling ChezScheme/s/library.ss with output to cs/c/ChezScheme/xc-ta6le/s/library.ta6le >compiling ChezScheme/s/prims.ss with output to cs/c/ChezScheme/xc-ta6le/s/prims.ta6le >compiling ChezScheme/s/mathprims.ss with output to cs/c/ChezScheme/xc-ta6le/s/mathprims.ta6le >compiling ChezScheme/s/record.ss with output to cs/c/ChezScheme/xc-ta6le/s/record.ta6le >compiling ChezScheme/s/5_1.ss with output to cs/c/ChezScheme/xc-ta6le/s/5_1.ta6le >compiling ChezScheme/s/5_2.ss with output to cs/c/ChezScheme/xc-ta6le/s/5_2.ta6le >compiling ChezScheme/s/5_3.ss with output to cs/c/ChezScheme/xc-ta6le/s/5_3.ta6le >compiling ChezScheme/s/strnum.ss with output to cs/c/ChezScheme/xc-ta6le/s/strnum.ta6le >compiling ChezScheme/s/bytevector.ss with output to cs/c/ChezScheme/xc-ta6le/s/bytevector.ta6le >compiling ChezScheme/s/5_4.ss with output to cs/c/ChezScheme/xc-ta6le/s/5_4.ta6le >compiling ChezScheme/s/5_6.ss with output to cs/c/ChezScheme/xc-ta6le/s/5_6.ta6le >compiling ChezScheme/s/5_7.ss with output to cs/c/ChezScheme/xc-ta6le/s/5_7.ta6le >compiling ChezScheme/s/event.ss with output to cs/c/ChezScheme/xc-ta6le/s/event.ta6le >compiling ChezScheme/s/4.ss with output to cs/c/ChezScheme/xc-ta6le/s/4.ta6le >compiling ChezScheme/s/front.ss with output to cs/c/ChezScheme/xc-ta6le/s/front.ta6le >compiling ChezScheme/s/foreign.ss with output to cs/c/ChezScheme/xc-ta6le/s/foreign.ta6le >compiling ChezScheme/s/6.ss with output to cs/c/ChezScheme/xc-ta6le/s/6.ta6le >compiling ChezScheme/s/print.ss with output to cs/c/ChezScheme/xc-ta6le/s/print.ta6le >compiling ChezScheme/s/newhash.ss with output to cs/c/ChezScheme/xc-ta6le/s/newhash.ta6le >compiling ChezScheme/s/format.ss with output to cs/c/ChezScheme/xc-ta6le/s/format.ta6le >compiling ChezScheme/s/date.ss with output to cs/c/ChezScheme/xc-ta6le/s/date.ta6le >compiling ChezScheme/s/7.ss with output to cs/c/ChezScheme/xc-ta6le/s/7.ta6le >compiling ChezScheme/s/cafe.ss with output to cs/c/ChezScheme/xc-ta6le/s/cafe.ta6le >compiling ChezScheme/s/trace.ss with output to cs/c/ChezScheme/xc-ta6le/s/trace.ta6le >compiling ChezScheme/s/engine.ss with output to cs/c/ChezScheme/xc-ta6le/s/engine.ta6le >compiling ChezScheme/s/interpret.ss with output to cs/c/ChezScheme/xc-ta6le/s/interpret.ta6le >compiling ChezScheme/s/cprep.ss with output to cs/c/ChezScheme/xc-ta6le/s/cprep.ta6le >compiling ChezScheme/s/cpcheck.ss with output to cs/c/ChezScheme/xc-ta6le/s/cpcheck.ta6le >compiling ChezScheme/s/cp0.ss with output to cs/c/ChezScheme/xc-ta6le/s/cp0.ta6le >compiling ChezScheme/s/cpvalid.ss with output to cs/c/ChezScheme/xc-ta6le/s/cpvalid.ta6le >compiling ChezScheme/s/cptypes.ss with output to cs/c/ChezScheme/xc-ta6le/s/cptypes.ta6le >compiling ChezScheme/s/cpcommonize.ss with output to cs/c/ChezScheme/xc-ta6le/s/cpcommonize.ta6le >compiling ChezScheme/s/cpletrec.ss with output to cs/c/ChezScheme/xc-ta6le/s/cpletrec.ta6le >compiling ChezScheme/s/inspect.ss with output to cs/c/ChezScheme/xc-ta6le/s/inspect.ta6le >compiling ChezScheme/s/enum.ss with output to cs/c/ChezScheme/xc-ta6le/s/enum.ta6le >compiling ChezScheme/s/io.ss with output to cs/c/ChezScheme/xc-ta6le/s/io.ta6le >compiling ChezScheme/s/read.ss with output to cs/c/ChezScheme/xc-ta6le/s/read.ta6le >compiling ChezScheme/s/primvars.ss with output to cs/c/ChezScheme/xc-ta6le/s/primvars.ta6le >compiling ChezScheme/s/syntax.ss with output to cs/c/ChezScheme/xc-ta6le/s/syntax.ta6le >compiling ChezScheme/s/costctr.ss with output to cs/c/ChezScheme/xc-ta6le/s/costctr.ta6le >compiling ChezScheme/s/expeditor.ss with output to cs/c/ChezScheme/xc-ta6le/s/expeditor.ta6le >compiling ChezScheme/s/exceptions.ss with output to cs/c/ChezScheme/xc-ta6le/s/exceptions.ta6le >compiling ChezScheme/s/pretty.ss with output to cs/c/ChezScheme/xc-ta6le/s/pretty.ta6le >compiling ChezScheme/s/env.ss with output to cs/c/ChezScheme/xc-ta6le/s/env.ta6le >compiling ChezScheme/s/fasl.ss with output to cs/c/ChezScheme/xc-ta6le/s/fasl.ta6le >compiling ChezScheme/s/vfasl.ss with output to cs/c/ChezScheme/xc-ta6le/s/vfasl.ta6le >compiling ChezScheme/s/pbchunk.ss with output to cs/c/ChezScheme/xc-ta6le/s/pbchunk.ta6le >compiling ChezScheme/s/reloc.ss with output to cs/c/ChezScheme/xc-ta6le/s/reloc.ta6le >compiling ChezScheme/s/pdhtml.ss with output to cs/c/ChezScheme/xc-ta6le/s/pdhtml.ta6le >compiling ChezScheme/s/strip.ss with output to cs/c/ChezScheme/xc-ta6le/s/strip.ta6le >compiling ChezScheme/s/ftype.ss with output to cs/c/ChezScheme/xc-ta6le/s/ftype.ta6le >compiling ChezScheme/s/back.ss with output to cs/c/ChezScheme/xc-ta6le/s/back.ta6le >compiling ChezScheme/s/cpnanopass.ss with output to cs/c/ChezScheme/xc-ta6le/s/cpnanopass.ta6le >compiling ChezScheme/s/cpprim.ss with output to cs/c/ChezScheme/xc-ta6le/s/cpprim.ta6le >compiling ChezScheme/s/compile.ss with output to cs/c/ChezScheme/xc-ta6le/s/compile.ta6le >compiling ChezScheme/s/cback.ss with output to cs/c/ChezScheme/xc-ta6le/s/cback.ta6le >(time (let () ...)) > 568 collections > 117.604661308s elapsed cpu time, including 3.984885975s collecting > 118.072699275s elapsed real time, including 4.006212360s collecting > 9048103008 bytes allocated, including 8849449240 bytes reclaimed > 474628096 bytes peak memory use >running cs/c/ChezScheme/pb/bin/pb/scheme to build cs/c/ChezScheme/xc-ta6le/s/mkheader.so >compiling ChezScheme/s/mkheader.ss with output to cs/c/ChezScheme/xc-ta6le/s/mkheader.so >running cs/c/ChezScheme/pb/bin/pb/scheme to build cs/c/ChezScheme/xc-ta6le/boot/ta6le/scheme.h >running cs/c/ChezScheme/pb/bin/pb/scheme to build cs/c/ChezScheme/xc-ta6le/boot/ta6le/equates.h >running cs/c/ChezScheme/pb/bin/pb/scheme to build cs/c/ChezScheme/xc-ta6le/s/mkgc.so >compiling ChezScheme/s/mkgc.ss with output to cs/c/ChezScheme/xc-ta6le/s/mkgc.so >running cs/c/ChezScheme/pb/bin/pb/scheme to build cs/c/ChezScheme/xc-ta6le/boot/ta6le/gc-ocd.inc >running cs/c/ChezScheme/pb/bin/pb/scheme to build cs/c/ChezScheme/xc-ta6le/boot/ta6le/gc-oce.inc >running cs/c/ChezScheme/pb/bin/pb/scheme to build cs/c/ChezScheme/xc-ta6le/boot/ta6le/gc-par.inc >running cs/c/ChezScheme/pb/bin/pb/scheme to build cs/c/ChezScheme/xc-ta6le/boot/ta6le/heapcheck.inc >cd cs/c/ChezScheme/ta6le/lz4/lib && make liblz4.a >make[1]: Entering directory '/var/tmp/portage/dev-scheme/racket-8.15/work/racket-8.15/src/cs/c/ChezScheme/ta6le/lz4/lib' >compiling static library >make[1]: Leaving directory '/var/tmp/portage/dev-scheme/racket-8.15/work/racket-8.15/src/cs/c/ChezScheme/ta6le/lz4/lib' >x86_64-pc-linux-gnu-gcc -pthread -DX86_64 -Ics/c/ChezScheme/ta6le/boot/ta6le -Ics/c/ChezScheme/ta6le/c -IChezScheme/c/ -Ics/c/ChezScheme/ta6le/lz4/lib -O2 -march=x86-64 -pipe -pipe -frecord-gcc-switches -fno-diagnostics-color -fmessage-length=0 -pthread -o cs/c/ChezScheme/ta6le/c/statics.o -c ChezScheme/c/statics.c >x86_64-pc-linux-gnu-gcc -pthread -DX86_64 -Ics/c/ChezScheme/ta6le/boot/ta6le -Ics/c/ChezScheme/ta6le/c -IChezScheme/c/ -Ics/c/ChezScheme/ta6le/lz4/lib -O2 -march=x86-64 -pipe -pipe -frecord-gcc-switches -fno-diagnostics-color -fmessage-length=0 -pthread -o cs/c/ChezScheme/ta6le/c/segment.o -c ChezScheme/c/segment.c >x86_64-pc-linux-gnu-gcc -pthread -DX86_64 -Ics/c/ChezScheme/ta6le/boot/ta6le -Ics/c/ChezScheme/ta6le/c -IChezScheme/c/ -Ics/c/ChezScheme/ta6le/lz4/lib -O2 -march=x86-64 -pipe -pipe -frecord-gcc-switches -fno-diagnostics-color -fmessage-length=0 -pthread -o cs/c/ChezScheme/ta6le/c/alloc.o -c ChezScheme/c/alloc.c >x86_64-pc-linux-gnu-gcc -pthread -DX86_64 -Ics/c/ChezScheme/ta6le/boot/ta6le -Ics/c/ChezScheme/ta6le/c -IChezScheme/c/ -Ics/c/ChezScheme/ta6le/lz4/lib -O2 -march=x86-64 -pipe -pipe -frecord-gcc-switches -fno-diagnostics-color -fmessage-length=0 -pthread -o cs/c/ChezScheme/ta6le/c/symbol.o -c ChezScheme/c/symbol.c >x86_64-pc-linux-gnu-gcc -pthread -DX86_64 -Ics/c/ChezScheme/ta6le/boot/ta6le -Ics/c/ChezScheme/ta6le/c -IChezScheme/c/ -Ics/c/ChezScheme/ta6le/lz4/lib -O2 -march=x86-64 -pipe -pipe -frecord-gcc-switches -fno-diagnostics-color -fmessage-length=0 -pthread -o cs/c/ChezScheme/ta6le/c/intern.o -c ChezScheme/c/intern.c >x86_64-pc-linux-gnu-gcc -pthread -DX86_64 -Ics/c/ChezScheme/ta6le/boot/ta6le -Ics/c/ChezScheme/ta6le/c -IChezScheme/c/ -Ics/c/ChezScheme/ta6le/lz4/lib -O2 -march=x86-64 -pipe -pipe -frecord-gcc-switches -fno-diagnostics-color -fmessage-length=0 -pthread -o cs/c/ChezScheme/ta6le/c/gcwrapper.o -c ChezScheme/c/gcwrapper.c >x86_64-pc-linux-gnu-gcc -pthread -DX86_64 -Ics/c/ChezScheme/ta6le/boot/ta6le -Ics/c/ChezScheme/ta6le/c -IChezScheme/c/ -Ics/c/ChezScheme/ta6le/lz4/lib -O2 -march=x86-64 -pipe -pipe -frecord-gcc-switches -fno-diagnostics-color -fmessage-length=0 -pthread -o cs/c/ChezScheme/ta6le/c/gc-011.o -c ChezScheme/c/gc-011.c >x86_64-pc-linux-gnu-gcc -pthread -DX86_64 -Ics/c/ChezScheme/ta6le/boot/ta6le -Ics/c/ChezScheme/ta6le/c -IChezScheme/c/ -Ics/c/ChezScheme/ta6le/lz4/lib -O2 -march=x86-64 -pipe -pipe -frecord-gcc-switches -fno-diagnostics-color -fmessage-length=0 -pthread -o cs/c/ChezScheme/ta6le/c/gc-par.o -c ChezScheme/c/gc-par.c >x86_64-pc-linux-gnu-gcc -pthread -DX86_64 -Ics/c/ChezScheme/ta6le/boot/ta6le -Ics/c/ChezScheme/ta6le/c -IChezScheme/c/ -Ics/c/ChezScheme/ta6le/lz4/lib -O2 -march=x86-64 -pipe -pipe -frecord-gcc-switches -fno-diagnostics-color -fmessage-length=0 -pthread -o cs/c/ChezScheme/ta6le/c/gc-ocd.o -c ChezScheme/c/gc-ocd.c >x86_64-pc-linux-gnu-gcc -pthread -DX86_64 -Ics/c/ChezScheme/ta6le/boot/ta6le -Ics/c/ChezScheme/ta6le/c -IChezScheme/c/ -Ics/c/ChezScheme/ta6le/lz4/lib -O2 -march=x86-64 -pipe -pipe -frecord-gcc-switches -fno-diagnostics-color -fmessage-length=0 -pthread -o cs/c/ChezScheme/ta6le/c/gc-oce.o -c ChezScheme/c/gc-oce.c >x86_64-pc-linux-gnu-gcc -pthread -DX86_64 -Ics/c/ChezScheme/ta6le/boot/ta6le -Ics/c/ChezScheme/ta6le/c -IChezScheme/c/ -Ics/c/ChezScheme/ta6le/lz4/lib -O2 -march=x86-64 -pipe -pipe -frecord-gcc-switches -fno-diagnostics-color -fmessage-length=0 -pthread -o cs/c/ChezScheme/ta6le/c/number.o -c ChezScheme/c/number.c >x86_64-pc-linux-gnu-gcc -pthread -DX86_64 -Ics/c/ChezScheme/ta6le/boot/ta6le -Ics/c/ChezScheme/ta6le/c -IChezScheme/c/ -Ics/c/ChezScheme/ta6le/lz4/lib -O2 -march=x86-64 -pipe -pipe -frecord-gcc-switches -fno-diagnostics-color -fmessage-length=0 -pthread -o cs/c/ChezScheme/ta6le/c/schsig.o -c ChezScheme/c/schsig.c >x86_64-pc-linux-gnu-gcc -pthread -DX86_64 -Ics/c/ChezScheme/ta6le/boot/ta6le -Ics/c/ChezScheme/ta6le/c -IChezScheme/c/ -Ics/c/ChezScheme/ta6le/lz4/lib -O2 -march=x86-64 -pipe -pipe -frecord-gcc-switches -fno-diagnostics-color -fmessage-length=0 -pthread -o cs/c/ChezScheme/ta6le/c/io.o -c ChezScheme/c/io.c >x86_64-pc-linux-gnu-gcc -pthread -DX86_64 -Ics/c/ChezScheme/ta6le/boot/ta6le -Ics/c/ChezScheme/ta6le/c -IChezScheme/c/ -Ics/c/ChezScheme/ta6le/lz4/lib -O2 -march=x86-64 -pipe -pipe -frecord-gcc-switches -fno-diagnostics-color -fmessage-length=0 -pthread -o cs/c/ChezScheme/ta6le/c/new-io.o -c ChezScheme/c/new-io.c >x86_64-pc-linux-gnu-gcc -pthread -DX86_64 -Ics/c/ChezScheme/ta6le/boot/ta6le -Ics/c/ChezScheme/ta6le/c -IChezScheme/c/ -Ics/c/ChezScheme/ta6le/lz4/lib -O2 -march=x86-64 -pipe -pipe -frecord-gcc-switches -fno-diagnostics-color -fmessage-length=0 -pthread -o cs/c/ChezScheme/ta6le/c/print.o -c ChezScheme/c/print.c >x86_64-pc-linux-gnu-gcc -pthread -DX86_64 -Ics/c/ChezScheme/ta6le/boot/ta6le -Ics/c/ChezScheme/ta6le/c -IChezScheme/c/ -Ics/c/ChezScheme/ta6le/lz4/lib -O2 -march=x86-64 -pipe -pipe -frecord-gcc-switches -fno-diagnostics-color -fmessage-length=0 -pthread -o cs/c/ChezScheme/ta6le/c/fasl.o -c ChezScheme/c/fasl.c >x86_64-pc-linux-gnu-gcc -pthread -DX86_64 -Ics/c/ChezScheme/ta6le/boot/ta6le -Ics/c/ChezScheme/ta6le/c -IChezScheme/c/ -Ics/c/ChezScheme/ta6le/lz4/lib -O2 -march=x86-64 -pipe -pipe -frecord-gcc-switches -fno-diagnostics-color -fmessage-length=0 -pthread -o cs/c/ChezScheme/ta6le/c/vfasl.o -c ChezScheme/c/vfasl.c >x86_64-pc-linux-gnu-gcc -pthread -DX86_64 -Ics/c/ChezScheme/ta6le/boot/ta6le -Ics/c/ChezScheme/ta6le/c -IChezScheme/c/ -Ics/c/ChezScheme/ta6le/lz4/lib -O2 -march=x86-64 -pipe -pipe -frecord-gcc-switches -fno-diagnostics-color -fmessage-length=0 -pthread -o cs/c/ChezScheme/ta6le/c/stats.o -c ChezScheme/c/stats.c >x86_64-pc-linux-gnu-gcc -pthread -DX86_64 -Ics/c/ChezScheme/ta6le/boot/ta6le -Ics/c/ChezScheme/ta6le/c -IChezScheme/c/ -Ics/c/ChezScheme/ta6le/lz4/lib -O2 -march=x86-64 -pipe -pipe -frecord-gcc-switches -fno-diagnostics-color -fmessage-length=0 -pthread -o cs/c/ChezScheme/ta6le/c/foreign.o -c ChezScheme/c/foreign.c >x86_64-pc-linux-gnu-gcc -pthread -DX86_64 -Ics/c/ChezScheme/ta6le/boot/ta6le -Ics/c/ChezScheme/ta6le/c -IChezScheme/c/ -Ics/c/ChezScheme/ta6le/lz4/lib -O2 -march=x86-64 -pipe -pipe -frecord-gcc-switches -fno-diagnostics-color -fmessage-length=0 -pthread -o cs/c/ChezScheme/ta6le/c/prim.o -c ChezScheme/c/prim.c >x86_64-pc-linux-gnu-gcc -pthread -DX86_64 -Ics/c/ChezScheme/ta6le/boot/ta6le -Ics/c/ChezScheme/ta6le/c -IChezScheme/c/ -Ics/c/ChezScheme/ta6le/lz4/lib -O2 -march=x86-64 -pipe -pipe -frecord-gcc-switches -fno-diagnostics-color -fmessage-length=0 -pthread -o cs/c/ChezScheme/ta6le/c/prim5.o -c ChezScheme/c/prim5.c >x86_64-pc-linux-gnu-gcc -pthread -DX86_64 -Ics/c/ChezScheme/ta6le/boot/ta6le -Ics/c/ChezScheme/ta6le/c -IChezScheme/c/ -Ics/c/ChezScheme/ta6le/lz4/lib -O2 -march=x86-64 -pipe -pipe -frecord-gcc-switches -fno-diagnostics-color -fmessage-length=0 -pthread -o cs/c/ChezScheme/ta6le/c/flushcache.o -c ChezScheme/c/flushcache.c >x86_64-pc-linux-gnu-gcc -pthread -DX86_64 -Ics/c/ChezScheme/ta6le/boot/ta6le -Ics/c/ChezScheme/ta6le/c -IChezScheme/c/ -Ics/c/ChezScheme/ta6le/lz4/lib -O2 -march=x86-64 -pipe -pipe -frecord-gcc-switches -fno-diagnostics-color -fmessage-length=0 -pthread -o cs/c/ChezScheme/ta6le/c/schlib.o -c ChezScheme/c/schlib.c >x86_64-pc-linux-gnu-gcc -pthread -DX86_64 -Ics/c/ChezScheme/ta6le/boot/ta6le -Ics/c/ChezScheme/ta6le/c -IChezScheme/c/ -Ics/c/ChezScheme/ta6le/lz4/lib -O2 -march=x86-64 -pipe -pipe -frecord-gcc-switches -fno-diagnostics-color -fmessage-length=0 -pthread -o cs/c/ChezScheme/ta6le/c/thread.o -c ChezScheme/c/thread.c >x86_64-pc-linux-gnu-gcc -pthread -DX86_64 -Ics/c/ChezScheme/ta6le/boot/ta6le -Ics/c/ChezScheme/ta6le/c -IChezScheme/c/ -Ics/c/ChezScheme/ta6le/lz4/lib -O2 -march=x86-64 -pipe -pipe -frecord-gcc-switches -fno-diagnostics-color -fmessage-length=0 -pthread -o cs/c/ChezScheme/ta6le/c/expeditor.o -c ChezScheme/c/expeditor.c >x86_64-pc-linux-gnu-gcc -pthread -DX86_64 -Ics/c/ChezScheme/ta6le/boot/ta6le -Ics/c/ChezScheme/ta6le/c -IChezScheme/c/ -Ics/c/ChezScheme/ta6le/lz4/lib -O2 -march=x86-64 -pipe -pipe -frecord-gcc-switches -fno-diagnostics-color -fmessage-length=0 -pthread -o cs/c/ChezScheme/ta6le/c/scheme.o -c ChezScheme/c/scheme.c >x86_64-pc-linux-gnu-gcc -pthread -DX86_64 -Ics/c/ChezScheme/ta6le/boot/ta6le -Ics/c/ChezScheme/ta6le/c -IChezScheme/c/ -Ics/c/ChezScheme/ta6le/lz4/lib -O2 -march=x86-64 -pipe -pipe -frecord-gcc-switches -fno-diagnostics-color -fmessage-length=0 -pthread -o cs/c/ChezScheme/ta6le/c/compress-io.o -c ChezScheme/c/compress-io.c >x86_64-pc-linux-gnu-gcc -pthread -DX86_64 -Ics/c/ChezScheme/ta6le/boot/ta6le -Ics/c/ChezScheme/ta6le/c -IChezScheme/c/ -Ics/c/ChezScheme/ta6le/lz4/lib -O2 -march=x86-64 -pipe -pipe -frecord-gcc-switches -fno-diagnostics-color -fmessage-length=0 -pthread -o cs/c/ChezScheme/ta6le/c/random.o -c ChezScheme/c/random.c >x86_64-pc-linux-gnu-gcc -pthread -DX86_64 -Ics/c/ChezScheme/ta6le/boot/ta6le -Ics/c/ChezScheme/ta6le/c -IChezScheme/c/ -Ics/c/ChezScheme/ta6le/lz4/lib -O2 -march=x86-64 -pipe -pipe -frecord-gcc-switches -fno-diagnostics-color -fmessage-length=0 -pthread -o cs/c/ChezScheme/ta6le/c/ffi.o -c ChezScheme/c/ffi.c >x86_64-pc-linux-gnu-gcc -pthread -DX86_64 -Ics/c/ChezScheme/ta6le/boot/ta6le -Ics/c/ChezScheme/ta6le/c -IChezScheme/c/ -Ics/c/ChezScheme/ta6le/lz4/lib -O2 -march=x86-64 -pipe -pipe -frecord-gcc-switches -fno-diagnostics-color -fmessage-length=0 -pthread -o cs/c/ChezScheme/ta6le/c/self-exe.o -c ChezScheme/c/self-exe.c >x86_64-pc-linux-gnu-gcc -pthread -DX86_64 -Ics/c/ChezScheme/ta6le/boot/ta6le -Ics/c/ChezScheme/ta6le/c -IChezScheme/c/ -Ics/c/ChezScheme/ta6le/lz4/lib -O2 -march=x86-64 -pipe -pipe -frecord-gcc-switches -fno-diagnostics-color -fmessage-length=0 -pthread -o cs/c/ChezScheme/ta6le/c/i3le.o -c ChezScheme/c/i3le.c >x86_64-pc-linux-gnu-ar rc cs/c/ChezScheme/ta6le/boot/ta6le/libkernel.a cs/c/ChezScheme/ta6le/c/statics.o cs/c/ChezScheme/ta6le/c/segment.o cs/c/ChezScheme/ta6le/c/alloc.o cs/c/ChezScheme/ta6le/c/symbol.o cs/c/ChezScheme/ta6le/c/intern.o cs/c/ChezScheme/ta6le/c/gcwrapper.o cs/c/ChezScheme/ta6le/c/gc-011.o cs/c/ChezScheme/ta6le/c/gc-par.o cs/c/ChezScheme/ta6le/c/gc-ocd.o cs/c/ChezScheme/ta6le/c/gc-oce.o cs/c/ChezScheme/ta6le/c/number.o cs/c/ChezScheme/ta6le/c/schsig.o cs/c/ChezScheme/ta6le/c/io.o cs/c/ChezScheme/ta6le/c/new-io.o cs/c/ChezScheme/ta6le/c/print.o cs/c/ChezScheme/ta6le/c/fasl.o cs/c/ChezScheme/ta6le/c/vfasl.o cs/c/ChezScheme/ta6le/c/stats.o cs/c/ChezScheme/ta6le/c/foreign.o cs/c/ChezScheme/ta6le/c/prim.o cs/c/ChezScheme/ta6le/c/prim5.o cs/c/ChezScheme/ta6le/c/flushcache.o cs/c/ChezScheme/ta6le/c/schlib.o cs/c/ChezScheme/ta6le/c/thread.o cs/c/ChezScheme/ta6le/c/expeditor.o cs/c/ChezScheme/ta6le/c/scheme.o cs/c/ChezScheme/ta6le/c/compress-io.o cs/c/ChezScheme/ta6le/c/random.o cs/c/ChezScheme/ta6le/c/ffi.o cs/c/ChezScheme/ta6le/c/self-exe.o cs/c/ChezScheme/ta6le/c/i3le.o >x86_64-pc-linux-gnu-gcc -pthread -DX86_64 -Ics/c/ChezScheme/ta6le/boot/ta6le -Ics/c/ChezScheme/ta6le/c -IChezScheme/c/ -Ics/c/ChezScheme/ta6le/lz4/lib -O2 -march=x86-64 -pipe -pipe -frecord-gcc-switches -fno-diagnostics-color -fmessage-length=0 -pthread -o cs/c/ChezScheme/ta6le/boot/ta6le/main.o -c ChezScheme/c/main.c >x86_64-pc-linux-gnu-gcc -O2 -march=x86-64 -pipe -pipe -frecord-gcc-switches -fno-diagnostics-color -fmessage-length=0 -pthread -o cs/c/ChezScheme/ta6le/bin/ta6le/scheme cs/c/ChezScheme/ta6le/boot/ta6le/main.o cs/c/ChezScheme/ta6le/boot/ta6le/libkernel.a cs/c/ChezScheme/ta6le/lz4/lib/liblz4.a -Wl,-O1 -Wl,--as-needed -Wl,-z,pack-relative-relocs -Wl,--defsym=__gentoo_check_ldflags__=0 -pthread -ldl -lm -lrt -lncurses -ltinfo -lz -lz >running cs/c/ChezScheme/ta6le/bin/ta6le/scheme to build cs/c/ChezScheme/ta6le/s/cmacros.so >compiling ChezScheme/s/cmacros.ss with output to cs/c/ChezScheme/ta6le/s/cmacros.so >running cs/c/ChezScheme/ta6le/bin/ta6le/scheme to build cs/c/ChezScheme/ta6le/s/priminfo.so >compiling ChezScheme/s/priminfo.ss with output to cs/c/ChezScheme/ta6le/s/priminfo.so >running cs/c/ChezScheme/ta6le/bin/ta6le/scheme to build cs/c/ChezScheme/ta6le/s/primvars.so >compiling ChezScheme/s/primvars.ss with output to cs/c/ChezScheme/ta6le/s/primvars.so >running cs/c/ChezScheme/ta6le/bin/ta6le/scheme to build cs/c/ChezScheme/ta6le/s/env.so >compiling ChezScheme/s/env.ss with output to cs/c/ChezScheme/ta6le/s/env.so >running cs/c/ChezScheme/ta6le/bin/ta6le/scheme to build cs/c/ChezScheme/ta6le/s/setup.so >compiling ChezScheme/s/setup.ss with output to cs/c/ChezScheme/ta6le/s/setup.so >running cs/c/ChezScheme/ta6le/bin/ta6le/scheme to build cs/c/ChezScheme/ta6le/s/nanopass.so >compiling ChezScheme/nanopass/nanopass.ss with output to cs/c/ChezScheme/ta6le/s/nanopass.so >compiling ChezScheme/nanopass/nanopass/language.ss with output to cs/c/ChezScheme/ta6le/s/nanopass/language.so >compiling ChezScheme/nanopass/nanopass/helpers.ss with output to cs/c/ChezScheme/ta6le/s/nanopass/helpers.so >compiling ChezScheme/nanopass/nanopass/implementation-helpers.chezscheme.sls with output to cs/c/ChezScheme/ta6le/s/nanopass/implementation-helpers.chezscheme.so >compiling ChezScheme/nanopass/nanopass/language-helpers.ss with output to cs/c/ChezScheme/ta6le/s/nanopass/language-helpers.so >compiling ChezScheme/nanopass/nanopass/records.ss with output to cs/c/ChezScheme/ta6le/s/nanopass/records.so >compiling ChezScheme/nanopass/nanopass/syntaxconvert.ss with output to cs/c/ChezScheme/ta6le/s/nanopass/syntaxconvert.so >compiling ChezScheme/nanopass/nanopass/unparser.ss with output to cs/c/ChezScheme/ta6le/s/nanopass/unparser.so >compiling ChezScheme/nanopass/nanopass/meta-parser.ss with output to cs/c/ChezScheme/ta6le/s/nanopass/meta-parser.so >compiling ChezScheme/nanopass/nanopass/meta-syntax-dispatch.ss with output to cs/c/ChezScheme/ta6le/s/nanopass/meta-syntax-dispatch.so >compiling ChezScheme/nanopass/nanopass/parser.ss with output to cs/c/ChezScheme/ta6le/s/nanopass/parser.so >compiling ChezScheme/nanopass/nanopass/nano-syntax-dispatch.ss with output to cs/c/ChezScheme/ta6le/s/nanopass/nano-syntax-dispatch.so >compiling ChezScheme/nanopass/nanopass/language-node-counter.ss with output to cs/c/ChezScheme/ta6le/s/nanopass/language-node-counter.so >compiling ChezScheme/nanopass/nanopass/pass.ss with output to cs/c/ChezScheme/ta6le/s/nanopass/pass.so >running cs/c/ChezScheme/ta6le/bin/ta6le/scheme to build all at once >compiling ChezScheme/s/library.ss with output to cs/c/ChezScheme/ta6le/s/library.ta6le >compiling ChezScheme/s/prims.ss with output to cs/c/ChezScheme/ta6le/s/prims.ta6le >compiling ChezScheme/s/mathprims.ss with output to cs/c/ChezScheme/ta6le/s/mathprims.ta6le >compiling ChezScheme/s/record.ss with output to cs/c/ChezScheme/ta6le/s/record.ta6le >compiling ChezScheme/s/5_1.ss with output to cs/c/ChezScheme/ta6le/s/5_1.ta6le >compiling ChezScheme/s/5_2.ss with output to cs/c/ChezScheme/ta6le/s/5_2.ta6le >compiling ChezScheme/s/5_3.ss with output to cs/c/ChezScheme/ta6le/s/5_3.ta6le >compiling ChezScheme/s/strnum.ss with output to cs/c/ChezScheme/ta6le/s/strnum.ta6le >compiling ChezScheme/s/bytevector.ss with output to cs/c/ChezScheme/ta6le/s/bytevector.ta6le >compiling ChezScheme/s/5_4.ss with output to cs/c/ChezScheme/ta6le/s/5_4.ta6le >compiling ChezScheme/s/5_6.ss with output to cs/c/ChezScheme/ta6le/s/5_6.ta6le >compiling ChezScheme/s/5_7.ss with output to cs/c/ChezScheme/ta6le/s/5_7.ta6le >compiling ChezScheme/s/event.ss with output to cs/c/ChezScheme/ta6le/s/event.ta6le >compiling ChezScheme/s/4.ss with output to cs/c/ChezScheme/ta6le/s/4.ta6le >compiling ChezScheme/s/front.ss with output to cs/c/ChezScheme/ta6le/s/front.ta6le >compiling ChezScheme/s/foreign.ss with output to cs/c/ChezScheme/ta6le/s/foreign.ta6le >compiling ChezScheme/s/6.ss with output to cs/c/ChezScheme/ta6le/s/6.ta6le >compiling ChezScheme/s/print.ss with output to cs/c/ChezScheme/ta6le/s/print.ta6le >compiling ChezScheme/s/newhash.ss with output to cs/c/ChezScheme/ta6le/s/newhash.ta6le >compiling ChezScheme/s/format.ss with output to cs/c/ChezScheme/ta6le/s/format.ta6le >compiling ChezScheme/s/date.ss with output to cs/c/ChezScheme/ta6le/s/date.ta6le >compiling ChezScheme/s/7.ss with output to cs/c/ChezScheme/ta6le/s/7.ta6le >compiling ChezScheme/s/cafe.ss with output to cs/c/ChezScheme/ta6le/s/cafe.ta6le >compiling ChezScheme/s/trace.ss with output to cs/c/ChezScheme/ta6le/s/trace.ta6le >compiling ChezScheme/s/engine.ss with output to cs/c/ChezScheme/ta6le/s/engine.ta6le >compiling ChezScheme/s/interpret.ss with output to cs/c/ChezScheme/ta6le/s/interpret.ta6le >compiling ChezScheme/s/cprep.ss with output to cs/c/ChezScheme/ta6le/s/cprep.ta6le >compiling ChezScheme/s/cpcheck.ss with output to cs/c/ChezScheme/ta6le/s/cpcheck.ta6le >compiling ChezScheme/s/cp0.ss with output to cs/c/ChezScheme/ta6le/s/cp0.ta6le >compiling ChezScheme/s/cpvalid.ss with output to cs/c/ChezScheme/ta6le/s/cpvalid.ta6le >compiling ChezScheme/s/cptypes.ss with output to cs/c/ChezScheme/ta6le/s/cptypes.ta6le >compiling ChezScheme/s/cpcommonize.ss with output to cs/c/ChezScheme/ta6le/s/cpcommonize.ta6le >compiling ChezScheme/s/cpletrec.ss with output to cs/c/ChezScheme/ta6le/s/cpletrec.ta6le >compiling ChezScheme/s/inspect.ss with output to cs/c/ChezScheme/ta6le/s/inspect.ta6le >compiling ChezScheme/s/enum.ss with output to cs/c/ChezScheme/ta6le/s/enum.ta6le >compiling ChezScheme/s/io.ss with output to cs/c/ChezScheme/ta6le/s/io.ta6le >compiling ChezScheme/s/read.ss with output to cs/c/ChezScheme/ta6le/s/read.ta6le >compiling ChezScheme/s/primvars.ss with output to cs/c/ChezScheme/ta6le/s/primvars.ta6le >compiling ChezScheme/s/syntax.ss with output to cs/c/ChezScheme/ta6le/s/syntax.ta6le >compiling ChezScheme/s/costctr.ss with output to cs/c/ChezScheme/ta6le/s/costctr.ta6le >compiling ChezScheme/s/expeditor.ss with output to cs/c/ChezScheme/ta6le/s/expeditor.ta6le >compiling ChezScheme/s/exceptions.ss with output to cs/c/ChezScheme/ta6le/s/exceptions.ta6le >compiling ChezScheme/s/pretty.ss with output to cs/c/ChezScheme/ta6le/s/pretty.ta6le >compiling ChezScheme/s/env.ss with output to cs/c/ChezScheme/ta6le/s/env.ta6le >compiling ChezScheme/s/fasl.ss with output to cs/c/ChezScheme/ta6le/s/fasl.ta6le >compiling ChezScheme/s/vfasl.ss with output to cs/c/ChezScheme/ta6le/s/vfasl.ta6le >compiling ChezScheme/s/pbchunk.ss with output to cs/c/ChezScheme/ta6le/s/pbchunk.ta6le >compiling ChezScheme/s/reloc.ss with output to cs/c/ChezScheme/ta6le/s/reloc.ta6le >compiling ChezScheme/s/pdhtml.ss with output to cs/c/ChezScheme/ta6le/s/pdhtml.ta6le >compiling ChezScheme/s/strip.ss with output to cs/c/ChezScheme/ta6le/s/strip.ta6le >compiling ChezScheme/s/ftype.ss with output to cs/c/ChezScheme/ta6le/s/ftype.ta6le >compiling ChezScheme/s/back.ss with output to cs/c/ChezScheme/ta6le/s/back.ta6le >compiling ChezScheme/s/cpnanopass.ss with output to cs/c/ChezScheme/ta6le/s/cpnanopass.ta6le >compiling ChezScheme/s/cpprim.ss with output to cs/c/ChezScheme/ta6le/s/cpprim.ta6le >compiling ChezScheme/s/compile.ss with output to cs/c/ChezScheme/ta6le/s/compile.ta6le >compiling ChezScheme/s/cback.ss with output to cs/c/ChezScheme/ta6le/s/cback.ta6le >(time (let () ...)) > 576 collections > 8.169239781s elapsed cpu time, including 2.171266719s collecting > 8.201374208s elapsed real time, including 2.180653555s collecting > 9189917232 bytes allocated, including 9186479584 bytes reclaimed > 797229056 bytes peak memory use >running cs/c/ChezScheme/ta6le/bin/ta6le/scheme to build fixpoint check >done (unchanged after rebuild) >running cs/c/ChezScheme/ta6le/bin/ta6le/scheme to build cs/c/ChezScheme/ta6le/s/mkheader.so >compiling ChezScheme/s/mkheader.ss with output to cs/c/ChezScheme/ta6le/s/mkheader.so >running cs/c/ChezScheme/ta6le/bin/ta6le/scheme to build cs/c/ChezScheme/ta6le/boot/ta6le/scheme.h >running cs/c/ChezScheme/ta6le/bin/ta6le/scheme to build cs/c/ChezScheme/ta6le/boot/ta6le/equates.h >running cs/c/ChezScheme/ta6le/bin/ta6le/scheme to build cs/c/ChezScheme/ta6le/s/mkgc.so >compiling ChezScheme/s/mkgc.ss with output to cs/c/ChezScheme/ta6le/s/mkgc.so >running cs/c/ChezScheme/ta6le/bin/ta6le/scheme to build cs/c/ChezScheme/ta6le/boot/ta6le/gc-ocd.inc >running cs/c/ChezScheme/ta6le/bin/ta6le/scheme to build cs/c/ChezScheme/ta6le/boot/ta6le/gc-oce.inc >running cs/c/ChezScheme/ta6le/bin/ta6le/scheme to build cs/c/ChezScheme/ta6le/boot/ta6le/gc-par.inc >running cs/c/ChezScheme/ta6le/bin/ta6le/scheme to build cs/c/ChezScheme/ta6le/boot/ta6le/heapcheck.inc >cs/c/ChezScheme/ta6le/bin/ta6le/scheme -B cs/c/ChezScheme/ta6le/boot/ta6le/petite.boot -B cs/c/ChezScheme/ta6le/boot/ta6le/scheme.boot --script cs/c/same-boot.ss cs/c/ChezScheme/boot/ta6le/petite.boot cs/c/ChezScheme/ta6le/boot/ta6le/petite.boot >Boot file "cs/c/ChezScheme/boot/ta6le/petite.boot" was correctly created as a fixpoint >cs/c/ChezScheme/ta6le/bin/ta6le/scheme -B cs/c/ChezScheme/ta6le/boot/ta6le/petite.boot -B cs/c/ChezScheme/ta6le/boot/ta6le/scheme.boot --script cs/c/same-boot.ss cs/c/ChezScheme/boot/ta6le/scheme.boot cs/c/ChezScheme/ta6le/boot/ta6le/scheme.boot >Boot file "cs/c/ChezScheme/boot/ta6le/scheme.boot" was correctly created as a fixpoint >cs/c/ChezScheme/ta6le/bin/ta6le/scheme -B cs/c/ChezScheme/ta6le/boot/ta6le/petite.boot -B cs/c/ChezScheme/ta6le/boot/ta6le/scheme.boot --script cs/compile-file.ss --unsafe --compress --src cs/ --dest cs/c cs/chezpart.sls cs/c/chezpart.so >compiling cs/chezpart.sls with output to cs/c/chezpart.so >(time (compile-it)) > 1 collection > 0.010355533s elapsed cpu time, including 0.000465363s collecting > 0.010406332s elapsed real time, including 0.000472034s collecting > 5816368 bytes allocated, including 7981072 bytes reclaimed > 53620736 bytes peak memory use >cs/c/ChezScheme/ta6le/bin/ta6le/scheme -B cs/c/ChezScheme/ta6le/boot/ta6le/petite.boot -B cs/c/ChezScheme/ta6le/boot/ta6le/scheme.boot --script cs/compile-file.ss --unsafe --compress --src cs/ --dest cs/c cs/rumble.sls cs/c/rumble.so cs/c/chezpart.so >compiling cs/rumble.sls with output to cs/c/rumble.so >(time (compile-it)) > 333 collections > 4.841201801s elapsed cpu time, including 2.238040741s collecting > 4.864408113s elapsed real time, including 2.249249713s collecting > 2808183680 bytes allocated, including 2609261024 bytes reclaimed > 371752960 bytes peak memory use >cs/c/ChezScheme/ta6le/bin/ta6le/scheme -B cs/c/ChezScheme/ta6le/boot/ta6le/petite.boot -B cs/c/ChezScheme/ta6le/boot/ta6le/scheme.boot --script cs/compile-file.ss --unsafe --compress --src cs/ --dest cs/c cs/thread.sls cs/c/thread.so cs/c/chezpart.so cs/c/rumble.so >compiling cs/thread.sls with output to cs/c/thread.so >(time (compile-it)) > 114 collections > 1.224124396s elapsed cpu time, including 0.557111162s collecting > 1.230043900s elapsed real time, including 0.560032316s collecting > 962109952 bytes allocated, including 888970368 bytes reclaimed > 137781248 bytes peak memory use >cs/c/ChezScheme/ta6le/bin/ta6le/scheme -B cs/c/ChezScheme/ta6le/boot/ta6le/petite.boot -B cs/c/ChezScheme/ta6le/boot/ta6le/scheme.boot --script cs/compile-file.ss --unsafe --compress --src cs/ --dest cs/c cs/io.sls cs/c/io.so cs/c/chezpart.so cs/c/rumble.so cs/c/thread.so >compiling cs/io.sls with output to cs/c/io.so >(time (compile-it)) > 312 collections > 4.778371541s elapsed cpu time, including 2.601286345s collecting > 4.800176232s elapsed real time, including 2.613541717s collecting > 2643932080 bytes allocated, including 2494060688 bytes reclaimed > 316321792 bytes peak memory use >cs/c/ChezScheme/ta6le/bin/ta6le/scheme -B cs/c/ChezScheme/ta6le/boot/ta6le/petite.boot -B cs/c/ChezScheme/ta6le/boot/ta6le/scheme.boot --script cs/compile-file.ss --unsafe --compress --src cs/ --dest cs/c cs/regexp.sls cs/c/regexp.so cs/c/chezpart.so cs/c/rumble.so cs/c/thread.so cs/c/io.so >compiling cs/regexp.sls with output to cs/c/regexp.so >(time (compile-it)) > 56 collections > 0.504671743s elapsed cpu time, including 0.198781485s collecting > 0.506608138s elapsed real time, including 0.199664023s collecting > 477446096 bytes allocated, including 429502960 bytes reclaimed > 104734720 bytes peak memory use >cs/c/ChezScheme/ta6le/bin/ta6le/scheme -B cs/c/ChezScheme/ta6le/boot/ta6le/petite.boot -B cs/c/ChezScheme/ta6le/boot/ta6le/scheme.boot --script cs/compile-file.ss --unsafe --compress --src cs/ --dest cs/c cs/schemify.sls cs/c/schemify.so cs/c/chezpart.so cs/c/rumble.so cs/c/thread.so cs/c/io.so cs/c/regexp.so >compiling cs/schemify.sls with output to cs/c/schemify.so >(time (compile-it)) > 301 collections > 4.398372944s elapsed cpu time, including 2.442819508s collecting > 4.413947579s elapsed real time, including 2.451840111s collecting > 2557238544 bytes allocated, including 2399016848 bytes reclaimed > 342212608 bytes peak memory use >cs/c/ChezScheme/ta6le/bin/ta6le/scheme -B cs/c/ChezScheme/ta6le/boot/ta6le/petite.boot -B cs/c/ChezScheme/ta6le/boot/ta6le/scheme.boot --script cs/compile-file.ss --unsafe --compress --src cs/ --dest cs/c cs/linklet.sls cs/c/linklet.so cs/c/chezpart.so cs/c/rumble.so cs/c/thread.so cs/c/io.so cs/c/regexp.so cs/c/schemify.so >compiling cs/linklet.sls with output to cs/c/linklet.so >(time (compile-it)) > 26 collections > 0.243427360s elapsed cpu time, including 0.096539859s collecting > 0.244709748s elapsed real time, including 0.097054375s collecting > 225482848 bytes allocated, including 197622192 bytes reclaimed > 94044160 bytes peak memory use >cs/c/ChezScheme/ta6le/bin/ta6le/scheme -B cs/c/ChezScheme/ta6le/boot/ta6le/petite.boot -B cs/c/ChezScheme/ta6le/boot/ta6le/scheme.boot --script cs/compile-file.ss --unsafe --compress --src cs/ --dest cs/c cs/expander.sls cs/c/expander.so cs/c/chezpart.so cs/c/rumble.so cs/c/thread.so cs/c/io.so cs/c/regexp.so cs/c/schemify.so cs/c/linklet.so >compiling cs/expander.sls with output to cs/c/expander.so >(time (compile-it)) > 544 collections > 8.457678307s elapsed cpu time, including 4.457922304s collecting > 8.497229622s elapsed real time, including 4.479386374s collecting > 4641574528 bytes allocated, including 4424431656 bytes reclaimed > 594886656 bytes peak memory use >cs/c/ChezScheme/ta6le/bin/ta6le/scheme -B cs/c/ChezScheme/ta6le/boot/ta6le/petite.boot -B cs/c/ChezScheme/ta6le/boot/ta6le/scheme.boot --script cs/compile-file.ss --unsafe --compress --src cs/ --dest cs/c cs/main.sps cs/c/main.so cs/c/chezpart.so cs/c/rumble.so cs/c/thread.so cs/c/io.so cs/c/regexp.so cs/c/schemify.so cs/c/linklet.so cs/c/expander.so >compiling cs/main.sps with output to cs/c/main.so >(time (compile-it)) > 13 collections > 0.136057036s elapsed cpu time, including 0.053618995s collecting > 0.136609863s elapsed real time, including 0.053860026s collecting > 113520912 bytes allocated, including 85197904 bytes reclaimed > 81215488 bytes peak memory use >cs/c/ChezScheme/ta6le/bin/ta6le/scheme -B cs/c/ChezScheme/ta6le/boot/ta6le/petite.boot -B cs/c/ChezScheme/ta6le/boot/ta6le/scheme.boot --script cs/compile-file.ss --unsafe --compress --whole-program --src cs/ --dest cs/c cs/c/main.so cs/c/racket.so cs/c/main.wpo >Whole-program optimization for Racket core... >[If this step runs out of memory, try configuring with `--disable-wpo`] >(time (compile-it)) > 929 collections > 17.767368685s elapsed cpu time, including 10.630374314s collecting > 17.840764867s elapsed real time, including 10.675125497s collecting > 7937066352 bytes allocated, including 7023175424 bytes reclaimed > 1461604352 bytes peak memory use >cs/c/ChezScheme/ta6le/bin/ta6le/scheme -B cs/c/ChezScheme/ta6le/boot/ta6le/petite.boot -B cs/c/ChezScheme/ta6le/boot/ta6le/scheme.boot --script cs/c/convert-to-boot.ss cs/c/racket.so cs/c/racket.boot ta6le >x86_64-pc-linux-gnu-gcc -pthread -Ics/c -Ics/c/ -DINITIAL_COLLECTS_DIRECTORY='"'/var/tmp/portage/dev-scheme/racket-8.15/work/racket-8.15/collects'"' -DINITIAL_CONFIG_DIRECTORY='"'/var/tmp/portage/dev-scheme/racket-8.15/work/racket-8.15/etc'"' -O2 -march=x86-64 -pipe -pipe -frecord-gcc-switches -fno-diagnostics-color -fmessage-length=0 -o cs/c/main.o -c cs/c/main.c >x86_64-pc-linux-gnu-gcc -pthread -Ics/c/ChezScheme/ta6le/boot/ta6le -Irktio -Ics/c/rktio -O2 -march=x86-64 -pipe -pipe -frecord-gcc-switches -fno-diagnostics-color -fmessage-length=0 -o cs/c/boot.o -c cs/c/boot.c >x86_64-pc-linux-gnu-gcc -pthread -Ics/c/rktio/ -Irktio/ -O2 -march=x86-64 -pipe -pipe -frecord-gcc-switches -fno-diagnostics-color -fmessage-length=0 -o cs/c/rktio/rktio_fs.o -c rktio/rktio_fs.c >x86_64-pc-linux-gnu-gcc -pthread -Ics/c/rktio/ -Irktio/ -O2 -march=x86-64 -pipe -pipe -frecord-gcc-switches -fno-diagnostics-color -fmessage-length=0 -o cs/c/rktio/rktio_fd.o -c rktio/rktio_fd.c >x86_64-pc-linux-gnu-gcc -pthread -Ics/c/rktio/ -Irktio/ -O2 -march=x86-64 -pipe -pipe -frecord-gcc-switches -fno-diagnostics-color -fmessage-length=0 -o cs/c/rktio/rktio_file.o -c rktio/rktio_file.c >x86_64-pc-linux-gnu-gcc -pthread -Ics/c/rktio/ -Irktio/ -O2 -march=x86-64 -pipe -pipe -frecord-gcc-switches -fno-diagnostics-color -fmessage-length=0 -o cs/c/rktio/rktio_poll_set.o -c rktio/rktio_poll_set.c >x86_64-pc-linux-gnu-gcc -pthread -Ics/c/rktio/ -Irktio/ -O2 -march=x86-64 -pipe -pipe -frecord-gcc-switches -fno-diagnostics-color -fmessage-length=0 -o cs/c/rktio/rktio_ltps.o -c rktio/rktio_ltps.c >x86_64-pc-linux-gnu-gcc -pthread -Ics/c/rktio/ -Irktio/ -O2 -march=x86-64 -pipe -pipe -frecord-gcc-switches -fno-diagnostics-color -fmessage-length=0 -o cs/c/rktio/rktio_sleep.o -c rktio/rktio_sleep.c >x86_64-pc-linux-gnu-gcc -pthread -Ics/c/rktio/ -Irktio/ -O2 -march=x86-64 -pipe -pipe -frecord-gcc-switches -fno-diagnostics-color -fmessage-length=0 -o cs/c/rktio/rktio_network.o -c rktio/rktio_network.c >x86_64-pc-linux-gnu-gcc -pthread -Ics/c/rktio/ -Irktio/ -O2 -march=x86-64 -pipe -pipe -frecord-gcc-switches -fno-diagnostics-color -fmessage-length=0 -o cs/c/rktio/rktio_pipe.o -c rktio/rktio_pipe.c >x86_64-pc-linux-gnu-gcc -pthread -Ics/c/rktio/ -Irktio/ -O2 -march=x86-64 -pipe -pipe -frecord-gcc-switches -fno-diagnostics-color -fmessage-length=0 -o cs/c/rktio/rktio_process.o -c rktio/rktio_process.c >rktio/rktio_process.c: In function âcentralized_starting_childâ: >rktio/rktio_process.c:452:39: error: passing argument 2 of ârktio_set_signal_handlerâ from incompatible pointer type [-Wincompatible-pointer-types[https://gcc.gnu.org/onlinedocs/gcc/Warning-Options.html#index-Wincompatible-pointer-types]] > 452 | rktio_set_signal_handler(SIGCHLD, got_sigchld); > | ^~~~~~~~~~~ > | | > | void (*)(void) >In file included from rktio/rktio_process.c:2: >rktio/rktio_private.h:438:50: note: expected âvoid (*)(int)â but argument is of type âvoid (*)(void)â > 438 | void rktio_set_signal_handler(int sig_id, void (*proc)(int)); > | ~~~~~~~^~~~~~~~~~ >compile failed > in build-one > in loop > in module->hash >make: *** [Makefile:22: all] Error 1 > * ERROR: dev-scheme/racket-8.15::gentoo failed (compile phase): > * emake failed > * > * If you need support, post the output of `emerge --info '=dev-scheme/racket-8.15::gentoo'`, > * the complete build log and the output of `emerge -pqv '=dev-scheme/racket-8.15::gentoo'`. > * The complete build log is located at '/var/log/emerge-log/build/dev-scheme/racket-8.15:20241120-145047.log'. > * For convenience, a symlink to the build log is located at '/var/tmp/portage/dev-scheme/racket-8.15/temp/build.log'. > * The ebuild environment file is located at '/var/tmp/portage/dev-scheme/racket-8.15/temp/environment'. > * Working directory: '/var/tmp/portage/dev-scheme/racket-8.15/work/racket-8.15/src' > * S: '/var/tmp/portage/dev-scheme/racket-8.15/work/racket-8.15/src' >
You cannot view the attachment while viewing its details because your browser does not support IFRAMEs.
View the attachment on a separate page
.
View Attachment As Raw
Actions:
View
Attachments on
bug 944149
: 910509