Go to:
Gentoo Home
Documentation
Forums
Lists
Bugs
Planet
Store
Wiki
Get Gentoo!
Gentoo's Bugzilla – Attachment 899180 Details for
Bug 937408
media-libs/opencolorio-2.3.2 - [icu-75.1] [gcc-15] /.../OpenColorIO.h: error: uint8_t was not declared in this scope
Home
|
New
–
[Ex]
|
Browse
|
Search
|
Privacy Policy
|
[?]
|
Reports
|
Requests
|
Help
|
New Account
|
Log In
[x]
|
Forgot Password
Login:
[x]
media-libs:opencolorio-2.3.2:20240805-203115.log
media-libs:opencolorio-2.3.2:20240805-203115.log (text/plain), 26.67 KB, created by
Toralf Förster
on 2024-08-05 20:53:11 UTC
(
hide
)
Description:
media-libs:opencolorio-2.3.2:20240805-203115.log
Filename:
MIME Type:
Creator:
Toralf Förster
Created:
2024-08-05 20:53:11 UTC
Size:
26.67 KB
patch
obsolete
> * Package: media-libs/opencolorio-2.3.2:0/2.3 > * Repository: gentoo > * Maintainer: negril.nx+gentoo@gmail.com proxy-maint@gentoo.org > * USE: abi_x86_64 amd64 cpu_flags_x86_avx cpu_flags_x86_avx2 cpu_flags_x86_f16c cpu_flags_x86_sse2 cpu_flags_x86_sse3 cpu_flags_x86_sse4_1 cpu_flags_x86_sse4_2 cpu_flags_x86_ssse3 elibc_glibc kernel_linux python_single_target_python3_12 > * FEATURES: network-sandbox preserve-libs sandbox userpriv usersandbox > >>>> Unpacking source... >>>> Unpacking opencolorio-2.3.2.tar.gz to /var/tmp/portage/media-libs/opencolorio-2.3.2/work >>>> Source unpacked in /var/tmp/portage/media-libs/opencolorio-2.3.2/work >>>> Preparing source in /var/tmp/portage/media-libs/opencolorio-2.3.2/work/OpenColorIO-2.3.2 ... > * Source directory (CMAKE_USE_DIR): "/var/tmp/portage/media-libs/opencolorio-2.3.2/work/OpenColorIO-2.3.2" > * Build directory (BUILD_DIR): "/var/tmp/portage/media-libs/opencolorio-2.3.2/work/OpenColorIO-2.3.2_build" > * Applying opencolorio-2.2.1-adjust-python-installation.patch ... >patching file src/bindings/python/CMakeLists.txt >Hunk #1 succeeded at 241 with fuzz 1 (offset 11 lines). > [ ok ] > * Hardcoded definition(s) removed in CMakeLists.txt: > * set(CMAKE_BUILD_TYPE "Release" CACHE STRING "Choose the type of build." F >>>> Source prepared. >>>> Configuring source in /var/tmp/portage/media-libs/opencolorio-2.3.2/work/OpenColorIO-2.3.2 ... > * Source directory (CMAKE_USE_DIR): "/var/tmp/portage/media-libs/opencolorio-2.3.2/work/OpenColorIO-2.3.2" > * Build directory (BUILD_DIR): "/var/tmp/portage/media-libs/opencolorio-2.3.2/work/OpenColorIO-2.3.2_build" >cmake -C /var/tmp/portage/media-libs/opencolorio-2.3.2/work/OpenColorIO-2.3.2_build/gentoo_common_config.cmake -G Ninja -DCMAKE_INSTALL_PREFIX=/usr -DOCIO_BUILD_APPS=no -DOCIO_BUILD_DOCS=no -DOCIO_BUILD_FROZEN_DOCS=no -DOCIO_BUILD_GPU_TESTS=no -DOCIO_BUILD_JAVA=OFF -DOCIO_BUILD_PYTHON=no -DOCIO_BUILD_TESTS=no -DOCIO_INSTALL_EXT_PACKAGES=NONE -DOCIO_USE_SIMD=ON -DOCIO_USE_SSE2=yes -DOCIO_USE_SSE3=yes -DOCIO_USE_SSSE3=yes -DOCIO_USE_SSE4=yes -DOCIO_USE_SSE42=yes -DOCIO_USE_AVX=yes -DOCIO_USE_AVX2=yes -DOCIO_USE_AVX512=no -DOCIO_USE_F16C=yes -DCMAKE_BUILD_TYPE=RelWithDebInfo -DCMAKE_TOOLCHAIN_FILE=/var/tmp/portage/media-libs/opencolorio-2.3.2/work/OpenColorIO-2.3.2_build/gentoo_toolchain.cmake /var/tmp/portage/media-libs/opencolorio-2.3.2/work/OpenColorIO-2.3.2 >loading initial cache file /var/tmp/portage/media-libs/opencolorio-2.3.2/work/OpenColorIO-2.3.2_build/gentoo_common_config.cmake >-- The CXX compiler identification is GNU 15.0.0 >-- The C compiler identification is GNU 15.0.0 >-- Detecting CXX compiler ABI info >-- Detecting CXX compiler ABI info - done >-- Check for working CXX compiler: /usr/bin/x86_64-pc-linux-gnu-g++ - skipped >-- Detecting CXX compile features >-- Detecting CXX compile features - done >-- Detecting C compiler ABI info >-- Detecting C compiler ABI info - done >-- Check for working C compiler: /usr/bin/x86_64-pc-linux-gnu-gcc - skipped >-- Detecting C compile features >-- Detecting C compile features - done >-- Setting C++ version to '14' as none was specified. >-- Performing Test COMPILER_SUPPORTS_CXX14 >-- Performing Test COMPILER_SUPPORTS_CXX14 - Success >-- >-- Checking for GPU configuration... >-- Performing Test COMPILER_SUPPORTS_ARM_NEON >-- Performing Test COMPILER_SUPPORTS_ARM_NEON - Failed >-- Performing Test COMPILER_SUPPORTS_AVX >-- Performing Test COMPILER_SUPPORTS_AVX - Success >-- Performing Test COMPILER_SUPPORTS_AVX2 >-- Performing Test COMPILER_SUPPORTS_AVX2 - Success >-- Performing Test COMPILER_SUPPORTS_AVX512 >-- Performing Test COMPILER_SUPPORTS_AVX512 - Success >-- Performing Test COMPILER_SUPPORTS_SSE42 >-- Performing Test COMPILER_SUPPORTS_SSE42 - Success >-- Performing Test COMPILER_SUPPORTS_SSE4 >-- Performing Test COMPILER_SUPPORTS_SSE4 - Success >-- Performing Test COMPILER_SUPPORTS_SSSE3 >-- Performing Test COMPILER_SUPPORTS_SSSE3 - Success >-- Performing Test COMPILER_SUPPORTS_SSE3 >-- Performing Test COMPILER_SUPPORTS_SSE3 - Success >-- Performing Test COMPILER_SUPPORTS_SSE2 >-- Performing Test COMPILER_SUPPORTS_SSE2 - Success >-- Performing Test COMPILER_SUPPORTS_F16C >-- Performing Test COMPILER_SUPPORTS_F16C - Success >-- Setting SOVERSION to '2.3' as none was specified. >-- >-- Missing a dependency? Try the following possibilities: >-- If the package provides CMake's configuration file, use -D<pkg>_DIR=<path to folder>. >-- If it doesn't provide it, try -D<pkg>_ROOT=<path to folder with lib and includes>. >-- Alternatively, try -D<pkg>_LIBRARY=<path to lib file> and/or -D<pkg>_INCLUDE_DIR=<path to folder>. >-- >-- Please refer to the find module under share/cmake/modules for extra information. >-- >-- Checking for mandatory dependencies... >-- Found expat (version "2.6.2") >-- Found yaml-cpp (version "0.8.0") >-- Found pystring (no version information) >-- Found Imath (version "3.1.10") >-- Found ZLIB (version "1.3.1") >-- Found minizip-ng (version "4.0.7") >-- >-- Checking for optional dependencies... >CMake Warning at tests/CMakeLists.txt:24 (message): > Skipping the library unit tests. > > >CMake Warning at src/apps/CMakeLists.txt:21 (message): > Skipping build of all apps. > > >-- <<< Gentoo configuration >>> >Build type RelWithDebInfo >Install path /usr >Compiler flags: >C -O3 -pipe -march=native -fno-diagnostics-color >C++ -O3 -pipe -march=native -fno-diagnostics-color >Linker flags: >Executable -Wl,-O1 -Wl,--as-needed -Wl,-z,pack-relative-relocs -Wl,--defsym=__gentoo_check_ldflags__=0 >Module -Wl,-O1 -Wl,--as-needed -Wl,-z,pack-relative-relocs -Wl,--defsym=__gentoo_check_ldflags__=0 >Shared -Wl,-O1 -Wl,--as-needed -Wl,-z,pack-relative-relocs -Wl,--defsym=__gentoo_check_ldflags__=0 > >-- Configuring done (6.5s) >-- Generating done (0.1s) >-- Build files have been written to: /var/tmp/portage/media-libs/opencolorio-2.3.2/work/OpenColorIO-2.3.2_build >>>> Source configured. >>>> Compiling source in /var/tmp/portage/media-libs/opencolorio-2.3.2/work/OpenColorIO-2.3.2 ... > * Source directory (CMAKE_USE_DIR): "/var/tmp/portage/media-libs/opencolorio-2.3.2/work/OpenColorIO-2.3.2" > * Build directory (BUILD_DIR): "/var/tmp/portage/media-libs/opencolorio-2.3.2/work/OpenColorIO-2.3.2_build" >ninja -v -j4 -l0 >[1/184] /usr/bin/x86_64-pc-linux-gnu-g++ -DOpenColorIO_EXPORTS -I/var/tmp/portage/media-libs/opencolorio-2.3.2/work/OpenColorIO-2.3.2/include/OpenColorIO/.. -I/var/tmp/portage/media-libs/opencolorio-2.3.2/work/OpenColorIO-2.3.2/include/OpenColorIO -I/var/tmp/portage/media-libs/opencolorio-2.3.2/work/OpenColorIO-2.3.2/src/OpenColorIO -I/var/tmp/portage/media-libs/opencolorio-2.3.2/work/OpenColorIO-2.3.2_build/include/OpenColorIO -I/var/tmp/portage/media-libs/opencolorio-2.3.2/work/OpenColorIO-2.3.2_build/src/OpenColorIO -I/var/tmp/portage/media-libs/opencolorio-2.3.2/work/OpenColorIO-2.3.2_build/generated_include -isystem /usr/include/Imath -isystem /usr/include/pystring -isystem /var/tmp/portage/media-libs/opencolorio-2.3.2/work/OpenColorIO-2.3.2/ext/sampleicc/src/include -isystem /var/tmp/portage/media-libs/opencolorio-2.3.2/work/OpenColorIO-2.3.2/src/utils/.. -isystem /var/tmp/portage/media-libs/opencolorio-2.3.2/work/OpenColorIO-2.3.2/ext/xxHash/src/include -isystem /usr/include/minizip-ng -O3 -pipe -march=native -fno-diagnostics-color -std=c++14 -fPIC -fvisibility=hidden -fvisibility-inlines-hidden -fno-diagnostics-color -DUSE_GCC -Wall -Wextra -Wswitch-enum -MD -MT src/OpenColorIO/CMakeFiles/OpenColorIO.dir/apphelpers/DisplayViewHelpers.cpp.o -MF src/OpenColorIO/CMakeFiles/OpenColorIO.dir/apphelpers/DisplayViewHelpers.cpp.o.d -o src/OpenColorIO/CMakeFiles/OpenColorIO.dir/apphelpers/DisplayViewHelpers.cpp.o -c /var/tmp/portage/media-libs/opencolorio-2.3.2/work/OpenColorIO-2.3.2/src/OpenColorIO/apphelpers/DisplayViewHelpers.cpp >FAILED: src/OpenColorIO/CMakeFiles/OpenColorIO.dir/apphelpers/DisplayViewHelpers.cpp.o >/usr/bin/x86_64-pc-linux-gnu-g++ -DOpenColorIO_EXPORTS -I/var/tmp/portage/media-libs/opencolorio-2.3.2/work/OpenColorIO-2.3.2/include/OpenColorIO/.. -I/var/tmp/portage/media-libs/opencolorio-2.3.2/work/OpenColorIO-2.3.2/include/OpenColorIO -I/var/tmp/portage/media-libs/opencolorio-2.3.2/work/OpenColorIO-2.3.2/src/OpenColorIO -I/var/tmp/portage/media-libs/opencolorio-2.3.2/work/OpenColorIO-2.3.2_build/include/OpenColorIO -I/var/tmp/portage/media-libs/opencolorio-2.3.2/work/OpenColorIO-2.3.2_build/src/OpenColorIO -I/var/tmp/portage/media-libs/opencolorio-2.3.2/work/OpenColorIO-2.3.2_build/generated_include -isystem /usr/include/Imath -isystem /usr/include/pystring -isystem /var/tmp/portage/media-libs/opencolorio-2.3.2/work/OpenColorIO-2.3.2/ext/sampleicc/src/include -isystem /var/tmp/portage/media-libs/opencolorio-2.3.2/work/OpenColorIO-2.3.2/src/utils/.. -isystem /var/tmp/portage/media-libs/opencolorio-2.3.2/work/OpenColorIO-2.3.2/ext/xxHash/src/include -isystem /usr/include/minizip-ng -O3 -pipe -march=native -fno-diagnostics-color -std=c++14 -fPIC -fvisibility=hidden -fvisibility-inlines-hidden -fno-diagnostics-color -DUSE_GCC -Wall -Wextra -Wswitch-enum -MD -MT src/OpenColorIO/CMakeFiles/OpenColorIO.dir/apphelpers/DisplayViewHelpers.cpp.o -MF src/OpenColorIO/CMakeFiles/OpenColorIO.dir/apphelpers/DisplayViewHelpers.cpp.o.d -o src/OpenColorIO/CMakeFiles/OpenColorIO.dir/apphelpers/DisplayViewHelpers.cpp.o -c /var/tmp/portage/media-libs/opencolorio-2.3.2/work/OpenColorIO-2.3.2/src/OpenColorIO/apphelpers/DisplayViewHelpers.cpp >In file included from /var/tmp/portage/media-libs/opencolorio-2.3.2/work/OpenColorIO-2.3.2/src/OpenColorIO/apphelpers/DisplayViewHelpers.cpp:11: >/var/tmp/portage/media-libs/opencolorio-2.3.2/work/OpenColorIO-2.3.2/include/OpenColorIO/../OpenColorIO/OpenColorIO.h:3276:10: error: use of enum âTextureDimensionsâ without previous declaration > 3276 | enum TextureDimensions : uint8_t { > | ^~~~~~~~~~~~~~~~~ >/var/tmp/portage/media-libs/opencolorio-2.3.2/work/OpenColorIO-2.3.2/include/OpenColorIO/../OpenColorIO/OpenColorIO.h:3276:30: error: âuint8_tâ was not declared in this scope > 3276 | enum TextureDimensions : uint8_t { > | ^~~~~~~ >/var/tmp/portage/media-libs/opencolorio-2.3.2/work/OpenColorIO-2.3.2/include/OpenColorIO/../OpenColorIO/OpenColorIO.h:20:1: note: âuint8_tâ is defined in header â<cstdint>â; this is probably fixable by adding â#include <cstdint>â > 19 | #include "OpenColorAppHelpers.h" > +++ |+#include <cstdint> > 20 | >/var/tmp/portage/media-libs/opencolorio-2.3.2/work/OpenColorIO-2.3.2/include/OpenColorIO/../OpenColorIO/OpenColorIO.h:3276:38: error: default member initializer for unnamed bit-field > 3276 | enum TextureDimensions : uint8_t { > | ^ >/var/tmp/portage/media-libs/opencolorio-2.3.2/work/OpenColorIO-2.3.2/include/OpenColorIO/../OpenColorIO/OpenColorIO.h:3292:29: error: âTextureDimensionsâ has not been declared > 3292 | TextureDimensions dimensions, > | ^~~~~~~~~~~~~~~~~ >/var/tmp/portage/media-libs/opencolorio-2.3.2/work/OpenColorIO-2.3.2/include/OpenColorIO/../OpenColorIO/OpenColorIO.h:3544:29: error: âTextureDimensionsâ has not been declared > 3544 | TextureDimensions & dimensions, > | ^~~~~~~~~~~~~~~~~ >/var/tmp/portage/media-libs/opencolorio-2.3.2/work/OpenColorIO-2.3.2/include/OpenColorIO/../OpenColorIO/OpenColorIO.h:3856:25: error: âuint8_tâ was not declared in this scope > 3856 | virtual std::vector<uint8_t> getLutData(const char * filepath) const = 0; > | ^~~~~~~ >/var/tmp/portage/media-libs/opencolorio-2.3.2/work/OpenColorIO-2.3.2/include/OpenColorIO/../OpenColorIO/OpenColorIO.h:3856:25: note: âuint8_tâ is defined in header â<cstdint>â; this is probably fixable by adding â#include <cstdint>â >/var/tmp/portage/media-libs/opencolorio-2.3.2/work/OpenColorIO-2.3.2/include/OpenColorIO/../OpenColorIO/OpenColorIO.h:3856:32: error: template argument 1 is invalid > 3856 | virtual std::vector<uint8_t> getLutData(const char * filepath) const = 0; > | ^ >/var/tmp/portage/media-libs/opencolorio-2.3.2/work/OpenColorIO-2.3.2/include/OpenColorIO/../OpenColorIO/OpenColorIO.h:3856:32: error: template argument 2 is invalid >[2/184] /usr/bin/x86_64-pc-linux-gnu-g++ -DOpenColorIO_EXPORTS -I/var/tmp/portage/media-libs/opencolorio-2.3.2/work/OpenColorIO-2.3.2/include/OpenColorIO/.. -I/var/tmp/portage/media-libs/opencolorio-2.3.2/work/OpenColorIO-2.3.2/include/OpenColorIO -I/var/tmp/portage/media-libs/opencolorio-2.3.2/work/OpenColorIO-2.3.2/src/OpenColorIO -I/var/tmp/portage/media-libs/opencolorio-2.3.2/work/OpenColorIO-2.3.2_build/include/OpenColorIO -I/var/tmp/portage/media-libs/opencolorio-2.3.2/work/OpenColorIO-2.3.2_build/src/OpenColorIO -I/var/tmp/portage/media-libs/opencolorio-2.3.2/work/OpenColorIO-2.3.2_build/generated_include -isystem /usr/include/Imath -isystem /usr/include/pystring -isystem /var/tmp/portage/media-libs/opencolorio-2.3.2/work/OpenColorIO-2.3.2/ext/sampleicc/src/include -isystem /var/tmp/portage/media-libs/opencolorio-2.3.2/work/OpenColorIO-2.3.2/src/utils/.. -isystem /var/tmp/portage/media-libs/opencolorio-2.3.2/work/OpenColorIO-2.3.2/ext/xxHash/src/include -isystem /usr/include/minizip-ng -O3 -pipe -march=native -fno-diagnostics-color -std=c++14 -fPIC -fvisibility=hidden -fvisibility-inlines-hidden -fno-diagnostics-color -DUSE_GCC -Wall -Wextra -Wswitch-enum -MD -MT src/OpenColorIO/CMakeFiles/OpenColorIO.dir/apphelpers/LegacyViewingPipeline.cpp.o -MF src/OpenColorIO/CMakeFiles/OpenColorIO.dir/apphelpers/LegacyViewingPipeline.cpp.o.d -o src/OpenColorIO/CMakeFiles/OpenColorIO.dir/apphelpers/LegacyViewingPipeline.cpp.o -c /var/tmp/portage/media-libs/opencolorio-2.3.2/work/OpenColorIO-2.3.2/src/OpenColorIO/apphelpers/LegacyViewingPipeline.cpp >FAILED: src/OpenColorIO/CMakeFiles/OpenColorIO.dir/apphelpers/LegacyViewingPipeline.cpp.o >/usr/bin/x86_64-pc-linux-gnu-g++ -DOpenColorIO_EXPORTS -I/var/tmp/portage/media-libs/opencolorio-2.3.2/work/OpenColorIO-2.3.2/include/OpenColorIO/.. -I/var/tmp/portage/media-libs/opencolorio-2.3.2/work/OpenColorIO-2.3.2/include/OpenColorIO -I/var/tmp/portage/media-libs/opencolorio-2.3.2/work/OpenColorIO-2.3.2/src/OpenColorIO -I/var/tmp/portage/media-libs/opencolorio-2.3.2/work/OpenColorIO-2.3.2_build/include/OpenColorIO -I/var/tmp/portage/media-libs/opencolorio-2.3.2/work/OpenColorIO-2.3.2_build/src/OpenColorIO -I/var/tmp/portage/media-libs/opencolorio-2.3.2/work/OpenColorIO-2.3.2_build/generated_include -isystem /usr/include/Imath -isystem /usr/include/pystring -isystem /var/tmp/portage/media-libs/opencolorio-2.3.2/work/OpenColorIO-2.3.2/ext/sampleicc/src/include -isystem /var/tmp/portage/media-libs/opencolorio-2.3.2/work/OpenColorIO-2.3.2/src/utils/.. -isystem /var/tmp/portage/media-libs/opencolorio-2.3.2/work/OpenColorIO-2.3.2/ext/xxHash/src/include -isystem /usr/include/minizip-ng -O3 -pipe -march=native -fno-diagnostics-color -std=c++14 -fPIC -fvisibility=hidden -fvisibility-inlines-hidden -fno-diagnostics-color -DUSE_GCC -Wall -Wextra -Wswitch-enum -MD -MT src/OpenColorIO/CMakeFiles/OpenColorIO.dir/apphelpers/LegacyViewingPipeline.cpp.o -MF src/OpenColorIO/CMakeFiles/OpenColorIO.dir/apphelpers/LegacyViewingPipeline.cpp.o.d -o src/OpenColorIO/CMakeFiles/OpenColorIO.dir/apphelpers/LegacyViewingPipeline.cpp.o -c /var/tmp/portage/media-libs/opencolorio-2.3.2/work/OpenColorIO-2.3.2/src/OpenColorIO/apphelpers/LegacyViewingPipeline.cpp >In file included from /var/tmp/portage/media-libs/opencolorio-2.3.2/work/OpenColorIO-2.3.2/src/OpenColorIO/apphelpers/LegacyViewingPipeline.cpp:8: >/var/tmp/portage/media-libs/opencolorio-2.3.2/work/OpenColorIO-2.3.2/include/OpenColorIO/../OpenColorIO/OpenColorIO.h:3276:10: error: use of enum âTextureDimensionsâ without previous declaration > 3276 | enum TextureDimensions : uint8_t { > | ^~~~~~~~~~~~~~~~~ >/var/tmp/portage/media-libs/opencolorio-2.3.2/work/OpenColorIO-2.3.2/include/OpenColorIO/../OpenColorIO/OpenColorIO.h:3276:30: error: âuint8_tâ was not declared in this scope > 3276 | enum TextureDimensions : uint8_t { > | ^~~~~~~ >/var/tmp/portage/media-libs/opencolorio-2.3.2/work/OpenColorIO-2.3.2/include/OpenColorIO/../OpenColorIO/OpenColorIO.h:20:1: note: âuint8_tâ is defined in header â<cstdint>â; this is probably fixable by adding â#include <cstdint>â > 19 | #include "OpenColorAppHelpers.h" > +++ |+#include <cstdint> > 20 | >/var/tmp/portage/media-libs/opencolorio-2.3.2/work/OpenColorIO-2.3.2/include/OpenColorIO/../OpenColorIO/OpenColorIO.h:3276:38: error: default member initializer for unnamed bit-field > 3276 | enum TextureDimensions : uint8_t { > | ^ >/var/tmp/portage/media-libs/opencolorio-2.3.2/work/OpenColorIO-2.3.2/include/OpenColorIO/../OpenColorIO/OpenColorIO.h:3292:29: error: âTextureDimensionsâ has not been declared > 3292 | TextureDimensions dimensions, > | ^~~~~~~~~~~~~~~~~ >/var/tmp/portage/media-libs/opencolorio-2.3.2/work/OpenColorIO-2.3.2/include/OpenColorIO/../OpenColorIO/OpenColorIO.h:3544:29: error: âTextureDimensionsâ has not been declared > 3544 | TextureDimensions & dimensions, > | ^~~~~~~~~~~~~~~~~ >/var/tmp/portage/media-libs/opencolorio-2.3.2/work/OpenColorIO-2.3.2/include/OpenColorIO/../OpenColorIO/OpenColorIO.h:3856:25: error: âuint8_tâ was not declared in this scope > 3856 | virtual std::vector<uint8_t> getLutData(const char * filepath) const = 0; > | ^~~~~~~ >/var/tmp/portage/media-libs/opencolorio-2.3.2/work/OpenColorIO-2.3.2/include/OpenColorIO/../OpenColorIO/OpenColorIO.h:3856:25: note: âuint8_tâ is defined in header â<cstdint>â; this is probably fixable by adding â#include <cstdint>â >/var/tmp/portage/media-libs/opencolorio-2.3.2/work/OpenColorIO-2.3.2/include/OpenColorIO/../OpenColorIO/OpenColorIO.h:3856:32: error: template argument 1 is invalid > 3856 | virtual std::vector<uint8_t> getLutData(const char * filepath) const = 0; > | ^ >/var/tmp/portage/media-libs/opencolorio-2.3.2/work/OpenColorIO-2.3.2/include/OpenColorIO/../OpenColorIO/OpenColorIO.h:3856:32: error: template argument 2 is invalid >[3/184] /usr/bin/x86_64-pc-linux-gnu-g++ -DOpenColorIO_EXPORTS -I/var/tmp/portage/media-libs/opencolorio-2.3.2/work/OpenColorIO-2.3.2/include/OpenColorIO/.. -I/var/tmp/portage/media-libs/opencolorio-2.3.2/work/OpenColorIO-2.3.2/include/OpenColorIO -I/var/tmp/portage/media-libs/opencolorio-2.3.2/work/OpenColorIO-2.3.2/src/OpenColorIO -I/var/tmp/portage/media-libs/opencolorio-2.3.2/work/OpenColorIO-2.3.2_build/include/OpenColorIO -I/var/tmp/portage/media-libs/opencolorio-2.3.2/work/OpenColorIO-2.3.2_build/src/OpenColorIO -I/var/tmp/portage/media-libs/opencolorio-2.3.2/work/OpenColorIO-2.3.2_build/generated_include -isystem /usr/include/Imath -isystem /usr/include/pystring -isystem /var/tmp/portage/media-libs/opencolorio-2.3.2/work/OpenColorIO-2.3.2/ext/sampleicc/src/include -isystem /var/tmp/portage/media-libs/opencolorio-2.3.2/work/OpenColorIO-2.3.2/src/utils/.. -isystem /var/tmp/portage/media-libs/opencolorio-2.3.2/work/OpenColorIO-2.3.2/ext/xxHash/src/include -isystem /usr/include/minizip-ng -O3 -pipe -march=native -fno-diagnostics-color -std=c++14 -fPIC -fvisibility=hidden -fvisibility-inlines-hidden -fno-diagnostics-color -DUSE_GCC -Wall -Wextra -Wswitch-enum -MD -MT src/OpenColorIO/CMakeFiles/OpenColorIO.dir/apphelpers/CategoryHelpers.cpp.o -MF src/OpenColorIO/CMakeFiles/OpenColorIO.dir/apphelpers/CategoryHelpers.cpp.o.d -o src/OpenColorIO/CMakeFiles/OpenColorIO.dir/apphelpers/CategoryHelpers.cpp.o -c /var/tmp/portage/media-libs/opencolorio-2.3.2/work/OpenColorIO-2.3.2/src/OpenColorIO/apphelpers/CategoryHelpers.cpp >FAILED: src/OpenColorIO/CMakeFiles/OpenColorIO.dir/apphelpers/CategoryHelpers.cpp.o >/usr/bin/x86_64-pc-linux-gnu-g++ -DOpenColorIO_EXPORTS -I/var/tmp/portage/media-libs/opencolorio-2.3.2/work/OpenColorIO-2.3.2/include/OpenColorIO/.. -I/var/tmp/portage/media-libs/opencolorio-2.3.2/work/OpenColorIO-2.3.2/include/OpenColorIO -I/var/tmp/portage/media-libs/opencolorio-2.3.2/work/OpenColorIO-2.3.2/src/OpenColorIO -I/var/tmp/portage/media-libs/opencolorio-2.3.2/work/OpenColorIO-2.3.2_build/include/OpenColorIO -I/var/tmp/portage/media-libs/opencolorio-2.3.2/work/OpenColorIO-2.3.2_build/src/OpenColorIO -I/var/tmp/portage/media-libs/opencolorio-2.3.2/work/OpenColorIO-2.3.2_build/generated_include -isystem /usr/include/Imath -isystem /usr/include/pystring -isystem /var/tmp/portage/media-libs/opencolorio-2.3.2/work/OpenColorIO-2.3.2/ext/sampleicc/src/include -isystem /var/tmp/portage/media-libs/opencolorio-2.3.2/work/OpenColorIO-2.3.2/src/utils/.. -isystem /var/tmp/portage/media-libs/opencolorio-2.3.2/work/OpenColorIO-2.3.2/ext/xxHash/src/include -isystem /usr/include/minizip-ng -O3 -pipe -march=native -fno-diagnostics-color -std=c++14 -fPIC -fvisibility=hidden -fvisibility-inlines-hidden -fno-diagnostics-color -DUSE_GCC -Wall -Wextra -Wswitch-enum -MD -MT src/OpenColorIO/CMakeFiles/OpenColorIO.dir/apphelpers/CategoryHelpers.cpp.o -MF src/OpenColorIO/CMakeFiles/OpenColorIO.dir/apphelpers/CategoryHelpers.cpp.o.d -o src/OpenColorIO/CMakeFiles/OpenColorIO.dir/apphelpers/CategoryHelpers.cpp.o -c /var/tmp/portage/media-libs/opencolorio-2.3.2/work/OpenColorIO-2.3.2/src/OpenColorIO/apphelpers/CategoryHelpers.cpp >In file included from /var/tmp/portage/media-libs/opencolorio-2.3.2/work/OpenColorIO-2.3.2/src/OpenColorIO/apphelpers/CategoryHelpers.cpp:7: >/var/tmp/portage/media-libs/opencolorio-2.3.2/work/OpenColorIO-2.3.2/include/OpenColorIO/../OpenColorIO/OpenColorIO.h:3276:10: error: use of enum âTextureDimensionsâ without previous declaration > 3276 | enum TextureDimensions : uint8_t { > | ^~~~~~~~~~~~~~~~~ >/var/tmp/portage/media-libs/opencolorio-2.3.2/work/OpenColorIO-2.3.2/include/OpenColorIO/../OpenColorIO/OpenColorIO.h:3276:30: error: âuint8_tâ was not declared in this scope > 3276 | enum TextureDimensions : uint8_t { > | ^~~~~~~ >/var/tmp/portage/media-libs/opencolorio-2.3.2/work/OpenColorIO-2.3.2/include/OpenColorIO/../OpenColorIO/OpenColorIO.h:20:1: note: âuint8_tâ is defined in header â<cstdint>â; this is probably fixable by adding â#include <cstdint>â > 19 | #include "OpenColorAppHelpers.h" > +++ |+#include <cstdint> > 20 | >/var/tmp/portage/media-libs/opencolorio-2.3.2/work/OpenColorIO-2.3.2/include/OpenColorIO/../OpenColorIO/OpenColorIO.h:3276:38: error: default member initializer for unnamed bit-field > 3276 | enum TextureDimensions : uint8_t { > | ^ >/var/tmp/portage/media-libs/opencolorio-2.3.2/work/OpenColorIO-2.3.2/include/OpenColorIO/../OpenColorIO/OpenColorIO.h:3292:29: error: âTextureDimensionsâ has not been declared > 3292 | TextureDimensions dimensions, > | ^~~~~~~~~~~~~~~~~ >/var/tmp/portage/media-libs/opencolorio-2.3.2/work/OpenColorIO-2.3.2/include/OpenColorIO/../OpenColorIO/OpenColorIO.h:3544:29: error: âTextureDimensionsâ has not been declared > 3544 | TextureDimensions & dimensions, > | ^~~~~~~~~~~~~~~~~ >/var/tmp/portage/media-libs/opencolorio-2.3.2/work/OpenColorIO-2.3.2/include/OpenColorIO/../OpenColorIO/OpenColorIO.h:3856:25: error: âuint8_tâ was not declared in this scope > 3856 | virtual std::vector<uint8_t> getLutData(const char * filepath) const = 0; > | ^~~~~~~ >/var/tmp/portage/media-libs/opencolorio-2.3.2/work/OpenColorIO-2.3.2/include/OpenColorIO/../OpenColorIO/OpenColorIO.h:3856:25: note: âuint8_tâ is defined in header â<cstdint>â; this is probably fixable by adding â#include <cstdint>â >/var/tmp/portage/media-libs/opencolorio-2.3.2/work/OpenColorIO-2.3.2/include/OpenColorIO/../OpenColorIO/OpenColorIO.h:3856:32: error: template argument 1 is invalid > 3856 | virtual std::vector<uint8_t> getLutData(const char * filepath) const = 0; > | ^ >/var/tmp/portage/media-libs/opencolorio-2.3.2/work/OpenColorIO-2.3.2/include/OpenColorIO/../OpenColorIO/OpenColorIO.h:3856:32: error: template argument 2 is invalid >[4/184] /usr/bin/x86_64-pc-linux-gnu-g++ -DOpenColorIO_EXPORTS -I/var/tmp/portage/media-libs/opencolorio-2.3.2/work/OpenColorIO-2.3.2/include/OpenColorIO/.. -I/var/tmp/portage/media-libs/opencolorio-2.3.2/work/OpenColorIO-2.3.2/include/OpenColorIO -I/var/tmp/portage/media-libs/opencolorio-2.3.2/work/OpenColorIO-2.3.2/src/OpenColorIO -I/var/tmp/portage/media-libs/opencolorio-2.3.2/work/OpenColorIO-2.3.2_build/include/OpenColorIO -I/var/tmp/portage/media-libs/opencolorio-2.3.2/work/OpenColorIO-2.3.2_build/src/OpenColorIO -I/var/tmp/portage/media-libs/opencolorio-2.3.2/work/OpenColorIO-2.3.2_build/generated_include -isystem /usr/include/Imath -isystem /usr/include/pystring -isystem /var/tmp/portage/media-libs/opencolorio-2.3.2/work/OpenColorIO-2.3.2/ext/sampleicc/src/include -isystem /var/tmp/portage/media-libs/opencolorio-2.3.2/work/OpenColorIO-2.3.2/src/utils/.. -isystem /var/tmp/portage/media-libs/opencolorio-2.3.2/work/OpenColorIO-2.3.2/ext/xxHash/src/include -isystem /usr/include/minizip-ng -O3 -pipe -march=native -fno-diagnostics-color -std=c++14 -fPIC -fvisibility=hidden -fvisibility-inlines-hidden -fno-diagnostics-color -DUSE_GCC -Wall -Wextra -Wswitch-enum -MD -MT src/OpenColorIO/CMakeFiles/OpenColorIO.dir/apphelpers/ColorSpaceHelpers.cpp.o -MF src/OpenColorIO/CMakeFiles/OpenColorIO.dir/apphelpers/ColorSpaceHelpers.cpp.o.d -o src/OpenColorIO/CMakeFiles/OpenColorIO.dir/apphelpers/ColorSpaceHelpers.cpp.o -c /var/tmp/portage/media-libs/opencolorio-2.3.2/work/OpenColorIO-2.3.2/src/OpenColorIO/apphelpers/ColorSpaceHelpers.cpp >ninja: build stopped: subcommand failed. > * ERROR: media-libs/opencolorio-2.3.2::gentoo failed (compile phase): > * ninja -v -j4 -l0 failed > * > * Call stack: > * ebuild.sh, line 136: Called src_compile > * environment, line 3124: Called cmake_src_compile > * environment, line 1359: Called cmake_build > * environment, line 1326: Called eninja > * environment, line 1801: Called die > * The specific snippet of code: > * "$@" || die -n "${*} failed" > * > * If you need support, post the output of `emerge --info '=media-libs/opencolorio-2.3.2::gentoo'`, > * the complete build log and the output of `emerge -pqv '=media-libs/opencolorio-2.3.2::gentoo'`. > * The complete build log is located at '/var/log/portage/media-libs:opencolorio-2.3.2:20240805-203115.log'. > * For convenience, a symlink to the build log is located at '/var/tmp/portage/media-libs/opencolorio-2.3.2/temp/build.log'. > * The ebuild environment file is located at '/var/tmp/portage/media-libs/opencolorio-2.3.2/temp/environment'. > * Working directory: '/var/tmp/portage/media-libs/opencolorio-2.3.2/work/OpenColorIO-2.3.2_build' > * S: '/var/tmp/portage/media-libs/opencolorio-2.3.2/work/OpenColorIO-2.3.2' >
You cannot view the attachment while viewing its details because your browser does not support IFRAMEs.
View the attachment on a separate page
.
View Attachment As Raw
Actions:
View
Attachments on
bug 937408
:
899175
|
899176
|
899177
|
899178
|
899179
| 899180 |
899181
|
899182