Go to:
Gentoo Home
Documentation
Forums
Lists
Bugs
Planet
Store
Wiki
Get Gentoo!
Gentoo's Bugzilla – Attachment 895098 Details for
Bug 933583
app-emacs/cider-1.14.0 fails tests: FAILED: Cannot open load file: No such file or directory, clojure-ts-mode
Home
|
New
–
[Ex]
|
Browse
|
Search
|
Privacy Policy
|
[?]
|
Reports
|
Requests
|
Help
|
New Account
|
Log In
[x]
|
Forgot Password
Login:
[x]
build.log
build.log (text/plain), 101.29 KB, created by
Agostino Sarubbo
on 2024-06-05 06:46:37 UTC
(
hide
)
Description:
build.log
Filename:
MIME Type:
Creator:
Agostino Sarubbo
Created:
2024-06-05 06:46:37 UTC
Size:
101.29 KB
patch
obsolete
> * Package: app-emacs/cider-1.14.0:0 > * Repository: gentoo > * Maintainer: gnu-emacs@gentoo.org > * Upstream: https://github.com/clojure-emacs/cider/issues/ > * USE: abi_x86_64 amd64 elibc_glibc kernel_linux test > * FEATURES: network-sandbox preserve-libs sandbox test userpriv usersandbox > > >@@@@@ PLEASE PAY ATTENTION HERE!!! @@@@@ >This information may help you to understand if this is a duplicate or if this bug exists after you pushed a fix; >This ebuild was merged at the following commit: >https://github.com/gentoo/gentoo/commit/1b485bf0ea56776d26969962b2400daa97572ac7 (Tue Jun 4 15:13:22 UTC 2024) >@@@@@ END @@@@@ > > > >@@@@@ PLEASE PAY ATTENTION HERE!!! @@@@@ >This ebuild was merged (directly or as a dependency) because of the following commit: >https://github.com/gentoo/gentoo/commit/5cb1040877a4ab363ed3e46ac3503e3782c0b3d4 >@@@@@ END @@@@@ > > > >################## ># emerge --info: # >################## >Portage 3.0.65 (python 3.12.3-final-0, default/linux/amd64/23.0/split-usr, gcc-14, glibc-2.39-r7, 6.1.87-gentoo-dist x86_64) >================================================================= >System uname: Linux-6.1.87-gentoo-dist-x86_64-AMD_EPYC_7513_32-Core_Processor-with-glibc2.39 >KiB Mem: 263449376 total, 99043084 free >KiB Swap: 0 total, 0 free >sh bash 5.2_p26-r3 >ld GNU ld (Gentoo 2.42 p3) 2.42.0 >app-misc/pax-utils: 1.3.7::gentoo >app-shells/bash: 5.2_p26-r3::gentoo >dev-build/autoconf: 2.72-r1::gentoo >dev-build/automake: 1.16.5-r2::gentoo >dev-build/cmake: 3.29.3::gentoo >dev-build/libtool: 2.4.7-r4::gentoo >dev-build/make: 4.4.1-r1::gentoo >dev-build/meson: 1.4.1::gentoo >dev-lang/perl: 5.38.2-r6::gentoo >dev-lang/python: 3.10.14_p1-r1::gentoo, 3.11.9-r1::gentoo, 3.12.3-r1::gentoo >sys-apps/baselayout: 2.15::gentoo >sys-apps/openrc: 0.54::gentoo >sys-apps/sandbox: 2.38::gentoo >sys-devel/binutils: 2.42-r1::gentoo >sys-devel/binutils-config: 5.5::gentoo >sys-devel/gcc: 14.1.1_p20240518::gentoo >sys-devel/gcc-config: 2.11::gentoo >sys-kernel/linux-headers: 6.9::gentoo (virtual/os-headers) >sys-libs/glibc: 2.39-r7::gentoo >Repositories: > >gentoo > location: /usr/portage > sync-type: rsync > sync-uri: rsync://rsync.gentoo.org/gentoo-portage > priority: -1000 > volatile: True > sync-rsync-extra-opts: > sync-rsync-verify-jobs: 1 > sync-rsync-verify-max-age: 3 > sync-rsync-verify-metamanifest: yes > >ACCEPT_KEYWORDS="amd64 ~amd64" >ACCEPT_LICENSE="* GPL-3+" >CBUILD="x86_64-pc-linux-gnu" >CFLAGS="-O2 -march=x86-64 -pipe -pipe -frecord-gcc-switches -fno-diagnostics-color -fmessage-length=0" >CHOST="x86_64-pc-linux-gnu" >CONFIG_PROTECT="/etc /usr/share/gnupg/qualified.txt" >CONFIG_PROTECT_MASK="/etc/ca-certificates.conf /etc/env.d /etc/fonts/fonts.conf /etc/gconf /etc/gentoo-release /etc/revdep-rebuild /etc/sandbox.d /etc/terminfo" >CXXFLAGS="-O2 -march=x86-64 -pipe -pipe -frecord-gcc-switches -fno-diagnostics-color -fmessage-length=0" >DISTDIR="/var/tmp/portage/app-emacs/cider-1.14.0/distdir" >EMERGE_DEFAULT_OPTS="--complete-graph y --with-bdeps=y -1 -k -b --backtrack=100" >ENV_UNSET="CARGO_HOME DBUS_SESSION_BUS_ADDRESS DISPLAY GDK_PIXBUF_MODULE_FILE GOBIN GOPATH PERL5LIB PERL5OPT PERLPREFIX PERL_CORE PERL_MB_OPT PERL_MM_OPT XAUTHORITY XDG_CACHE_HOME XDG_CONFIG_HOME XDG_DATA_HOME XDG_RUNTIME_DIR XDG_STATE_HOME" >FCFLAGS="-O2 -march=x86-64 -pipe -pipe -frecord-gcc-switches -fno-diagnostics-color -fmessage-length=0" >FEATURES="assume-digests binpkg-docompress binpkg-dostrip binpkg-logs binpkg-multi-instance buildpkg buildpkg-live config-protect-if-modified distlocks ebuild-locks fixlafiles ipc-sandbox merge-sync merge-wait multilib-strict network-sandbox news parallel-fetch pid-sandbox pkgdir-index-trusted preserve-libs protect-owned qa-unresolved-soname-deps sandbox sfperms sign split-log strict test unknown-features-warn unmerge-logs unmerge-orphans userfetch userpriv usersandbox usersync xattr" >FFLAGS="-O2 -march=x86-64 -pipe -pipe -frecord-gcc-switches -fno-diagnostics-color -fmessage-length=0" >GENTOO_MIRRORS="http://mirror.leaseweb.com/gentoo/ http://ftp.snt.utwente.nl/pub/os/linux/gentoo/ http://ftp.belnet.be/pub/rsync.gentoo.org/gentoo/ http://distfiles.gentoo.org" >LANG="en_US.utf8" >LDFLAGS="-Wl,-O1 -Wl,--as-needed -Wl,-z,pack-relative-relocs -Wl,--defsym=__gentoo_check_ldflags__=0" >LEX="flex" >MAKEOPTS="-j63" >PKGDIR="/root/tbci/binpkg" >PORTAGE_CONFIGROOT="/" >PORTAGE_RSYNC_OPTS="--recursive --links --safe-links --perms --times --omit-dir-times --compress --force --whole-file --delete --stats --human-readable --timeout=180 --exclude=/distfiles --exclude=/local --exclude=/packages --exclude=/.git" >PORTAGE_TMPDIR="/var/tmp" >SHELL="/bin/bash" >USE="acl amd64 bzip2 cet crypt debug elogind gdbm iconv ipv6 jumbo-build libtirpc multilib native-symlinks ncurses nls openmp pam pcre readline seccomp split-usr ssl test test-rust unicode xattr zlib" ABI_X86="64" ELIBC="glibc" KERNEL="linux" >Unset: ADDR2LINE, AR, ARFLAGS, AS, ASFLAGS, CC, CCLD, CONFIG_SHELL, CPP, CPPFLAGS, CTARGET, CXX, CXXFILT, ELFEDIT, EXTRA_ECONF, F77FLAGS, FC, GCOV, GPROF, INSTALL_MASK, LC_ALL, LD, LFLAGS, LIBTOOL, LINGUAS, MAKE, MAKEFLAGS, NM, OBJCOPY, OBJDUMP, PORTAGE_BINHOST, PORTAGE_BUNZIP2_COMMAND, PORTAGE_COMPRESS, PORTAGE_COMPRESS_FLAGS, PORTAGE_RSYNC_EXTRA_OPTS, PYTHONPATH, RANLIB, READELF, RUSTFLAGS, SIZE, STRINGS, STRIP, YACC, YFLAGS > > > > > >############################## ># emerge history (qlop -mv): # >############################## >2024-06-04T17:44:45 >>> acct-group/mail-0-r3 >2024-06-04T17:44:45 >>> app-eselect/eselect-ctags-1.19 >2024-06-04T17:44:55 >>> app-eselect/eselect-emacs-1.19 >2024-06-04T17:44:55 >>> net-libs/liblockfile-1.17 >2024-06-04T17:45:09 >>> app-emacs/emacs-common-1.10 >2024-06-04T17:45:17 >>> app-editors/emacs-29.3-r2 >2024-06-04T17:46:37 >>> app-emacs/clojure-mode-5.19.0 >2024-06-04T17:46:38 >>> app-emacs/queue-0.2 >2024-06-04T17:46:38 >>> app-emacs/sesman-0.3.4 >2024-06-04T17:46:39 >>> app-emacs/spinner-1.7.4 >2024-06-04T17:46:39 >>> app-emacs/buttercup-1.35 >2024-06-04T17:46:40 >>> app-emacs/parseclj-1.1.1 >2024-06-04T17:47:03 >>> app-emacs/parseedn-1.2.1 > > > > >####################################### ># installed packages (qlist -ICvUSS): # >####################################### >acct-group/audio-0-r3:0 >acct-group/cdrom-0-r3:0 >acct-group/dialout-0-r3:0 >acct-group/disk-0-r3:0 >acct-group/floppy-0-r1:0 >acct-group/input-0-r3:0 >acct-group/kmem-0-r3:0 >acct-group/kvm-0-r3:0 >acct-group/lp-0-r3:0 >acct-group/mail-0-r3:0 >acct-group/man-0-r3:0 >acct-group/messagebus-0-r3:0 >acct-group/polkitd-0-r3:0 >acct-group/portage-0-r2:0 >acct-group/render-0-r3:0 >acct-group/root-0-r2:0 >acct-group/sgx-0-r2:0 >acct-group/sshd-0-r3:0 >acct-group/tape-0-r3:0 >acct-group/tty-0-r3:0 >acct-group/usb-0-r3:0 >acct-group/video-0-r3:0 >acct-user/man-1-r3:0 >acct-user/messagebus-0-r3:0 >acct-user/polkitd-0-r3:0 >acct-user/portage-0-r3:0 >acct-user/sshd-0-r3:0 >app-admin/eselect-1.4.27-r1:0 -doc -emacs -vim-syntax >app-admin/perl-cleaner-2.31-r2:0 -pkgcore >app-alternatives/awk-4:0 -busybox gawk -mawk -nawk split-usr >app-alternatives/bc-0:0 -gh gnu >app-alternatives/bzip2-1:0 -lbzip2 -pbzip2 reference split-usr >app-alternatives/cpio-0:0 gnu -libarchive split-usr >app-alternatives/gzip-1:0 -pigz reference split-usr >app-alternatives/lex-0-r1:0 flex -reflex >app-alternatives/ninja-1:0 reference -samurai >app-alternatives/sh-0:0 bash -busybox -dash -ksh -lksh -mksh >app-alternatives/tar-0:0 gnu -libarchive split-usr >app-alternatives/yacc-1-r2:0 bison -byacc -reference >app-arch/bzip2-1.0.8-r5:0/1 -abi_mips_n32 -abi_mips_n64 -abi_mips_o32 -abi_s390_32 -abi_s390_64 -abi_x86_32 abi_x86_64 -abi_x86_x32 -static -static-libs -verify-sig >app-arch/cpio-2.15:0 nls >app-arch/gzip-1.13:0 -pic -static -verify-sig >app-arch/libarchive-3.7.4:0/13 -abi_mips_n32 -abi_mips_n64 -abi_mips_o32 -abi_s390_32 -abi_s390_64 -abi_x86_32 abi_x86_64 -abi_x86_x32 acl -blake2 bzip2 e2fsprogs -expat iconv -lz4 lzma -lzo -nettle -static-libs -test -verify-sig xattr zstd >app-arch/tar-1.35:0 acl -minimal nls -selinux -verify-sig xattr >app-arch/unzip-6.0_p27-r1:0 bzip2 -natspec unicode >app-arch/xz-utils-5.6.2:0 -abi_mips_n32 -abi_mips_n64 -abi_mips_o32 -abi_s390_32 -abi_s390_64 -abi_x86_32 abi_x86_64 -abi_x86_x32 -cpu_flags_arm_crc32 -doc extra-filters nls -pgo -static-libs -verify-sig >app-arch/zstd-1.5.6:0/1 -abi_mips_n32 -abi_mips_n64 -abi_mips_o32 -abi_s390_32 -abi_s390_64 -abi_x86_32 abi_x86_64 -abi_x86_x32 -lz4 lzma -static-libs -test zlib >app-crypt/gnupg-2.4.5:0 bzip2 -doc -ldap nls readline -selinux smartcard ssl -test tofu -tools -tpm -usb -user-socket -verify-sig -wks-server >app-crypt/gpgme-1.23.2:1/11.6.15.2 -common-lisp cxx debug -python python_targets_python3_10 python_targets_python3_11 python_targets_python3_12 -qt5 -qt6 -static-libs -test -verify-sig >app-crypt/libb2-0.98.1-r3:0 -abi_mips_n32 -abi_mips_n64 -abi_mips_o32 -abi_s390_32 -abi_s390_64 -abi_x86_32 abi_x86_64 -abi_x86_x32 -native-cflags openmp -static-libs >app-crypt/libmd-1.1.0:0 -abi_mips_n32 -abi_mips_n64 -abi_mips_o32 -abi_s390_32 -abi_s390_64 -abi_x86_32 abi_x86_64 -abi_x86_x32 >app-crypt/pinentry-1.3.0-r2:0 -X -caps -efl -emacs -gtk -keyring ncurses -qt5 -qt6 -verify-sig -wayland >app-crypt/rhash-1.4.4-r1:0/1 -abi_mips_n32 -abi_mips_n64 -abi_mips_o32 -abi_s390_32 -abi_s390_64 -abi_x86_32 abi_x86_64 -abi_x86_x32 debug nls ssl -static-libs >app-editors/emacs-29.3-r2:29 X -Xaw3d acl -alsa -aqua -athena -cairo -dbus -dynamic-loading -games -gfile -gif gmp -gpm -gsettings -gtk -gui -gzip-el -harfbuzz -imagemagick inotify -jit -jpeg -json -kerberos -lcms -libxml2 -livecd -m17n-lib -mailutils -motif -png -selinux -sound -source -sqlite ssl -svg -systemd threads -tiff -toolkit-scroll-bars -tree-sitter -valgrind -webp -wide-int -xft xpm -xwidgets zlib >app-editors/nano-8.0:0 -debug -justify -magic -minimal ncurses nls spell -static unicode >app-emacs/buttercup-1.35:0 >app-emacs/clojure-mode-5.19.0:0 -test >app-emacs/emacs-common-1.10:0 -games -gsettings -gui >app-emacs/parseclj-1.1.1:0 -test >app-emacs/parseedn-1.2.1:0 -test >app-emacs/queue-0.2:0 >app-emacs/sesman-0.3.4:0 >app-emacs/spinner-1.7.4:0 >app-eselect/eselect-ctags-1.19:0 >app-eselect/eselect-emacs-1.19:0 >app-eselect/eselect-fontconfig-20220403:0 >app-eselect/eselect-iptables-20220320:0 >app-eselect/eselect-lib-bin-symlink-0.1.1-r1:0 >app-eselect/eselect-pinentry-0.7.4:0 >app-i18n/man-pages-ja-20180315-r2:0 >app-i18n/man-pages-l10n-4.19.0:0 l10n_cs l10n_da l10n_de l10n_el l10n_es l10n_fi l10n_fr l10n_hu l10n_id l10n_it l10n_mk l10n_nb l10n_nl l10n_pl l10n_pt-BR l10n_ro l10n_ru l10n_sr l10n_sv l10n_uk l10n_vi >app-i18n/man-pages-zh_CN-1.6.4.0:0 >app-misc/ca-certificates-20240203.3.98:0 -cacert >app-misc/editor-wrapper-4-r1:0 >app-misc/mime-types-2.1.54:0 -nginx >app-misc/pax-utils-1.3.7:0 -caps -man -python -python_single_target_python3_10 -python_single_target_python3_11 python_single_target_python3_12 -seccomp -test >app-misc/tmux-3.4-r1:0 debug -selinux -systemd -utempter -vim-syntax >app-portage/eix-0.36.7-r1:0 debug -doc nls -sqlite >app-portage/elt-patches-20240512:0 >app-portage/gemato-20.5:0 gpg -pretty-log python_targets_pypy3 python_targets_python3_10 python_targets_python3_11 python_targets_python3_12 -python_targets_python3_13 -test -tools >app-portage/gentoolkit-0.6.7:0 python_targets_pypy3 python_targets_python3_10 python_targets_python3_11 python_targets_python3_12 -test >app-portage/getuto-1.11:0 -test >app-portage/portage-utils-0.97:0 openmp qmanifest -static >app-shells/bash-5.2_p26-r3:0 -afs -bashlogger -examples -mem-scramble net nls -pgo -plugins readline -verify-sig >app-shells/bash-completion-2.14.0:0 eselect -test >app-shells/gentoo-bashcomp-20240525:0 >app-shells/push-3.4:0 >app-shells/quoter-4.2:0 >app-text/ansifilter-2.20:0 -gui -verify-sig >app-text/asciidoc-10.2.0:0 -python_single_target_pypy3 -python_single_target_python3_10 -python_single_target_python3_11 python_single_target_python3_12 >app-text/build-docbook-catalog-2.4:0 >app-text/docbook-xml-dtd-4.5-r2:4.5 >app-text/docbook-xml-dtd-4.4-r3:4.4 >app-text/docbook-xml-dtd-4.2-r3:4.2 >app-text/docbook-xml-dtd-4.1.2-r7:4.1.2 >app-text/docbook-xsl-ns-stylesheets-1.79.1:0 -ruby >app-text/docbook-xsl-stylesheets-1.79.1-r4:0 -ruby >app-text/manpager-1:0 >app-text/opensp-1.5.2-r10:0 -doc nls -static-libs -test >app-text/po4a-0.72:0 -perl_features_debug -perl_features_ithreads -perl_features_quadmath -test -test >app-text/sgml-common-0.6.3-r7:0 >app-text/xmlto-0.0.28-r11:0 -latex text >dev-build/autoconf-2.72-r1:2.72 -emacs -verify-sig >dev-build/autoconf-archive-2023.02.20:0 >dev-build/autoconf-wrapper-20231224:0 >dev-build/automake-1.16.5-r2:1.16 -test >dev-build/automake-wrapper-20221207:0 >dev-build/cmake-3.29.3:0 -dap -doc -gui ncurses -qt6 -test -test -verify-sig >dev-build/gtk-doc-am-1.33.2:0 >dev-build/libtool-2.4.7-r4:2 -vanilla >dev-build/make-4.4.1-r1:0 -doc -guile nls -static -test -verify-sig >dev-build/meson-1.4.1:0 python_targets_pypy3 python_targets_python3_10 python_targets_python3_11 python_targets_python3_12 -test -verify-sig >dev-build/meson-format-array-0:0 python_targets_python3_10 python_targets_python3_11 python_targets_python3_12 >dev-build/ninja-1.11.1-r5:0 -doc -test >dev-db/sqlite-3.46.0:3 -abi_mips_n32 -abi_mips_n64 -abi_mips_o32 -abi_s390_32 -abi_s390_64 -abi_x86_32 abi_x86_64 -abi_x86_x32 debug -doc -icu readline -secure-delete -static-libs -tcl -test -tools >dev-lang/duktape-2.7.0-r3:0/2.7.0 >dev-lang/perl-5.38.2-r6:0/5.38 -berkdb -doc gdbm -minimal -perl_features_debug -perl_features_ithreads -perl_features_quadmath >dev-lang/python-3.12.3-r1:3.12 -bluetooth -build debug ensurepip -examples gdbm -libedit ncurses -pgo readline sqlite ssl -test -tk -valgrind -verify-sig >dev-lang/python-3.11.9-r1:3.11 -bluetooth -build debug ensurepip -examples gdbm -libedit ncurses -pgo readline sqlite ssl -test -tk -valgrind -verify-sig >dev-lang/python-3.10.14_p1-r1:3.10 -bluetooth -build debug ensurepip -examples gdbm -libedit ncurses -pgo readline sqlite ssl -test -tk -valgrind -verify-sig >dev-lang/python-exec-2.4.10:2 native-symlinks python_targets_pypy3 python_targets_python3_10 python_targets_python3_11 python_targets_python3_12 python_targets_python3_13 -test >dev-lang/python-exec-conf-2.4.6:2 python_targets_pypy3 python_targets_python3_10 python_targets_python3_11 python_targets_python3_12 -python_targets_python3_13 >dev-lang/tcl-8.6.14:0/8.6 -abi_mips_n32 -abi_mips_n64 -abi_mips_o32 -abi_s390_32 -abi_s390_64 -abi_x86_32 abi_x86_64 -abi_x86_x32 debug threads >dev-libs/boehm-gc-8.2.6:0 -abi_mips_n32 -abi_mips_n64 -abi_mips_o32 -abi_s390_32 -abi_s390_64 abi_x86_32 abi_x86_64 -abi_x86_x32 -cxx large -static-libs threads >dev-libs/elfutils-0.191:0 -abi_mips_n32 -abi_mips_n64 -abi_mips_o32 -abi_s390_32 -abi_s390_64 -abi_x86_32 abi_x86_64 -abi_x86_x32 bzip2 -debuginfod -lzma nls -static-libs -test utils -verify-sig -zstd >dev-libs/expat-2.6.2:0 -abi_mips_n32 -abi_mips_n64 -abi_mips_o32 -abi_s390_32 -abi_s390_64 -abi_x86_32 abi_x86_64 -abi_x86_x32 -examples -static-libs -test unicode >dev-libs/glib-2.78.6:2 -abi_mips_n32 -abi_mips_n64 -abi_mips_o32 -abi_s390_32 -abi_s390_64 -abi_x86_32 abi_x86_64 -abi_x86_x32 -dbus debug elf -gtk-doc mime -selinux -static-libs -sysprof -systemtap -test -utils xattr >dev-libs/gmp-6.3.0-r1:0/10.4 -abi_mips_n32 -abi_mips_n64 -abi_mips_o32 -abi_s390_32 -abi_s390_64 -abi_x86_32 abi_x86_64 -abi_x86_x32 asm cpudetection cxx -doc -pic -static-libs >dev-libs/gobject-introspection-1.78.1:0 -doctool -gtk-doc -python_single_target_python3_10 -python_single_target_python3_11 python_single_target_python3_12 -test >dev-libs/gobject-introspection-common-1.78.1:0 >dev-libs/isl-0.26:0/23 -abi_mips_n32 -abi_mips_n64 -abi_mips_o32 -abi_s390_32 -abi_s390_64 -abi_x86_32 abi_x86_64 -abi_x86_x32 -static-libs >dev-libs/jsoncpp-1.9.5:0/25 -doc -test >dev-libs/libassuan-2.5.7:0 -verify-sig >dev-libs/libatomic_ops-7.8.2:0 -abi_mips_n32 -abi_mips_n64 -abi_mips_o32 -abi_s390_32 -abi_s390_64 abi_x86_32 abi_x86_64 -abi_x86_x32 >dev-libs/libevent-2.1.12-r1:0/2.1-7 -abi_mips_n32 -abi_mips_n64 -abi_mips_o32 -abi_s390_32 -abi_s390_64 -abi_x86_32 abi_x86_64 -abi_x86_x32 clock-gettime debug -malloc-replacement ssl -static-libs -test -verbose-debug -verify-sig >dev-libs/libffi-3.4.6:0/8 -abi_mips_n32 -abi_mips_n64 -abi_mips_o32 -abi_s390_32 -abi_s390_64 -abi_x86_32 abi_x86_64 -abi_x86_x32 debug -exec-static-trampoline -pax-kernel -static-libs -test >dev-libs/libgcrypt-1.10.3-r2:0/20 -abi_mips_n32 -abi_mips_n64 -abi_mips_o32 -abi_s390_32 -abi_s390_64 -abi_x86_32 abi_x86_64 -abi_x86_x32 asm -cpu_flags_arm_aes -cpu_flags_arm_neon -cpu_flags_arm_sha1 -cpu_flags_arm_sha2 -cpu_flags_ppc_altivec -cpu_flags_ppc_vsx2 -cpu_flags_ppc_vsx3 cpu_flags_x86_aes cpu_flags_x86_avx cpu_flags_x86_avx2 -cpu_flags_x86_padlock -cpu_flags_x86_sha cpu_flags_x86_sse4_1 -doc getentropy -static-libs -verify-sig >dev-libs/libgpg-error-1.49:0 -abi_mips_n32 -abi_mips_n64 -abi_mips_o32 -abi_s390_32 -abi_s390_64 -abi_x86_32 abi_x86_64 -abi_x86_x32 -common-lisp nls -static-libs -test -verify-sig >dev-libs/libksba-1.6.6:0 -static-libs -verify-sig >dev-libs/libpcre2-10.43:0/3 -abi_mips_n32 -abi_mips_n64 -abi_mips_o32 -abi_s390_32 -abi_s390_64 -abi_x86_32 abi_x86_64 -abi_x86_x32 bzip2 jit -libedit pcre16 pcre32 readline -static-libs unicode -valgrind -verify-sig zlib >dev-libs/libpipeline-1.5.7:0 -test >dev-libs/libtasn1-4.19.0:0/6 -abi_mips_n32 -abi_mips_n64 -abi_mips_o32 -abi_s390_32 -abi_s390_64 -abi_x86_32 abi_x86_64 -abi_x86_x32 -static-libs -test -verify-sig >dev-libs/libunistring-1.2:0/5 -abi_mips_n32 -abi_mips_n64 -abi_mips_o32 -abi_s390_32 -abi_s390_64 -abi_x86_32 abi_x86_64 -abi_x86_x32 -doc -static-libs >dev-libs/libuv-1.48.0:0/1 -verify-sig >dev-libs/libxml2-2.12.7:2 -abi_mips_n32 -abi_mips_n64 -abi_mips_o32 -abi_s390_32 -abi_s390_64 -abi_x86_32 abi_x86_64 -abi_x86_x32 -debug -examples ftp -icu -lzma python python_targets_python3_10 python_targets_python3_11 python_targets_python3_12 readline -static-libs -test >dev-libs/libxslt-1.1.39:0 -abi_mips_n32 -abi_mips_n64 -abi_mips_o32 -abi_s390_32 -abi_s390_64 -abi_x86_32 abi_x86_64 -abi_x86_x32 crypt debug -examples -python python_targets_python3_10 python_targets_python3_11 python_targets_python3_12 -static-libs >dev-libs/lzo-2.10:2 -abi_mips_n32 -abi_mips_n64 -abi_mips_o32 -abi_s390_32 -abi_s390_64 -abi_x86_32 abi_x86_64 -abi_x86_x32 -examples split-usr -static-libs >dev-libs/mpc-1.3.1:0/3 -abi_mips_n32 -abi_mips_n64 -abi_mips_o32 -abi_s390_32 -abi_s390_64 -abi_x86_32 abi_x86_64 -abi_x86_x32 -static-libs >dev-libs/mpdecimal-4.0.0:4 -cxx -test >dev-libs/mpfr-4.2.1:0/6 -abi_mips_n32 -abi_mips_n64 -abi_mips_o32 -abi_s390_32 -abi_s390_64 -abi_x86_32 abi_x86_64 -abi_x86_x32 -static-libs -verify-sig >dev-libs/nettle-3.9.1:0/8-6 -abi_mips_n32 -abi_mips_n64 -abi_mips_o32 -abi_s390_32 -abi_s390_64 -abi_x86_32 abi_x86_64 -abi_x86_x32 asm -cpu_flags_arm_aes -cpu_flags_arm_neon -cpu_flags_arm_sha1 -cpu_flags_arm_sha2 -cpu_flags_ppc_altivec -cpu_flags_ppc_vsx2 -cpu_flags_ppc_vsx3 cpu_flags_x86_aes cpu_flags_x86_pclmul -cpu_flags_x86_sha -doc gmp -static-libs -verify-sig >dev-libs/npth-1.7-r1:0 -test >dev-libs/openssl-3.2.1-r2:0/3 -abi_mips_n32 -abi_mips_n64 -abi_mips_o32 -abi_s390_32 -abi_s390_64 -abi_x86_32 abi_x86_64 -abi_x86_x32 asm cpu_flags_x86_sse2 -fips -ktls -rfc3779 -sctp -static-libs -test -tls-compression -vanilla -verify-sig -verify-sig -weak-ssl-ciphers >dev-libs/popt-1.19-r1:0 -abi_mips_n32 -abi_mips_n64 -abi_mips_o32 -abi_s390_32 -abi_s390_64 -abi_x86_32 abi_x86_64 -abi_x86_x32 nls -static-libs >dev-perl/Encode-EUCJPASCII-0.30.0-r1:0 -perl_features_debug -perl_features_ithreads -perl_features_quadmath -test >dev-perl/Encode-HanExtra-0.230.0-r3:0 -perl_features_debug -perl_features_ithreads -perl_features_quadmath >dev-perl/Encode-Locale-1.50.0-r1:0 -perl_features_debug -perl_features_ithreads -perl_features_quadmath -test >dev-perl/ExtUtils-CChecker-0.120.0-r1:0 -perl_features_debug -perl_features_ithreads -perl_features_quadmath -test >dev-perl/File-BaseDir-0.90.0:0 -perl_features_debug -perl_features_ithreads -perl_features_quadmath -test >dev-perl/File-DesktopEntry-0.220.0-r1:0 -perl_features_debug -perl_features_ithreads -perl_features_quadmath -test >dev-perl/File-MimeInfo-0.330.0:0 -perl_features_debug -perl_features_ithreads -perl_features_quadmath -test >dev-perl/IO-Socket-SSL-2.85.0:0 -examples -idn -perl_features_debug -perl_features_ithreads -perl_features_quadmath -test >dev-perl/IPC-System-Simple-1.300.0:0 -perl_features_debug -perl_features_ithreads -perl_features_quadmath -test >dev-perl/Locale-gettext-1.70.0-r1:0 -perl_features_debug -perl_features_ithreads -perl_features_quadmath -test >dev-perl/MIME-Charset-1.13.1:0 l10n_ja l10n_zh -perl_features_debug -perl_features_ithreads -perl_features_quadmath -test >dev-perl/Module-Build-0.423.400:0 -perl_features_debug -perl_features_ithreads -perl_features_quadmath -test >dev-perl/Mozilla-CA-20999999-r1:0 -perl_features_debug -perl_features_ithreads -perl_features_quadmath -test >dev-perl/Net-SSLeay-1.940.0:0 -examples -examples -minimal -perl_features_debug -perl_features_ithreads -perl_features_quadmath -test >dev-perl/Pod-Parser-1.660.0:0 -perl_features_debug -perl_features_ithreads -perl_features_quadmath -test >dev-perl/Regexp-IPv6-0.30.0-r2:0 -perl_features_debug -perl_features_ithreads -perl_features_quadmath -test >dev-perl/SGMLSpm-1.1-r2:0 -perl_features_debug -perl_features_ithreads -perl_features_quadmath -test >dev-perl/Syntax-Keyword-Try-0.290.0-r1:0 -perl_features_debug -perl_features_ithreads -perl_features_quadmath -test >dev-perl/TermReadKey-2.380.0-r1:0 -examples -perl_features_debug -perl_features_ithreads -perl_features_quadmath -test >dev-perl/Text-CharWidth-0.40.0-r2:0 -perl_features_debug -perl_features_ithreads -perl_features_quadmath -test >dev-perl/Text-WrapI18N-0.60.0-r2:0 -perl_features_debug -perl_features_ithreads -perl_features_quadmath -test >dev-perl/Unicode-LineBreak-2019.1.0:0 -perl_features_debug -perl_features_ithreads -perl_features_quadmath >dev-perl/URI-5.280.0:0 -perl_features_debug -perl_features_ithreads -perl_features_quadmath -test >dev-perl/XS-Parse-Keyword-0.420.0-r1:0 -perl_features_debug -perl_features_ithreads -perl_features_quadmath -test >dev-perl/YAML-Tiny-1.740.0:0 -minimal -perl_features_debug -perl_features_ithreads -perl_features_quadmath -test >dev-python/backports-tarfile-1.2.0:0 python_targets_pypy3 python_targets_python3_10 python_targets_python3_11 -test >dev-python/certifi-3021.3.16-r4:0 python_targets_pypy3 python_targets_python3_10 python_targets_python3_11 python_targets_python3_12 -python_targets_python3_13 -test >dev-python/charset-normalizer-3.3.2:0 python_targets_pypy3 python_targets_python3_10 python_targets_python3_11 python_targets_python3_12 -python_targets_python3_13 -test >dev-python/cython-3.0.10:0 debug -doc python_targets_pypy3 python_targets_python3_10 python_targets_python3_11 python_targets_python3_12 -python_targets_python3_13 -test >dev-python/editables-0.5:0 python_targets_pypy3 python_targets_python3_10 python_targets_python3_11 python_targets_python3_12 -python_targets_python3_13 -test >dev-python/ensurepip-pip-24.0:0 >dev-python/ensurepip-setuptools-70.0.0:0 >dev-python/ensurepip-wheels-100:0 >dev-python/flit-core-3.9.0:0 python_targets_pypy3 python_targets_python3_10 python_targets_python3_11 python_targets_python3_12 -python_targets_python3_13 -test >dev-python/gentoo-common-1:0 >dev-python/gpep517-16:0 python_targets_pypy3 python_targets_python3_10 python_targets_python3_11 python_targets_python3_12 -python_targets_python3_13 -test >dev-python/hatchling-1.24.2:0 python_targets_pypy3 python_targets_python3_10 python_targets_python3_11 python_targets_python3_12 -python_targets_python3_13 -test >dev-python/idna-3.7:0 python_targets_pypy3 python_targets_python3_10 python_targets_python3_11 python_targets_python3_12 -python_targets_python3_13 -test >dev-python/installer-0.7.0:0 python_targets_pypy3 python_targets_python3_10 python_targets_python3_11 python_targets_python3_12 -python_targets_python3_13 -test >dev-python/jaraco-context-5.3.0:0 python_targets_pypy3 python_targets_python3_10 python_targets_python3_11 python_targets_python3_12 -python_targets_python3_13 -test >dev-python/jaraco-functools-4.0.1:0 python_targets_pypy3 python_targets_python3_10 python_targets_python3_11 python_targets_python3_12 -python_targets_python3_13 -test >dev-python/jaraco-text-3.12.0:0 python_targets_pypy3 python_targets_python3_10 python_targets_python3_11 python_targets_python3_12 -python_targets_python3_13 -test >dev-python/jinja-3.1.4:0 -doc python_targets_pypy3 python_targets_python3_10 python_targets_python3_11 python_targets_python3_12 -python_targets_python3_13 -test >dev-python/lxml-5.2.2:0 debug -doc -examples python_targets_pypy3 python_targets_python3_10 python_targets_python3_11 python_targets_python3_12 -python_targets_python3_13 -test threads >dev-python/markupsafe-2.1.5:0 debug python_targets_pypy3 python_targets_python3_10 python_targets_python3_11 python_targets_python3_12 -python_targets_python3_13 -test >dev-python/more-itertools-10.2.0:0 -doc python_targets_pypy3 python_targets_python3_10 python_targets_python3_11 python_targets_python3_12 -python_targets_python3_13 -test >dev-python/ordered-set-4.1.0:0 python_targets_pypy3 python_targets_python3_10 python_targets_python3_11 python_targets_python3_12 -python_targets_python3_13 -test >dev-python/packaging-24.0:0 python_targets_pypy3 python_targets_python3_10 python_targets_python3_11 python_targets_python3_12 -python_targets_python3_13 -test >dev-python/pathspec-0.12.1:0 python_targets_pypy3 python_targets_python3_10 python_targets_python3_11 python_targets_python3_12 -python_targets_python3_13 -test >dev-python/platformdirs-4.2.2:0 python_targets_pypy3 python_targets_python3_10 python_targets_python3_11 python_targets_python3_12 -python_targets_python3_13 -test >dev-python/pluggy-1.5.0:0 python_targets_pypy3 python_targets_python3_10 python_targets_python3_11 python_targets_python3_12 -python_targets_python3_13 -test >dev-python/pypy3-7.3.16:0/pypy310-pp73-384 gdbm ncurses sqlite -tk >dev-python/pypy3_10-7.3.16:0/pypy310-pp73-384 ensurepip gdbm jit ncurses sqlite -tk >dev-python/pypy3_10-exe-bin-7.3.16:7.3.16 >dev-python/PySocks-1.7.1-r2:0 python_targets_pypy3 python_targets_python3_10 python_targets_python3_11 python_targets_python3_12 -python_targets_python3_13 >dev-python/requests-2.32.3:0 python_targets_pypy3 python_targets_python3_10 python_targets_python3_11 python_targets_python3_12 -python_targets_python3_13 -socks5 -test test-rust >dev-python/setuptools-70.0.0:0 python_targets_pypy3 python_targets_python3_10 python_targets_python3_11 python_targets_python3_12 -python_targets_python3_13 -test >dev-python/setuptools-scm-8.1.0:0 python_targets_pypy3 python_targets_python3_10 python_targets_python3_11 python_targets_python3_12 -python_targets_python3_13 -test >dev-python/tomli-2.0.1-r1:0 python_targets_pypy3 python_targets_python3_10 python_targets_python3_11 python_targets_python3_12 -python_targets_python3_13 -test >dev-python/trove-classifiers-2024.5.22:0 python_targets_pypy3 python_targets_python3_10 python_targets_python3_11 python_targets_python3_12 -python_targets_python3_13 -test >dev-python/urllib3-2.2.1:0 -brotli -http2 python_targets_pypy3 python_targets_python3_10 python_targets_python3_11 python_targets_python3_12 -python_targets_python3_13 -test -zstd >dev-python/wheel-0.43.0:0 python_targets_pypy3 python_targets_python3_10 python_targets_python3_11 python_targets_python3_12 -python_targets_python3_13 -test >dev-util/checkbashisms-2.23.5:0 >dev-util/desktop-file-utils-0.27-r1:0 >dev-util/glib-utils-2.78.6:0 -python_single_target_python3_10 -python_single_target_python3_11 python_single_target_python3_12 >dev-util/gperf-3.1-r2:0 >dev-util/pkgconf-2.2.0:0/5 -abi_mips_n32 -abi_mips_n64 -abi_mips_o32 -abi_s390_32 -abi_s390_64 -abi_x86_32 abi_x86_64 -abi_x86_x32 native-symlinks -test >dev-util/re2c-3.1:0 debug -test >dev-vcs/git-2.45.2:0 blksha1 -cgi curl -cvs -doc gpg -highlight iconv -keyring -mediawiki nls pcre -perforce -perl -python_single_target_python3_10 -python_single_target_python3_11 python_single_target_python3_12 safe-directory -selinux -subversion -test -tk webdav -xinetd >media-fonts/liberation-fonts-2.1.5:0 -X -X -fontforge >media-gfx/graphite2-1.3.14_p20210810-r3:0 -abi_mips_n32 -abi_mips_n64 -abi_mips_o32 -abi_s390_32 -abi_s390_64 -abi_x86_32 abi_x86_64 -abi_x86_x32 -perl -test >media-libs/fontconfig-2.15.0:1.0 -abi_mips_n32 -abi_mips_n64 -abi_mips_o32 -abi_s390_32 -abi_s390_64 -abi_x86_32 abi_x86_64 -abi_x86_x32 -doc nls -test >media-libs/freetype-2.13.2:2 -X -abi_mips_n32 -abi_mips_n64 -abi_mips_o32 -abi_s390_32 -abi_s390_64 -abi_x86_32 abi_x86_64 -abi_x86_x32 adobe-cff -brotli bzip2 cleartype-hinting debug -doc -fontforge harfbuzz png -static-libs -svg -utils >media-libs/harfbuzz-8.4.0:0/6.0.0 -abi_mips_n32 -abi_mips_n64 -abi_mips_o32 -abi_s390_32 -abi_s390_64 -abi_x86_32 abi_x86_64 -abi_x86_x32 cairo debug -doc -experimental glib graphite -icu introspection -test truetype >media-libs/libpng-1.6.43:0/16 -abi_mips_n32 -abi_mips_n64 -abi_mips_o32 -abi_s390_32 -abi_s390_64 -abi_x86_32 abi_x86_64 -abi_x86_x32 -apng -cpu_flags_arm_neon cpu_flags_x86_sse -static-libs -test >net-dns/c-ares-1.29.0:0/2 -abi_mips_n32 -abi_mips_n64 -abi_mips_o32 -abi_s390_32 -abi_s390_64 -abi_x86_32 abi_x86_64 -abi_x86_x32 -static-libs -test -verify-sig >net-dns/libidn2-2.3.7:0/2 -abi_mips_n32 -abi_mips_n64 -abi_mips_o32 -abi_s390_32 -abi_s390_64 -abi_x86_32 abi_x86_64 -abi_x86_x32 nls -static-libs -verify-sig >net-firewall/iptables-1.8.10-r1:0/1.8.3 -conntrack -netlink -nftables -pcap -static-libs -test >net-libs/gnutls-3.8.5-r1:0/30.30 -abi_mips_n32 -abi_mips_n64 -abi_mips_o32 -abi_s390_32 -abi_s390_64 -abi_x86_32 abi_x86_64 -abi_x86_x32 -brotli cxx -dane -doc -examples idn nls openssl -pkcs11 seccomp -sslv2 -sslv3 -static-libs -test -test-full tls-heartbeat -tools -verify-sig zlib -zstd >net-libs/liblockfile-1.17:0 -static-libs >net-libs/libmnl-1.0.5:0/0.2.0 -examples -verify-sig >net-libs/libnsl-2.0.1:0/3 -abi_mips_n32 -abi_mips_n64 -abi_mips_o32 -abi_s390_32 -abi_s390_64 -abi_x86_32 abi_x86_64 -abi_x86_x32 -static-libs >net-libs/libpsl-0.21.5:0 -abi_mips_n32 -abi_mips_n64 -abi_mips_o32 -abi_s390_32 -abi_s390_64 -abi_x86_32 abi_x86_64 -abi_x86_x32 -icu idn -test >net-libs/libtirpc-1.3.4-r2:0/3 -abi_mips_n32 -abi_mips_n64 -abi_mips_o32 -abi_s390_32 -abi_s390_64 -abi_x86_32 abi_x86_64 -abi_x86_x32 -kerberos -static-libs >net-libs/nghttp2-1.62.1:0/1.14 -abi_mips_n32 -abi_mips_n64 -abi_mips_o32 -abi_s390_32 -abi_s390_64 -abi_x86_32 abi_x86_64 -abi_x86_x32 debug -hpack-tools -jemalloc -static-libs -systemd -test -utils -xml >net-misc/curl-8.8.0-r1:0 -abi_mips_n32 -abi_mips_n64 -abi_mips_o32 -abi_s390_32 -abi_s390_64 -abi_x86_32 abi_x86_64 -abi_x86_x32 adns alt-svc -brotli -curl_ssl_gnutls -curl_ssl_mbedtls curl_ssl_openssl -curl_ssl_rustls debug ftp -gnutls -gopher hsts http2 -idn imap -kerberos -ldap -mbedtls -nghttp3 openssl pop3 progress-meter psl -rtmp -rustls -samba smtp -ssh ssl -sslv3 -static-libs -telnet -test tftp -verify-sig -websockets -zstd >net-misc/dhcpcd-10.0.8:0 debug embedded ipv6 -privsep udev >net-misc/iputils-20240117:0 arping -caps -clockdiff -doc filecaps -idn nls -test -tracepath >net-misc/netifrc-0.7.8:0 dhcp >net-misc/openssh-9.7_p1-r3:0 -abi_mips_n32 -audit -debug -kerberos -ldns -libedit -livecd pam -pie -security-key -selinux ssl -static -test -verify-sig -xmss >net-misc/rsync-3.3.0:0 acl -examples iconv -lz4 -python_single_target_python3_10 -python_single_target_python3_11 python_single_target_python3_12 -rrsync ssl -stunnel -system-zlib -verify-sig xattr -xxhash -zstd >net-misc/wget-1.24.5:0 -cookie-check debug -gnutls -idn ipv6 -libproxy -metalink nls -ntlm pcre ssl -static -test -uuid -verify-sig zlib >perl-core/Encode-3.210.0:0 -perl_features_debug -perl_features_ithreads -perl_features_quadmath >perl-core/File-Temp-0.231.100-r1:0 -perl_features_debug -perl_features_ithreads -perl_features_quadmath >perl-core/Getopt-Long-2.570.0:0 -perl_features_debug -perl_features_ithreads -perl_features_quadmath >perl-core/Math-BigInt-1.999.842:0 -examples -perl_features_debug -perl_features_ithreads -perl_features_quadmath -test >sec-keys/openpgp-keys-gentoo-release-20230329:0 -test >sys-apps/acl-2.3.2-r1:0 -abi_mips_n32 -abi_mips_n64 -abi_mips_o32 -abi_s390_32 -abi_s390_64 -abi_x86_32 abi_x86_64 -abi_x86_x32 nls -static-libs >sys-apps/attr-2.5.2-r1:0 -abi_mips_n32 -abi_mips_n64 -abi_mips_o32 -abi_s390_32 -abi_s390_64 -abi_x86_32 abi_x86_64 -abi_x86_x32 debug nls -static-libs >sys-apps/baselayout-2.15:0 -build split-usr >sys-apps/coreutils-9.5:0 acl -caps -gmp -hostname -kill -multicall nls openssl -selinux split-usr -static -test -vanilla -verify-sig xattr >sys-apps/dbus-1.15.8:0 -X -abi_mips_n32 -abi_mips_n64 -abi_mips_o32 -abi_s390_32 -abi_s390_64 -abi_x86_32 abi_x86_64 -abi_x86_x32 debug -doc elogind -selinux -static-libs -systemd -test -test -valgrind >sys-apps/diffutils-3.10:0 nls -verify-sig >sys-apps/file-5.45-r4:0 -abi_mips_n32 -abi_mips_n64 -abi_mips_o32 -abi_s390_32 -abi_s390_64 -abi_x86_32 abi_x86_64 -abi_x86_x32 bzip2 -lzip -lzma -python python_targets_python3_10 python_targets_python3_11 python_targets_python3_12 -seccomp -static-libs -verify-sig zlib -zstd >sys-apps/findutils-4.10.0:0 nls -selinux -static -test -verify-sig >sys-apps/gawk-5.3.0-r1:0 -mpfr nls -pma readline -verify-sig >sys-apps/gentoo-functions-1.6:0 -test >sys-apps/grep-3.11-r1:0 egrep-fgrep nls pcre -static -verify-sig >sys-apps/groff-1.23.0:0 -X -examples -uchardet >sys-apps/help2man-1.49.3:0 nls >sys-apps/install-xattr-0.8-r1:0 >sys-apps/iproute2-6.9.0:0 -atm -berkdb -bpf -caps -elf iptables -minimal -nfs -selinux >sys-apps/kbd-2.6.4:0 nls pam -selinux -test >sys-apps/kmod-32-r1:0 debug -doc lzma -pkcs7 split-usr -static-libs tools zlib zstd >sys-apps/less-643-r2:0 pcre -test >sys-apps/locale-gen-2.23-r1:0 >sys-apps/man-db-2.12.1:0 manpager nls seccomp -selinux -static-libs zlib >sys-apps/man-pages-6.06:0 l10n_cs l10n_da l10n_de l10n_el l10n_es l10n_fi l10n_fr l10n_hu l10n_id l10n_it l10n_ja l10n_mk l10n_nb l10n_nl l10n_pl l10n_pt-BR l10n_ro l10n_ru l10n_sr l10n_sv l10n_uk l10n_vi l10n_zh-CN -verify-sig >sys-apps/miscfiles-1.5-r4:0 -minimal >sys-apps/net-tools-2.10:0 arp hostname ipv6 -nis nls -plipconfig -selinux -slattach -static >sys-apps/openrc-0.54:0 -audit -bash debug netifrc -newnet pam -s6 -selinux -sysv-utils sysvinit unicode >sys-apps/portage-3.0.65:0 -apidoc -build -doc -gentoo-dev ipc native-extensions python_targets_pypy3 python_targets_python3_10 python_targets_python3_11 python_targets_python3_12 rsync-verify -selinux -test xattr >sys-apps/sandbox-2.38:0 -abi_mips_n32 -abi_mips_n64 -abi_mips_o32 -abi_s390_32 -abi_s390_64 abi_x86_32 abi_x86_64 -abi_x86_x32 nnp >sys-apps/sed-4.9-r1:0 acl nls -selinux -static -verify-sig >sys-apps/shadow-4.14.7:0/4 acl -audit -cracklib nls pam -selinux -skey split-usr -su -systemd -verify-sig xattr >sys-apps/systemd-utils-254.13:0 -abi_mips_n32 -abi_mips_n64 -abi_mips_o32 -abi_s390_32 -abi_s390_64 -abi_x86_32 abi_x86_64 -abi_x86_x32 acl -boot -kernel-install kmod -python_single_target_python3_10 -python_single_target_python3_11 python_single_target_python3_12 -secureboot -selinux split-usr -sysusers -test tmpfiles udev -ukify >sys-apps/sysvinit-3.09:0 -ibm nls -selinux -static -verify-sig >sys-apps/texinfo-7.1-r1:0 nls standalone -static >sys-apps/util-linux-2.40.1-r3:0 -abi_mips_n32 -abi_mips_n64 -abi_mips_o32 -abi_s390_32 -abi_s390_64 -abi_x86_32 abi_x86_64 -abi_x86_x32 -audit -build -caps cramfs -cryptsetup -fdformat hardlink -kill logger -magic ncurses nls pam -python python_targets_python3_10 python_targets_python3_11 python_targets_python3_12 readline -rtas -selinux -slang -static-libs su suid -systemd -test -tty-helpers -udev unicode -uuidd -verify-sig >sys-apps/which-2.21:0 >sys-auth/elogind-252.9:0 acl -audit cgroup-hybrid debug -doc pam policykit -selinux -test >sys-auth/pambase-20240128:0 -caps -debug elogind -gnome-keyring -homed -minimal -mktemp nullok -pam_krb5 -pam_ssh passwdqc -pwhistory -pwquality -securetty -selinux sha512 -sssd -systemd -yescrypt >sys-auth/passwdqc-2.0.3-r1:0 >sys-auth/polkit-124-r1:0 daemon duktape -examples -gtk introspection -kde pam -selinux -systemd -test >sys-devel/bc-1.07.1-r6:0 -libedit readline -static >sys-devel/binutils-2.42-r1:2.42 cet -debuginfod -doc -gold -gprofng -hardened -multitarget nls -pgo plugins -static-libs -test -vanilla zstd >sys-devel/binutils-config-5.5:0 native-symlinks >sys-devel/bison-3.8.2-r2:0 -examples nls -static -test -verify-sig >sys-devel/flex-2.6.4-r6:0 -abi_mips_n32 -abi_mips_n64 -abi_mips_o32 -abi_s390_32 -abi_s390_64 -abi_x86_32 abi_x86_64 -abi_x86_x32 nls -static -test >sys-devel/gcc-14.1.1_p20240518:14 -ada cet -custom-cflags cxx -d -debug default-stack-clash-protection default-znow -doc -fixed-point fortran -go graphite -hardened -ieee-long-double -jit -libssp lto -modula2 multilib nls -objc -objc++ -objc-gc openmp -pch -pgo pie -rust sanitize ssp -systemtap -test -valgrind -vanilla -vtv zstd >sys-devel/gcc-config-2.11:0 cc-wrappers native-symlinks >sys-devel/gettext-0.22.5:0 -abi_mips_n32 -abi_mips_n64 -abi_mips_o32 -abi_s390_32 -abi_s390_64 -abi_x86_32 abi_x86_64 -abi_x86_x32 acl cxx -doc -emacs -git -java -java ncurses nls openmp -static-libs -verify-sig xattr >sys-devel/gnuconfig-20240101:0 >sys-devel/m4-1.4.19-r2:0 -examples nls -verify-sig >sys-devel/patch-2.7.6-r5:0 -static -test -verify-sig xattr >sys-fs/e2fsprogs-1.47.0-r3:0 -abi_mips_n32 -abi_mips_n64 -abi_mips_o32 -abi_s390_32 -abi_s390_64 -abi_x86_32 abi_x86_64 -abi_x86_x32 -cron -fuse nls -static-libs -test tools >sys-fs/udev-init-scripts-35:0 >sys-kernel/dracut-102:0 -selinux -test >sys-kernel/gentoo-kernel-bin-6.1.92:6.1.92 initramfs -test >sys-kernel/installkernel-39:0 dracut -efistub -grub -refind -systemd -systemd-boot -uki -ukify >sys-kernel/linux-headers-6.9:0 -headers-only >sys-libs/gdbm-1.23:0/6 -abi_mips_n32 -abi_mips_n64 -abi_mips_o32 -abi_s390_32 -abi_s390_64 -abi_x86_32 abi_x86_64 -abi_x86_x32 berkdb nls readline -static-libs -test -verify-sig >sys-libs/glibc-2.39-r7:2.2 -audit -caps cet -compile-locales -custom-cflags -doc -gd -hash-sysv-compat -headers-only multiarch multilib -multilib-bootstrap -nscd -perl -profile -selinux ssp stack-realign static-libs -suid -systemd -systemtap -test -vanilla >sys-libs/libcap-2.70:0 -abi_mips_n32 -abi_mips_n64 -abi_mips_o32 -abi_s390_32 -abi_s390_64 -abi_x86_32 abi_x86_64 -abi_x86_x32 pam -static-libs -tools >sys-libs/libseccomp-2.5.5-r1:0 -abi_mips_n32 -abi_mips_n64 -abi_mips_o32 -abi_s390_32 -abi_s390_64 -abi_x86_32 abi_x86_64 -abi_x86_x32 debug -experimental-loong -python python_targets_python3_10 python_targets_python3_11 python_targets_python3_12 -static-libs -test >sys-libs/libxcrypt-4.4.36-r3:0/1 -abi_mips_n32 -abi_mips_n64 -abi_mips_o32 -abi_s390_32 -abi_s390_64 abi_x86_32 abi_x86_64 -abi_x86_x32 compat -headers-only -static-libs system -test >sys-libs/ncurses-6.4_p20240414:0/6 -abi_mips_n32 -abi_mips_n64 -abi_mips_o32 -abi_s390_32 -abi_s390_64 -abi_x86_32 abi_x86_64 -abi_x86_x32 -ada cxx debug -doc -gpm -minimal -profile split-usr -split-usr stack-realign -static-libs -test tinfo -trace -verify-sig >sys-libs/pam-1.6.1:0 -abi_mips_n32 -abi_mips_n64 -abi_mips_o32 -abi_s390_32 -abi_s390_64 -abi_x86_32 abi_x86_64 -abi_x86_x32 -audit -berkdb -debug -examples filecaps -nis -selinux >sys-libs/readline-8.2_p10:0/8 -abi_mips_n32 -abi_mips_n64 -abi_mips_o32 -abi_s390_32 -abi_s390_64 -abi_x86_32 abi_x86_64 -abi_x86_x32 -static-libs unicode -utils -verify-sig >sys-libs/timezone-data-2024a-r1:0 -leaps-timezone nls -zic-slim >sys-libs/zlib-1.3.1-r1:0/1 -abi_mips_n32 -abi_mips_n64 -abi_mips_o32 -abi_s390_32 -abi_s390_64 -abi_x86_32 abi_x86_64 -abi_x86_x32 minizip -static-libs -verify-sig >sys-process/procps-4.0.4-r1:0/0-ng -abi_mips_n32 -abi_mips_n64 -abi_mips_o32 -abi_s390_32 -abi_s390_64 -abi_x86_32 abi_x86_64 -abi_x86_x32 elogind kill -modern-top ncurses nls -selinux -static-libs -systemd -test unicode >sys-process/psmisc-23.7:0 -X -apparmor nls -selinux -test >virtual/acl-0-r2:0 -abi_mips_n32 -abi_mips_n64 -abi_mips_o32 -abi_s390_32 -abi_s390_64 -abi_x86_32 abi_x86_64 -abi_x86_x32 -static-libs >virtual/dev-manager-0-r2:0 >virtual/dist-kernel-6.1.92:0/6.1.92 >virtual/editor-0-r7:0 >virtual/libc-1-r1:0 >virtual/libcrypt-2-r1:0/2 -abi_mips_n32 -abi_mips_n64 -abi_mips_o32 -abi_s390_32 -abi_s390_64 abi_x86_32 abi_x86_64 -abi_x86_x32 -static-libs >virtual/libelf-3-r1:0/1 -abi_mips_n32 -abi_mips_n64 -abi_mips_o32 -abi_s390_32 -abi_s390_64 -abi_x86_32 abi_x86_64 -abi_x86_x32 >virtual/libiconv-0-r2:0 -abi_mips_n32 -abi_mips_n64 -abi_mips_o32 -abi_s390_32 -abi_s390_64 -abi_x86_32 abi_x86_64 -abi_x86_x32 >virtual/libintl-0-r2:0 -abi_mips_n32 -abi_mips_n64 -abi_mips_o32 -abi_s390_32 -abi_s390_64 -abi_x86_32 abi_x86_64 -abi_x86_x32 >virtual/libudev-251-r2:0/1 -abi_mips_n32 -abi_mips_n64 -abi_mips_o32 -abi_s390_32 -abi_s390_64 -abi_x86_32 abi_x86_64 -abi_x86_x32 -systemd >virtual/man-0-r4:0 >virtual/openssh-0:0 ssl >virtual/os-headers-0-r2:0 >virtual/package-manager-1:0 >virtual/pager-0-r1:0 >virtual/perl-bignum-0.660.0:0 >virtual/perl-Carp-1.540.0-r1:0 >virtual/perl-CPAN-2.360.0-r1:0 >virtual/perl-CPAN-Meta-2.150.10-r8:0 >virtual/perl-CPAN-Meta-YAML-0.18.0-r10:0 >virtual/perl-Data-Dumper-2.188.0:0 >virtual/perl-Encode-3.210.0-r1:0 >virtual/perl-Exporter-5.770.0-r1:0 >virtual/perl-ExtUtils-CBuilder-0.280.238:0 >virtual/perl-ExtUtils-Install-2.220.0-r1:0 >virtual/perl-ExtUtils-MakeMaker-7.700.0-r1:0 >virtual/perl-ExtUtils-Manifest-1.730.0-r2:0 >virtual/perl-ExtUtils-ParseXS-3.510.0-r1:0 >virtual/perl-File-Path-2.180.0-r3:0 >virtual/perl-File-Spec-3.880.0:0 >virtual/perl-File-Temp-0.231.100-r1:0 >virtual/perl-Getopt-Long-2.570.0-r1:0 >virtual/perl-JSON-PP-4.160.0-r2:0 >virtual/perl-libnet-3.150.0-r1:0 ssl >virtual/perl-Math-BigInt-1.999.842:0 >virtual/perl-Math-BigInt-FastCalc-0.501.300:0 >virtual/perl-Math-BigRat-0.262.400:0 >virtual/perl-Math-Complex-1.620.0-r1:0 >virtual/perl-MIME-Base64-3.160.100_rc-r1:0 >virtual/perl-Module-Metadata-1.0.37-r3:0 >virtual/perl-parent-0.241.0-r1:0 >virtual/perl-Parse-CPAN-Meta-2.150.10-r8:0 >virtual/perl-Perl-OSType-1.10.0-r8:0 >virtual/perl-podlators-5.10.0:0 >virtual/perl-Scalar-List-Utils-1.630.0-r1:0 >virtual/perl-Test-Harness-3.440.0-r1:0 >virtual/perl-Text-ParseWords-3.310.0-r3:0 >virtual/perl-Unicode-Collate-1.310.0-r2:0 >virtual/perl-version-0.992.900-r1:0 >virtual/pkgconfig-3:0 native-symlinks >virtual/service-manager-1-r1:0 >virtual/ssh-0-r2:0 -minimal >virtual/tmpfiles-0-r5:0 -systemd >virtual/ttf-fonts-1-r2:0 >virtual/udev-217-r7:0 -systemd >virtual/w3m-1:0 >www-client/pybugz-0.14:0 python_targets_python3_10 python_targets_python3_11 python_targets_python3_12 >www-client/w3m-0.5.3_p20230121:0 -X -fbcon -gdk-pixbuf -gpm -imlib l10n_ja -lynxkeymap nls -nntp ssl unicode -xface >x11-base/xcb-proto-1.17.0:0 python_targets_python3_10 python_targets_python3_11 python_targets_python3_12 >x11-base/xorg-proto-2024.1:0 -test >x11-libs/cairo-1.18.0:0 X -abi_mips_n32 -abi_mips_n64 -abi_mips_o32 -abi_s390_32 -abi_s390_64 -abi_x86_32 abi_x86_64 -abi_x86_x32 -aqua -debug glib -gtk-doc -test >x11-libs/libX11-1.8.9:0 -abi_mips_n32 -abi_mips_n64 -abi_mips_o32 -abi_s390_32 -abi_s390_64 -abi_x86_32 abi_x86_64 -abi_x86_x32 -doc -test >x11-libs/libXau-1.0.11:0 -abi_mips_n32 -abi_mips_n64 -abi_mips_o32 -abi_s390_32 -abi_s390_64 -abi_x86_32 abi_x86_64 -abi_x86_x32 -doc >x11-libs/libxcb-1.17.0:0/1.12 -abi_mips_n32 -abi_mips_n64 -abi_mips_o32 -abi_s390_32 -abi_s390_64 -abi_x86_32 abi_x86_64 -abi_x86_x32 -doc -doc -selinux -test xkb >x11-libs/libXdmcp-1.1.5:0 -abi_mips_n32 -abi_mips_n64 -abi_mips_o32 -abi_s390_32 -abi_s390_64 -abi_x86_32 abi_x86_64 -abi_x86_x32 -doc >x11-libs/libXext-1.3.6:0 -abi_mips_n32 -abi_mips_n64 -abi_mips_o32 -abi_s390_32 -abi_s390_64 -abi_x86_32 abi_x86_64 -abi_x86_x32 -doc >x11-libs/libXrender-0.9.11:0 -abi_mips_n32 -abi_mips_n64 -abi_mips_o32 -abi_s390_32 -abi_s390_64 -abi_x86_32 abi_x86_64 -abi_x86_x32 >x11-libs/pixman-0.43.4:0 -abi_mips_n32 -abi_mips_n64 -abi_mips_o32 -abi_s390_32 -abi_s390_64 -abi_x86_32 abi_x86_64 -abi_x86_x32 -cpu_flags_arm_iwmmxt -cpu_flags_arm_iwmmxt2 -cpu_flags_arm_neon -cpu_flags_ppc_altivec cpu_flags_x86_mmxext cpu_flags_x86_sse2 cpu_flags_x86_ssse3 -loongson2f -static-libs -test >x11-libs/xtrans-1.5.0:0 -doc >x11-misc/compose-tables-1.8.9:0 >x11-misc/shared-mime-info-2.4-r1:0 -test >x11-misc/xdg-utils-1.2.1-r2:0 -X -dbus -doc -gnome > > >############# ># build.log # >############# > > * Emacs version: 29.3 >>>> Unpacking source... >>>> Unpacking cider-1.14.0.tar.gz to /var/tmp/portage/app-emacs/cider-1.14.0/work >>>> Source unpacked in /var/tmp/portage/app-emacs/cider-1.14.0/work >>>> Preparing source in /var/tmp/portage/app-emacs/cider-1.14.0/work/cider-1.14.0 ... >>>> Source prepared. >>>> Configuring source in /var/tmp/portage/app-emacs/cider-1.14.0/work/cider-1.14.0 ... >>>> Source configured. >>>> Compiling source in /var/tmp/portage/app-emacs/cider-1.14.0/work/cider-1.14.0 ... > * Compiling GNU Emacs Elisp files ... > >In cider-browse-ns--thing-at-point: >cider-browse-ns.el:454:2: Warning: docstring has wrong usage of unescaped single quotes (use \= or different quoting) > >In toplevel form: >cider-client.el:239:2: Warning: custom-declare-variable `cider-format-code-options' docstring has wrong usage of unescaped single quotes (use \= or different quoting) >cider-client.el:315:2: Warning: custom-declare-variable `cider-print-options' docstring has wrong usage of unescaped single quotes (use \= or different quoting) > >In cider--translate-path: >cider-common.el:291:2: Warning: docstring has wrong usage of unescaped single quotes (use \= or different quoting) > >In toplevel form: >cider-completion.el:104:2: Warning: custom-declare-variable `cider-completion-annotations-include-ns' docstring has wrong usage of unescaped single quotes (use \= or different quoting) > >In cider-company-docsig: >cider-completion.el:249:17: Warning: âlax-plist-getâ is an obsolete function (as of 29.1); use âplist-getâ instead. >cider-completion.el:250:21: Warning: âlax-plist-getâ is an obsolete function (as of 29.1); use âplist-getâ instead. >cider-completion.el:251:23: Warning: âlax-plist-getâ is an obsolete function (as of 29.1); use âplist-getâ instead. > >In cider--compatible-middleware-version-p: >cider-connection.el:261:2: Warning: docstring has wrong usage of unescaped single quotes (use \= or different quoting) >cider-connection.el:788:2: Warning: defvar `cider-cljs-repl-type' docstring has wrong usage of unescaped single quotes (use \= or different quoting) > >In cider--debug-move-point: >cider-debug.el:512:2: Warning: docstring has wrong usage of unescaped single quotes (use \= or different quoting) > >In cider-docview-wrap-text: >cider-doc.el:369:2: Warning: docstring has wrong usage of unescaped single quotes (use \= or different quoting) > >In toplevel form: >cider-docstring.el:79:2: Warning: custom-declare-variable `cider-docstring-max-lines' docstring wider than 80 characters > >In cider--attempt-invalid?: >cider-docstring.el:93:2: Warning: docstring wider than 80 characters > >In cider--render-docstring-first-sentence: >cider-docstring.el:102:41: Warning: âlax-plist-getâ is an obsolete function (as of 29.1); use âplist-getâ instead. > >In cider--render-docstring: >cider-docstring.el:105:2: Warning: docstring wider than 80 characters >cider-docstring.el:108:37: Warning: âlax-plist-getâ is an obsolete function (as of 29.1); use âplist-getâ instead. >cider-docstring.el:109:27: Warning: âlax-plist-getâ is an obsolete function (as of 29.1); use âplist-getâ instead. >cider-docstring.el:110:33: Warning: âlax-plist-getâ is an obsolete function (as of 29.1); use âplist-getâ instead. > >In cider-docstring--dumb-trim: >cider-docstring.el:142:2: Warning: docstring wider than 80 characters > >In end of data: >cider-docstring.el:56:18: Warning: the function âlibxml-parse-html-regionâ is not known to be defined. > >In cider-eldoc-format-variable: >cider-eldoc.el:217:15: Warning: âlax-plist-getâ is an obsolete function (as of 29.1); use âplist-getâ instead. >cider-eldoc.el:218:19: Warning: âlax-plist-getâ is an obsolete function (as of 29.1); use âplist-getâ instead. >cider-eldoc.el:221:54: Warning: âlax-plist-getâ is an obsolete function (as of 29.1); use âplist-getâ instead. >cider-eldoc.el:223:29: Warning: âlax-plist-getâ is an obsolete function (as of 29.1); use âplist-getâ instead. > >In cider-eldoc-format-function: >cider-eldoc.el:234:14: Warning: âlax-plist-getâ is an obsolete function (as of 29.1); use âplist-getâ instead. >cider-eldoc.el:235:18: Warning: âlax-plist-getâ is an obsolete function (as of 29.1); use âplist-getâ instead. >cider-eldoc.el:236:20: Warning: âlax-plist-getâ is an obsolete function (as of 29.1); use âplist-getâ instead. > >In cider-eldoc-format-special-form: >cider-eldoc.el:246:15: Warning: âlax-plist-getâ is an obsolete function (as of 29.1); use âplist-getâ instead. >cider-eldoc.el:247:32: Warning: âlax-plist-getâ is an obsolete function (as of 29.1); use âplist-getâ instead. >cider-eldoc.el:252:29: Warning: âlax-plist-getâ is an obsolete function (as of 29.1); use âplist-getâ instead. > >In cider-eldoc-thing-type: >cider-eldoc.el:334:15: Warning: âlax-plist-getâ is an obsolete function (as of 29.1); use âplist-getâ instead. > >In cider-eldoc-info: >cider-eldoc.el:454:40: Warning: âlax-plist-getâ is an obsolete function (as of 29.1); use âplist-getâ instead. >cider-eldoc.el:455:26: Warning: âlax-plist-putâ is an obsolete function (as of 29.1); use âplist-putâ instead. > >In cider-eldoc: >cider-eldoc.el:500:25: Warning: âlax-plist-getâ is an obsolete function (as of 29.1); use âplist-getâ instead. >cider-eldoc.el:501:18: Warning: âlax-plist-getâ is an obsolete function (as of 29.1); use âplist-getâ instead. >cider-eldoc.el:502:20: Warning: âlax-plist-getâ is an obsolete function (as of 29.1); use âplist-getâ instead. > >In toplevel form: >cider-eval.el:65:2: Warning: custom-declare-variable `cider-show-error-buffer' docstring has wrong usage of unescaped single quotes (use \= or different quoting) >cider-eval.el:88:2: Warning: custom-declare-variable `cider-auto-jump-to-error' docstring has wrong usage of unescaped single quotes (use \= or different quoting) >cider-eval.el:120:2: Warning: custom-declare-variable `cider-save-file-on-load' docstring has wrong usage of unescaped single quotes (use \= or different quoting) >cider-eval.el:608:2: Warning: defconst `cider-clojure-compilation-regexp' docstring wider than 80 characters >cider-eval.el:621:2: Warning: defconst `cider-clojure-compilation-error-regexp' docstring wider than 80 characters >cider-eval.el:648:2: Warning: defconst `cider-clojure-runtime-error-regexp' docstring wider than 80 characters > >In cider-find-keyword: >cider-find.el:254:2: Warning: docstring wider than 80 characters > >In cider-inspect-expr-from-inspector: >cider-inspector.el:236:2: Warning: docstring wider than 80 characters > >In cider-inspector-previous-sibling: >cider-inspector.el:276:2: Warning: docstring wider than 80 characters > >In cider-inspector-next-sibling: >cider-inspector.el:286:2: Warning: docstring wider than 80 characters > >In cider-sync-request:inspect-set-max-coll-size: >cider-inspector.el:527:2: Warning: docstring wider than 80 characters > >In cider-sync-request:inspect-set-max-nested-depth: >cider-inspector.el:538:2: Warning: docstring wider than 80 characters > >In cider-find-inspectable-object: >cider-inspector.el:726:2: Warning: docstring has wrong usage of unescaped single quotes (use \= or different quoting) >cider-mode.el: Warning: Missing format argument > >In toplevel form: >cider-macroexpansion.el:39:2: Warning: custom-declare-variable `cider-macroexpansion-display-namespaces' docstring has wrong usage of unescaped single quotes (use \= or different quoting) > >In toplevel form: >cider-mode.el:465:2: Warning: defconst `cider--has-many-mouse-buttons' docstring has wrong usage of unescaped single quotes (use \= or different quoting) >cider-mode.el:492:88: Warning: âxref-pop-marker-stackâ is an obsolete function (as of 29.1); use âxref-go-backâ instead. > >In cider--get-symbol-indent: >cider-mode.el:609:10: Warning: Missing format argument >cider-mode.el:623:2: Warning: custom-declare-variable `cider-font-lock-dynamically' docstring wider than 80 characters > >In end of data: >cider-mode.el:543:41: Warning: the function âcider-logâ is not known to be defined. >cider-mode.el:542:41: Warning: the function âcider-log-infoâ is not known to be defined. >cider-mode.el:541:41: Warning: the function âcider-log-frameworkâ is not known to be defined. >cider-mode.el:540:41: Warning: the function âcider-log-showâ is not known to be defined. >cider-mode.el:539:41: Warning: the function âcider-log-eventâ is not known to be defined. >cider-mode.el:538:41: Warning: the function âcider-log-consumerâ is not known to be defined. >cider-mode.el:537:41: Warning: the function âcider-log-appenderâ is not known to be defined. > >In toplevel form: >cider-ns.el:70:2: Warning: custom-declare-variable `cider-ns-save-files-on-refresh' docstring has wrong usage of unescaped single quotes (use \= or different quoting) > >In cider-ns-reload: >cider-ns.el:251:2: Warning: docstring has wrong usage of unescaped single quotes (use \= or different quoting) > >In cider-ns-reload-all: >cider-ns.el:266:2: Warning: docstring has wrong usage of unescaped single quotes (use \= or different quoting) > >In cider-ns-refresh: >cider-ns.el:282:2: Warning: docstring has wrong usage of unescaped single quotes (use \= or different quoting) > >In toplevel form: >cider-overlays.el:86:2: Warning: custom-declare-variable `cider-result-overlay-position' docstring has wrong usage of unescaped single quotes (use \= or different quoting) > >In cider--make-overlay: >cider-overlays.el:121:2: Warning: docstring has wrong usage of unescaped single quotes (use \= or different quoting) > >In cider-repl-require-repl-utils: >cider-repl.el:276:7: Warning: âlax-plist-putâ is an obsolete function (as of 29.1); use âplist-putâ instead. > >In cider-repl--ns-form-changed-p: >cider-repl.el:680:20: Warning: âlax-plist-getâ is an obsolete function (as of 29.1); use âplist-getâ instead. > >In cider-repl--cache-ns-form: >cider-repl.el:699:14: Warning: âlax-plist-putâ is an obsolete function (as of 29.1); use âplist-putâ instead. > >In cider--locref-at-point-1: >cider-repl.el:1368:46: Warning: âpoint-at-eolâ is an obsolete function (as of 29.1); use âline-end-positionâ or âpos-eolâ instead. > >In cider-locref-at-point: >cider-repl.el:1394:18: Warning: âpoint-at-eolâ is an obsolete function (as of 29.1); use âline-end-positionâ or âpos-eolâ instead. >cider-repl.el:1394:33: Warning: âpoint-at-bolâ is an obsolete function (as of 29.1); use âline-beginning-positionâ or âpos-bolâ instead. > >In cider-repl--history-replace: >cider-repl.el:1504:2: Warning: docstring has wrong usage of unescaped single quotes (use \= or different quoting) > >In cider--sesman-friendly-session-p: >cider-repl.el:1768:2: Warning: docstring wider than 80 characters > >In toplevel form: >cider-stacktrace.el:81:2: Warning: custom-declare-variable `cider-stacktrace-suppressed-errors' docstring has wrong usage of unescaped single quotes (use \= or different quoting) > >In cider-stacktrace-indicate-filters: >cider-stacktrace.el:242:2: Warning: docstring has wrong usage of unescaped single quotes (use \= or different quoting) > >In cider-stacktrace-some-suppressed-errors-p: >cider-stacktrace.el:370:2: Warning: docstring has wrong usage of unescaped single quotes (use \= or different quoting) > >In cider-stacktrace--insert-named-group: >cider-stacktrace.el:771:60: Warning: âpoint-at-eolâ is an obsolete function (as of 29.1); use âline-end-positionâ or âpos-eolâ instead. >cider-stacktrace.el:772:32: Warning: âpoint-at-bolâ is an obsolete function (as of 29.1); use âline-beginning-positionâ or âpos-bolâ instead. > >In cider-stacktrace-render: >cider-stacktrace.el:899:2: Warning: docstring has wrong usage of unescaped single quotes (use \= or different quoting) > >In cider-test-ediff: >cider-test.el:330:2: Warning: docstring has wrong usage of unescaped single quotes (use \= or different quoting) > >In cider--tooling-file-p: >cider-util.el:96:2: Warning: docstring has wrong usage of unescaped single quotes (use \= or different quoting) > >In cider-add-to-alist: >cider-util.el:434:2: Warning: docstring has wrong usage of unescaped single quotes (use \= or different quoting) > >In toplevel form: >cider.el:342:2: Warning: custom-declare-variable `cider-allow-jack-in-without-project' docstring has wrong usage of unescaped single quotes (use \= or different quoting) >cider.el:398:2: Warning: defvar `cider-jack-in-universal-options' docstring has wrong usage of unescaped single quotes (use \= or different quoting) > >In cider-jack-in-cljs: >cider.el:1422:2: Warning: docstring has wrong usage of unescaped single quotes (use \= or different quoting) > >In cider-jack-in-clj&cljs: >cider.el:1449:2: Warning: docstring has wrong usage of unescaped single quotes (use \= or different quoting) > >In cider-connect-sibling-cljs: >cider.el:1505:2: Warning: docstring has wrong usage of unescaped single quotes (use \= or different quoting) > >In cider-connect-cljs: >cider.el:1545:2: Warning: docstring has wrong usage of unescaped single quotes (use \= or different quoting) > >In cider-connect-clj&cljs: >cider.el:1564:2: Warning: docstring has wrong usage of unescaped single quotes (use \= or different quoting) > >In nrepl-make-response-handler: >nrepl-client.el:829:2: Warning: docstring has wrong usage of unescaped single quotes (use \= or different quoting) > >In nrepl-send-request: >nrepl-client.el:929:34: Warning: âlax-plist-putâ is an obsolete function (as of 29.1); use âplist-putâ instead. > >In nrepl-server-sentinel: >nrepl-client.el:1210:2: Warning: docstring has wrong usage of unescaped single quotes (use \= or different quoting) > >In nrepl-log-message: >nrepl-client.el:1310:22: Warning: âlax-plist-putâ is an obsolete function (as of 29.1); use âplist-putâ instead. >nrepl-client.el:1320:55: Warning: âlax-plist-getâ is an obsolete function (as of 29.1); use âplist-getâ instead. > >In nrepl-dict-get: >nrepl-dict.el:70:14: Warning: âlax-plist-getâ is an obsolete function (as of 29.1); use âplist-getâ instead. > >In nrepl-dict-put: >nrepl-dict.el:81:21: Warning: âlax-plist-putâ is an obsolete function (as of 29.1); use âplist-putâ instead. > [ ok ] >>>> Source compiled. >>>> Test phase: app-emacs/cider-1.14.0 >Warning (buttercup): Found duplicate spec names in suite: ("The cider compilation regexes Recognizes a clojure-1.10 error message" "The cider compilation regexes Recognizes a clojure 'Unexpected error' message") >Running 435 out of 436 specs. > >cider-apropos > raises user-error when cider is not connected. (0.14ms) > raises user-error when the `apropos' op is not supported. (0.10ms) > >cider-apropos-documentation > raises user-error when cider is not connected. (0.09ms) > raises user-error when the `apropos' op is not supported. (0.08ms) > >cider-browse-ns--text-face > identifies a function (0.08ms) > identifies a macro (0.08ms) > identifies a variable (0.07ms) > >cider-browse-ns > lists out all forms of a namespace with correct font-locks (0.44ms) > >cider-browse-ns--first-doc-line > returns Not documented if the doc string is missing (0.08ms) > returns the first line of the doc string (0.08ms) > returns the first sentence of the doc string if the first line contains multiple sentences (0.08ms) > returns the first line of the doc string if the first sentence spans multiple lines (0.08ms) > >cider-browse-spec--browse > raises user-error when cider is not connected. (0.08ms) > raises user-error when the `spec-form' op is not supported. (0.08ms) > renders a s/schema map formIndenting region... >Indenting region...done > renders a s/schema map form (0.63ms) > renders a s/schema vector formIndenting region... >Indenting region...done > renders a s/schema vector form (0.48ms) > renders a s/select formIndenting region... >Indenting region...done > renders a s/select form (0.59ms) > renders a s/union formIndenting region... >Indenting region...done > renders a s/union form (0.51ms) > >cider-classpath > raises user-error when cider is not connected. (0.09ms) > raises user-error when the `classpath' op is not supported. (0.09ms) > >cider-open-classpath-entry > raises user-error when cider is not connected. (0.08ms) > raises user-error when the `classpath' op is not supported. (0.08ms) > >cider-var-info > handles gracefully empty input (0.13ms) > returns vars info as an nREPL dict (0.10ms) > fallbacks to eval in the absence of the info middleware (0.09ms) > >cider-repl-type-for-buffer > returns the matching connection type based on the mode of current buffer (0.20ms) > returns the connection type based on `cider-repl-type' (0.13ms) > returns nil as its default value (0.09ms) > >cider-nrepl-send-unhandled-request > returns the id of the request sent to nREPL server and ignores the response (4.38ms) > >cider-ensure-op-supported > returns nil when the op is supported (0.08ms) > raises a user-error if the op is not supported (0.08ms) > >cider-expected-ns > returns the namespace matching the given string path (3.52ms) > returns nil if it cannot find the namespace (1.40ms) > falls back on `clojure-expected-ns' in the absence of an active nREPL connection (0.09ms) > >cider-clojuredocs-replace-special > converts the input to a clojuredocs friendly format (0.32ms) > >cider-clojuredocs-url > creates a clojuredocs search URL (0.19ms) > >cider-abbreviate-ns > handles nil input (0.07ms) > handles empty string input (0.08ms) > shortens all ns segments but the last (0.08ms) > handles single-segment namespaces (0.08ms) > >cider-last-ns-segment > handles nil input (0.07ms) > handles empty string input (0.08ms) > drops all ns segments but the last (0.08ms) > handles single-segment namespaces (0.08ms) > >cider--kw-to-symbol > returns symbol form of the given keyword (0.25ms) > >cider-make-tramp-prefix > returns tramp-prefix only (0.37ms) > >cider--translate-container-vm > translates file paths from container/vm location to host location (0.19ms) > returns nil if no prefixes match ('from-nrepl) (0.18ms) > won't replace a prefix in the middle of the path ('from-nrepl) (0.19ms) > handles slashes or no slashes in translations ('from-nrepl) (0.35ms) > expands the destination file paths (0.20ms) > ensures the prefix has a slash ('from-nrepl) (0.20ms) > translates file paths from host location to container/vm location (0.20ms) > returns nil if no prefixes match ('to-nrepl) (0.17ms) > won't replace a prefix in the middle of the path ('to-nrepl) (0.20ms) > handles slashes or no slashes in translations ('to-nrepl) (0.37ms) > expands the source file paths (0.20ms) > ensures the prefix has a slash ('to-nrepl) (0.20ms) > >cider-completion-get-context > when POINT is not at the end of the symbol > within a vanilla clojure buffer > Returns different things depending on the :info param (0.27ms) > within a repl > Returns different things depending on the :info param (0.25ms) > Returns the same context when invoked twice at the same place (0.23ms) > >cider-enable-flex-completion > adds `flex' and `basic' as a fallback (0.16ms) > doesn't add `cycle' (0.08ms) > adds just `flex' if there is another style present (0.16ms) > doesn't re-add `flex' if already present, preserving `cycle' as well (0.08ms) > >cider-ensure-connected > returns nil when a cider connection is available (1.19ms) > raises a user-error in the absence of a connection (0.09ms) > >cider-current-repl > when there are no active connections > returns nil (0.21ms) > when active connections are available > always returns the latest connection (1.45ms) > always returns the most recently used connection (1.44ms) > when current buffer is a 'multi' buffer > when there is only one connection available > returns the only connection (1.34ms) > when type argument is given > when connection of that type exists > returns that connection buffer (2.24ms) > when connection of that type doesn't exists > returns nil (8.03ms) > when type argument is not given > when a connection matching current file extension exists > returns that connection buffer (2.27ms) > when a connection matching current file extension doesn't exist > returns nil (8.04ms) > when multiple sessions exist > always returns the most recently used connection (2.82ms) > >cider-repls > when there are no active connections > returns nil (0.23ms) > when multiple sessions exist > always returns the most recently used connection (2.95ms) > when multiple sessions exist and cider-merge-sessions is set to :project > always returns all connections associated with a project (2.90ms) > only returns the connections of the active project (2.97ms) > when multiple sessions exist and cider-combine-merge-sessions is set to :host > returns only the sessions associated with the current session's host (2.31ms) > killed buffers > do not show up in it (1.26ms) > cljs capability > Upgraded clj repl counts as cljs (1.24ms) > >cider--connection-info > when current project is known > returns information about the given connection buffer (0.11ms) > when current project is not known > returns information about the connection buffer without project name (0.10ms) > >cider--close-connection > removes the REPL from sesman session (1.27ms) > >cider-format-connection-params > correctly abbreviates short directory names (0.69ms) > >cider-jack-in-clj&cljs > detects existing project (1.86ms) > >cider-compatible-middleware-version-p > correctly checks compatible required and middleware versions (0.50ms) > >cider-format-connection-params > Generates a pretty string. `:repl-type' can be symbol. (0.39ms) > Never invokes symbols as functions (Emacs 29 feature) (0.20ms) > >cider--debug-prompt > changes the font face to `cider-debug-prompt-face' for the first char (0.09ms) > Uses the display name and handles multiple chars not separated by spaces (0.13ms) > filters and displays commands in the order specified by cider-debug-prompt-commands (0.08ms) > >cider--debug-move-point > navigates the clojure sexp's guided by the given coordinates (0.43ms) > handles the syntax quote (0.88ms) > handles the deref reader macro (0.29ms) > handles metadata maps (0.15ms) > handles data-reader vars (0.15ms) > handles data-reader vars and metadata maps given simultaneously (0.15ms) > >cider--abbreviate-file-protocol > Removes the file or jar part (4.32ms) > >cider--find-rest-args-position > returns the position of & in the arglist vector (0.14ms) > >cider--eldoc-format-class-names > returns a formatted class names prefix string (0.15ms) > respects the value of `cider-eldoc-max-class-names-to-display' (0.09ms) > when cider-eldoc-ns-function is set to cider-abbreviate-ns > abbreviates the class names (0.17ms) > when cider-eldoc-ns-function is set to cider-last-ns-segment > keeps only the last ns segment (0.17ms) > >cider-eldoc-thing-type > Identifies special forms correctly (0.08ms) > Identifies functions correctly (0.08ms) > Defaults to 'fn (0.08ms) > >cider-eldoc-format-special-form > Should remove duplicates from special-form arglists that have duplicates (0.07ms) > Should not remove duplicates from special-form arglists that do not have duplicates (0.08ms) > >cider-eldoc-format-thing > when ns is given and it exists > returns formatted eldoc strings of form ns/symbol (0.09ms) > when the given ns doesn't exist > returns eldoc formatted symbol (0.22ms) > when the given Java interop form belongs to a single class > returns eldoc formatted thing (0.09ms) > when the given Java interop form belongs to multiple classes > joins the class list into a string (0.10ms) > when cider-eldoc-ns-function is set to cider-abbreviate-ns > abbreviates the class names (0.24ms) > when cider-eldoc-ns-function is set to cider-last-ns-segment > keeps only the last ns segment (0.24ms) > >cider-eldoc-beginning-of-sexp > moves to the beginning of the sexp (0.18ms) > returns the number sexp the point was over or after (0.23ms) > returns nil if the maximum number of sexps to skip is exceeded (0.17ms) > >cider--eldoc-remove-dot > removes the "." from the namespace qualified symbols (0.26ms) > >cider-eldoc-info-in-current-sexp > considers sym-at-point before the sym-at-sexp-beginning (0.45ms) > respects the value of `cider-eldoc-display-for-symbol-at-point' (0.41ms) > interop forms > when class name is not given before interop forms > includes all possible class names in eldoc (0.17ms) > when class name is given before interop forms > includes just the given class name in eldoc (0.16ms) > >cider-eldoc > Should call cider-eldoc-format-variable for vars (0.09ms) > Should call cider-eldoc-format-special-form for special forms (0.10ms) > Should call cider-eldoc-format-function for functions (0.10ms) > Should call cider-eldoc-format-function for macros (0.09ms) > >cider-eldoc-format-sym-doc > returns the formatted eldoc string (0.09ms) > specifications for eldoc-echo-area-use-multiline-p > when its value is t > does not truncate anything (0.17ms) > when its value is truncate-sym-name-if-fit > doesn't truncate anything if docstring doesn't fit (0.09ms) > truncates the symbol name with cider-abbreviate-ns (0.12ms) > truncates the symbol name with cider-last-ns-segment (0.10ms) > leaves out the namespace if the var is in current namespace (0.11ms) > returns as is if truncating the symbol doesn't make it fit (0.09ms) > when the docstring spans multiple lines > returns it as is (0.10ms) > when its value is nil > leaves out the symbol name and truncates the docstring (0.09ms) > when the docstring spans multiple lines > returns tries to display the var with the first line (0.09ms) > >cider--eldoc-add-datomic-query-inputs-to-arglists > adds the datomic query inputs of the query at point to the arglist (0.10ms) > >cider-extract-error-info > extracts correct information from the error message (2.21ms) > >The cider compilation regexes > Recognizes a clojure warning message (0.24ms) > Recognizes a clojure-1.10 error message (0.19ms) > Recognizes a clojure 'Unexpected error' message (0.19ms) > Recognizes a clojure-1.10 error message (0.18ms) > Recognizes a clojure 'Unexpected error' message (0.18ms) > >cider-clojure-runtime-error-regexp > Recognizes a clojure-1.10 runtime error message (0.62ms) > Recognizes a clojure-1.10 runtime spec validation error message (0.17ms) > Recognizes an error thrown from a java source file (0.17ms) > >cider-module-info-regexp > Matches module info provided by Java (0.32ms) > >cider-provide-file > returns an empty string when the file is not found (0.08ms) > base64 encodes without newlines (0.95ms) > can handle multibyte characters (0.48ms) > >cider-extract-error-info > Matches Clojure compilation exceptions (0.37ms) > >cider-find-ns > raises a user error if cider is not connected (0.10ms) > raises a user error if the op is not supported (0.09ms) > >cider--find-keyword-loc > finds the given keyword, discarding false positives (2.66ms) > >reader conditional font-lock > when cider is connected > uses cider-reader-conditional-face (0.37ms) > highlights unmatched reader conditionals (0.52ms) > works with splicing (0.50ms) > does not apply inside strings or comments (0.41ms) > highlights all unmatched reader conditionals (0.64ms) > does not highlight beyond the limits of the reader conditional group (0.60ms) > when multiple connections are connected > is disabled (0.32ms) > when cider is not connected > is disabled (0.32ms) > >cider-inspector-render* > Produces a well-known string without errors (96.02ms) > >cider--var-namespace > returns the namespace of a var (0.45ms) > >cider-to-nrepl-filename-function > translates file paths when running on cygwin systems (0.22ms) > translates file paths from container/vm location to host location (0.24ms) > >cider-quit > raises a user error if cider is not connected (0.12ms) > >cider-restart > raises a user error if cider is not connected (0.11ms) > >cider-load-all-project-ns > raises a user error if cider is not connected (0.10ms) > raises a user error if the op is not supported (0.10ms) > >cider-load-file > works as expected in empty Clojure buffers (3.71ms) > >cider-interactive-eval > works as expected in empty Clojure buffers (1.28ms) > >cider--matching-delimiter > returns the right closing delimiter (0.23ms) > returns the right opening delimiter (0.21ms) > >cider--insert-closing-delimiters > appends any matching closing delimiters (0.11ms) > >cider--test-unless-local > returns the given argument if text at point is not a clojure local (0.20ms) > >cider--read-locals-from-next-sexp > respects cursor position (0.25ms) > understands clojure destructuring (0.24ms) > handles clojure type-hints (0.26ms) > >cider--read-locals-from-bindings-vector > understands clojure destructuring (0.51ms) > handles clojure type-hints (0.31ms) > handles newlines (0.30ms) > >cider--read-locals-from-arglist > handles whitespace (0.27ms) > handles clojure docstrings, meta-data, type-hints (0.25ms) > understands clojure destructuring (0.45ms) > understands clojure multi-arity functions (0.26ms) > understands lambda functions (0.26ms) > >cider-log > raises user-error when cider is not connected. (0.14ms) > doesn't add an appender when initialized. (0.06ms) > does add an appender when not initialized. (0.07ms) > >cider-ns-refresh > raises a user error if cider is not connected (0.10ms) > >cider-ns--present-error > Works without throwing errors=> Invalid token: :::a > Works without throwing errors (7.80ms) > >cider--make-result-overlay > can create overlays (0.17ms) > for all types of overlays > creating multiple in the same spot will result in the old one being deleted (1.53ms) > when overlay duration is `command` > will stay stay for one command (0.11ms) > erases overlays after the next command is executed (0.32ms) > will not erase overlays if they're created consecutively (0.18ms) > when overlay duration is given in secs > erases overlays after that duration (20.52ms) > overlays will be erased independently of each other (20.58ms) > overlays don't respond to commands being run or insertions (0.20ms) > duration overlays are currently the only overlays that can be deleted independently from the other types (20.60ms) > when overlay duration is `change' > will not erase from running commands (0.28ms) > will change after making modifications to the buffer (0.13ms) > multiple overlays can be created before they are all destroyed (0.28ms) > >cider--delete-overlay > deletes overlays (0.10ms) > >cider-repl--insert-param-values > doesn't output anything when the params aren't present (0.12ms) > puts jack-in-command in same style as banner (0.12ms) > formats output if present (0.12ms) > >cider-repl--clojure-banner > when the cider package version information is available > returns the repl banner string (0.14ms) > >multiple calls to cider-repl--emit-output > Multiple emit output calls set properties and emit text (0.82ms) > >cider-repl--emit-output > prints simple strings (0.14ms) > when the escape code is invalid > doesn't hold the string looking for a close tag (0.11ms) > >cider-locref-at-point > works with stdout-stacktrace refs (0.26ms) > works with print-stacktrace (0.13ms) > works with avis exceptions (0.21ms) > works with timbre logs (0.23ms) > works with cljs warnings (0.20ms) > works with warnings (0.31ms) > works with compilation exceptions (0.22ms) > >cider-repl-require-repl-utils > requires clj utils in a clj buffer (0.15ms) > requires cljs utils in a cljs buffer (0.10ms) > >cider-selector-method-c > switches to most recently visited clojure-mode buffer (0.19ms) > >cider-selector-method-e > switches to most recently visited emacs-lisp-mode buffer (0.14ms) > >cider-selector-method-r > switches to current REPL buffer (0.12ms) > >cider-selector-method-x > switches to *cider-error* buffer (0.11ms) > >cider-selector-method-d > switches to *cider-doc* buffer (0.12ms) > >cider-selector-method-s > switches to *cider-scratch* buffer (0.11ms) > >cider-stacktrace-some-suppressed-errors-p > when no errors are suppressed > returns nil (0.14ms) > when some errors are suppressed > returns a list of suppressed errors and all errors associated with them (0.14ms) > >cider-stacktrace-suppressed-error-p > returns true when a error is suppressed (0.22ms) > >cider-stacktrace-suppress-error > adds the error to the suppressed errors list (0.08ms) > >cider-stacktrace-promote-error > removes the error from the suppressed errors list (0.08ms) > >cider-stacktrace-frame-p-tests > returns true on frames (0.22ms) > returns false otherwise (0.13ms) > >cider-stacktrace--should-hide-p-tests > should hide when members of the neg filters (0.13ms) > >cider-stacktrace-analyze-at-point > should analyze the Aviso stacktrace with point at beginning (1.48ms) > should analyze the Clojure stacktrace with point at beginning (0.38ms) > should analyze the Java stacktrace with point at beginning (0.37ms) > should analyze the Clojure stacktrace with point inside (0.38ms) > should analyze the Java stacktrace with point inside (0.37ms) > >cider-stacktrace-analyze-in-region > should analyze the Aviso stacktrace in region (0.07ms) > should analyze the Clojure stacktrace in region (0.07ms) > should analyze the Java stacktrace in region (0.06ms) > >cider-test--string-contains-newline > Returns `t' only for escaped newlines (0.19ms) > >customize-menu > opens without error (123.22ms) > >cider-figwheel-main-init-form > from options > leaves keywords alone (4.17ms) > leaves maps alone (4.06ms) > leaves s-exprs alone (4.04ms) > prepends colon to plain names (4.20ms) > from minibuffer > leaves keywords alone (0.10ms) > leaves maps alone (0.08ms) > leaves s-exprs alone (0.10ms) > prepends colon to plain names (0.09ms) > >cider-project-type > when there is a single project > returns that type (0.08ms) > when there are multiple possible project types > returns the choice entered by user (0.08ms) > respects the value of `cider-preferred-build-tool' (0.19ms) > when there are no choices available > returns the value of `cider-jack-in-default' (0.08ms) > >cider--gradle-dependency-notation > returns a GAV when given a two-element list (0.08ms) > >cider--gradle-jack-in-property > returns an empty string if no dependencies passed (0.07ms) > returns a Gradle property if one dependency passed (0.10ms) > returns a comma-separated Gradle property if multiple dependencies passed (0.11ms) > >cider--gradle-middleware-params > returns an empty string if no middlewares are passed (0.07ms) > returns a single middleware param if one passed (0.08ms) > returrns multiple middleware params, space-separated, if multiple passed (0.09ms) > >cider-inject-jack-in-dependencies > when there is a single dependency > can inject dependencies in a lein project (0.16ms) > can inject dependencies in a lein project with an exclusion (0.15ms) > can inject dependencies in a lein project with multiple exclusions (0.15ms) > can inject dependencies in a boot project (0.11ms) > can inject dependencies in a gradle project (0.13ms) > when there are multiple dependencies > can inject dependencies in a lein project (0.16ms) > can inject dependencies in a boot project (0.12ms) > when there are global options > can concat in a lein project (0.14ms) > can concat in a boot project (0.10ms) > can concat in a gradle project (0.11ms) > when there are predicates > includes plugins whose predicates return true (0.09ms) > includes middlewares whose predicates return true (0.09ms) > ignores plugins whose predicates return false (0.15ms) > calls plugin predicates with the whole list entry (0.06ms) > calls middleware predicates with the whole list entry (0.05ms) > only calls plugin predicates for their own entries (0.06ms) > only calls middleware predicates for their own entries (0.06ms) > when the middleware and plugin lists have been normalized (Lein) > uses them in a lein project (0.16ms) > when the middleware lists have been normalized (Boot) > uses them in a boot project (0.12ms) > >cider-jack-in-auto-inject-clojure > injects `cider-minimum-clojure-version' when `cider-jack-in-auto-inject-clojure' is set to minimal (0.08ms) > injects `cider-latest-clojure-version' when `cider-jack-in-auto-inject-clojure' is set to latest (0.08ms) > injects a specific version when `cider-jack-in-auto-inject-clojure' to a version (0.09ms) > handles a list, where its first element is the artifact ID, and the second element is the version number (0.08ms) > >cider-normalize-cljs-init-options > from options > leaves keywords alone (0.07ms) > leaves maps alone (0.07ms) > leaves s-exprs alone (0.08ms) > leaves vectors alone (0.07ms) > prepends colon to plain names (0.08ms) > >cider--shadow-parse-builds > parses valid input (0.27ms) > returns default options on empty / invalid input (0.22ms) > >cider--shell-quote-argument > can quote powershell argument (0.08ms) > can quote any other argument (0.09ms) > >cider--powershell-encode-command > base64 encodes command and parameters (0.09ms) > escapes double quotes by repeating them (0.09ms) > >cider--update-jack-in-cmd > when 'clojure-cli project type and "powershell" command > returns a jack-in command using encodedCommand option (0.11ms) > when 'clojure-cli project type > uses main opts in an alias to prevent other mains from winning (0.20ms) > allows specifying custom aliases with `cider-clojure-cli-aliases` (0.20ms) > should remove duplicates, yielding the same result (for "clojure" command invocation) (0.19ms) > should remove duplicates, yielding the same result (for "powershell" command invocation) (0.12ms) > handles aliases correctly (1.11ms) > allows for global options (0.18ms) > allows to specify git coordinate as cider-jack-in-dependency (0.22ms) > Override jack-in command > Uses the param, if provided (0.09ms) > Uses the `cider-jack-in-cmd', if provided (0.08ms) > Uses params over `cider-jack-in-cmd', if provided (0.08ms) > >cider--shadow-get-builds > handles EDN reader tags (0.93ms) > returns default options on empty / invalid input (1.33ms) > >cider-shadow-cljs-init-form > watches and selects user-defined builds (4.21ms) > starts the built-in build profiles correctly > starts a node-repl (4.37ms) > starts a browser-repl (4.28ms) > can watch multiple builds > watches 2 builds and selects user-defined builds (0.10ms) > >cider--resolve-project-command > if command starts with ./ it resolves relative to clojure-project-dir (4.12ms) > if command starts with ../ it resolves relative to clojure-project-dir (3.98ms) > if command is bare it resolves against the exec-path (0.11ms) > >cider-connect-sibling-cljs > sets nrepl client buffer local vars correctly > for a custom cljs REPL type project[nREPL] Starting server via "emacs" -Q --batch --eval "(progn (setf package-user-dir \"~/.emacs.d/elpa\" load-path '(\"/var/tmp/portage/app-emacs/cider-1.14.0/work/cider-1.14.0\" \"/var/tmp/portage/app-emacs/cider-1.14.0/work/cider-1.14.0/test\" \"/etc/emacs\" \"/usr/share/emacs/site-lisp\" \"/usr/share/emacs/site-lisp/buttercup\" \"/usr/share/emacs/site-lisp/clojure-mode\" \"/usr/share/emacs/site-lisp/parseclj\" \"/usr/share/emacs/site-lisp/parseedn\" \"/usr/share/emacs/site-lisp/queue\" \"/usr/share/emacs/site-lisp/sesman\" \"/usr/share/emacs/site-lisp/site-gentoo.d\" \"/usr/share/emacs/site-lisp/spinner\" \"/usr/share/emacs/29.3/lisp\" \"/usr/share/emacs/29.3/lisp/vc\" \"/usr/share/emacs/29.3/lisp/use-package\" \"/usr/share/emacs/29.3/lisp/url\" \"/usr/share/emacs/29.3/lisp/textmodes\" \"/usr/share/emacs/29.3/lisp/progmodes\" \"/usr/share/emacs/29.3/lisp/play\" \"/usr/share/emacs/29.3/lisp/org\" \"/usr/share/emacs/29.3/lisp/nxml\" \"/usr/share/emacs/29.3/lisp/net\" \"/usr/share/emacs/29.3/lisp/mh-e\" \"/usr/share/emacs/29.3/lisp/mail\" \"/usr/share/emacs/29.3/lisp/leim\" \"/usr/share/emacs/29.3/lisp/language\" \"/usr/share/emacs/29.3/lisp/international\" \"/usr/share/emacs/29.3/lisp/image\" \"/usr/share/emacs/29.3/lisp/gnus\" \"/usr/share/emacs/29.3/lisp/eshell\" \"/usr/share/emacs/29.3/lisp/erc\" \"/usr/share/emacs/29.3/lisp/emulation\" \"/usr/share/emacs/29.3/lisp/emacs-lisp\" \"/usr/share/emacs/29.3/lisp/cedet\" \"/usr/share/emacs/29.3/lisp/calendar\" \"/usr/share/emacs/29.3/lisp/calc\" \"/usr/share/emacs/29.3/lisp/obsolete\") user-emacs-directory \"~/.emacs.d/\" ) (package-initialize))" -l test/nrepl-server-mock.el -f nrepl-server-mock-start >[nREPL] server started on 35093 >:nrepl-mock-server-process-started... >[nREPL] Establishing direct connection to localhost:35093 ... >[nREPL] Direct connection to localhost:35093 established >[nREPL] Connection closed > for a custom cljs REPL type project (273.79ms) > for a custom REPL type project that needs to switch to cljs[nREPL] Starting server via "emacs" -Q --batch --eval "(progn (setf package-user-dir \"~/.emacs.d/elpa\" load-path '(\"/var/tmp/portage/app-emacs/cider-1.14.0/work/cider-1.14.0\" \"/var/tmp/portage/app-emacs/cider-1.14.0/work/cider-1.14.0/test\" \"/etc/emacs\" \"/usr/share/emacs/site-lisp\" \"/usr/share/emacs/site-lisp/buttercup\" \"/usr/share/emacs/site-lisp/clojure-mode\" \"/usr/share/emacs/site-lisp/parseclj\" \"/usr/share/emacs/site-lisp/parseedn\" \"/usr/share/emacs/site-lisp/queue\" \"/usr/share/emacs/site-lisp/sesman\" \"/usr/share/emacs/site-lisp/site-gentoo.d\" \"/usr/share/emacs/site-lisp/spinner\" \"/usr/share/emacs/29.3/lisp\" \"/usr/share/emacs/29.3/lisp/vc\" \"/usr/share/emacs/29.3/lisp/use-package\" \"/usr/share/emacs/29.3/lisp/url\" \"/usr/share/emacs/29.3/lisp/textmodes\" \"/usr/share/emacs/29.3/lisp/progmodes\" \"/usr/share/emacs/29.3/lisp/play\" \"/usr/share/emacs/29.3/lisp/org\" \"/usr/share/emacs/29.3/lisp/nxml\" \"/usr/share/emacs/29.3/lisp/net\" \"/usr/share/emacs/29.3/lisp/mh-e\" \"/usr/share/emacs/29.3/lisp/mail\" \"/usr/share/emacs/29.3/lisp/leim\" \"/usr/share/emacs/29.3/lisp/language\" \"/usr/share/emacs/29.3/lisp/international\" \"/usr/share/emacs/29.3/lisp/image\" \"/usr/share/emacs/29.3/lisp/gnus\" \"/usr/share/emacs/29.3/lisp/eshell\" \"/usr/share/emacs/29.3/lisp/erc\" \"/usr/share/emacs/29.3/lisp/emulation\" \"/usr/share/emacs/29.3/lisp/emacs-lisp\" \"/usr/share/emacs/29.3/lisp/cedet\" \"/usr/share/emacs/29.3/lisp/calendar\" \"/usr/share/emacs/29.3/lisp/calc\" \"/usr/share/emacs/29.3/lisp/obsolete\") user-emacs-directory \"~/.emacs.d/\" ) (package-initialize))" -l test/nrepl-server-mock.el -f nrepl-server-mock-start >nREPL server exited. >[nREPL] server started on 42005 >:nrepl-mock-server-process-started... >[nREPL] Establishing direct connection to localhost:42005 ... >[nREPL] Direct connection to localhost:42005 established >[nREPL] Connection closed > for a custom REPL type project that needs to switch to cljs (272.45ms) > >sesman > can restart session[nREPL] Starting server via "emacs" -Q --batch --eval "(progn (setf package-user-dir \"~/.emacs.d/elpa\" load-path '(\"/var/tmp/portage/app-emacs/cider-1.14.0/work/cider-1.14.0\" \"/var/tmp/portage/app-emacs/cider-1.14.0/work/cider-1.14.0/test\" \"/etc/emacs\" \"/usr/share/emacs/site-lisp\" \"/usr/share/emacs/site-lisp/buttercup\" \"/usr/share/emacs/site-lisp/clojure-mode\" \"/usr/share/emacs/site-lisp/parseclj\" \"/usr/share/emacs/site-lisp/parseedn\" \"/usr/share/emacs/site-lisp/queue\" \"/usr/share/emacs/site-lisp/sesman\" \"/usr/share/emacs/site-lisp/site-gentoo.d\" \"/usr/share/emacs/site-lisp/spinner\" \"/usr/share/emacs/29.3/lisp\" \"/usr/share/emacs/29.3/lisp/vc\" \"/usr/share/emacs/29.3/lisp/use-package\" \"/usr/share/emacs/29.3/lisp/url\" \"/usr/share/emacs/29.3/lisp/textmodes\" \"/usr/share/emacs/29.3/lisp/progmodes\" \"/usr/share/emacs/29.3/lisp/play\" \"/usr/share/emacs/29.3/lisp/org\" \"/usr/share/emacs/29.3/lisp/nxml\" \"/usr/share/emacs/29.3/lisp/net\" \"/usr/share/emacs/29.3/lisp/mh-e\" \"/usr/share/emacs/29.3/lisp/mail\" \"/usr/share/emacs/29.3/lisp/leim\" \"/usr/share/emacs/29.3/lisp/language\" \"/usr/share/emacs/29.3/lisp/international\" \"/usr/share/emacs/29.3/lisp/image\" \"/usr/share/emacs/29.3/lisp/gnus\" \"/usr/share/emacs/29.3/lisp/eshell\" \"/usr/share/emacs/29.3/lisp/erc\" \"/usr/share/emacs/29.3/lisp/emulation\" \"/usr/share/emacs/29.3/lisp/emacs-lisp\" \"/usr/share/emacs/29.3/lisp/cedet\" \"/usr/share/emacs/29.3/lisp/calendar\" \"/usr/share/emacs/29.3/lisp/calc\" \"/usr/share/emacs/29.3/lisp/obsolete\") user-emacs-directory \"~/.emacs.d/\" ) (package-initialize))" -l test/nrepl-server-mock.el -f nrepl-server-mock-start >nREPL server exited. >[nREPL] server started on 45089 >:nrepl-mock-server-process-started... >[nREPL] Establishing direct connection to localhost:45089 ... >[nREPL] Direct connection to localhost:45089 established >Restarting CIDER session (work/cider-1.14.0:localhost:45089) >Connected! If you wish to make an apple pie from scratch, you must first invent the universe. -Carl Sagan >[nREPL] Connection closed >[nREPL] Starting server via "emacs" -Q --batch --eval "(progn (setf package-user-dir \"~/.emacs.d/elpa\" load-path '(\"/var/tmp/portage/app-emacs/cider-1.14.0/work/cider-1.14.0\" \"/var/tmp/portage/app-emacs/cider-1.14.0/work/cider-1.14.0/test\" \"/etc/emacs\" \"/usr/share/emacs/site-lisp\" \"/usr/share/emacs/site-lisp/buttercup\" \"/usr/share/emacs/site-lisp/clojure-mode\" \"/usr/share/emacs/site-lisp/parseclj\" \"/usr/share/emacs/site-lisp/parseedn\" \"/usr/share/emacs/site-lisp/queue\" \"/usr/share/emacs/site-lisp/sesman\" \"/usr/share/emacs/site-lisp/site-gentoo.d\" \"/usr/share/emacs/site-lisp/spinner\" \"/usr/share/emacs/29.3/lisp\" \"/usr/share/emacs/29.3/lisp/vc\" \"/usr/share/emacs/29.3/lisp/use-package\" \"/usr/share/emacs/29.3/lisp/url\" \"/usr/share/emacs/29.3/lisp/textmodes\" \"/usr/share/emacs/29.3/lisp/progmodes\" \"/usr/share/emacs/29.3/lisp/play\" \"/usr/share/emacs/29.3/lisp/org\" \"/usr/share/emacs/29.3/lisp/nxml\" \"/usr/share/emacs/29.3/lisp/net\" \"/usr/share/emacs/29.3/lisp/mh-e\" \"/usr/share/emacs/29.3/lisp/mail\" \"/usr/share/emacs/29.3/lisp/leim\" \"/usr/share/emacs/29.3/lisp/language\" \"/usr/share/emacs/29.3/lisp/international\" \"/usr/share/emacs/29.3/lisp/image\" \"/usr/share/emacs/29.3/lisp/gnus\" \"/usr/share/emacs/29.3/lisp/eshell\" \"/usr/share/emacs/29.3/lisp/erc\" \"/usr/share/emacs/29.3/lisp/emulation\" \"/usr/share/emacs/29.3/lisp/emacs-lisp\" \"/usr/share/emacs/29.3/lisp/cedet\" \"/usr/share/emacs/29.3/lisp/calendar\" \"/usr/share/emacs/29.3/lisp/calc\" \"/usr/share/emacs/29.3/lisp/obsolete\") user-emacs-directory \"~/.emacs.d/\" ) (package-initialize))" -l test/nrepl-server-mock.el -f nrepl-server-mock-start > >nREPL server exited. >[nREPL] server started on 36791 >[nREPL] Establishing direct connection to localhost:36791 ... >[nREPL] Direct connection to localhost:36791 established >Restarted CIDER work/cider-1.14.0:localhost:45089 session >[nREPL] Connection closed > can restart session (1.02s) > >cider-locate-running-nrepl-ports > Concatenates values from different sources (0.19ms) > >cider--extract-lein-profiles > Splits the command by `with-profile' call, if found (0.45ms) > >cider--version > returns correct version number when available (0.09ms) > handles snapshot versions (0.10ms) > >cider-run-chained-hook > chains correctly (0.10ms) > exits on first nil (0.12ms) > >cider-symbol-at-point > doesn't move the cursor (0.35ms) > when there is a symbol at point > returns the symbol (0.22ms) > when the symbol at point is . > returns the symbol (0.13ms) > when the symbol at point is .. > returns the symbol (0.13ms) > when the symbol at point has a trailing . > returns the symbol without the . (0.13ms) > when the symbol at point is quoted > returns the symbol without the preceding ' (0.13ms) > when the symbol at point is var-quoted > returns the symbol without the preceding #' (0.13ms) > when point is on a keyword > returns the keyword along with beginning : character (0.23ms) > does not attempt to resolve auto-resolved keywords (0.24ms) > when there's nothing at point > returns nil (0.09ms) > when on an opening paren > returns the following symbol (0.14ms) > can identify symbols in a repl, ignoring the repl prompt (0.23ms) > >cider-list-at-point > when the param 'bounds is not given > returns the list at point (0.13ms) > handles leading @ reader macro properly (0.15ms) > handles leading ' reader macro properly (0.12ms) > handles vectors (0.12ms) > handles sets PENDING (0.03ms) > handles maps (0.12ms) > when the param 'bounds is given > returns the bounds of starting and ending positions of the sexp (0.12ms) > >cider-sexp-at-point > when the param 'bounds is not given > returns the sexp at point (0.27ms) > when the param 'bounds is given > returns the bounds of starting and ending positions of the sexp (0.14ms) > >cider-last-sexp > when the param 'bounds is not given > returns the last sexp (0.25ms) > returns the last sexp event when there are whitespaces (0.12ms) > when the param 'bounds is given > returns the bounds of last sexp (0.12ms) > returns the bounds of last sexp event when there are whitespaces (0.14ms) > >cider-defun-at-point > when the param 'bounds is not given > returns the defun at point (0.25ms) > when the param 'bounds is given > returns the bounds of starting and ending positions of the defun (0.14ms) > within a repl > also works (0.82ms) > >cider-repl-prompt-function > returns repl prompts (0.25ms) > >cider--url-to-file > returns a url for a given file name (0.19ms) > >cider-namespace-qualified-p > returns true if given sym is namespace-qualified (0.30ms) > >cider--deep-vector-to-list > converts nested vectors to lists (0.46ms) > >cider-version-sans-patch > returns the version sans the patch (0.09ms) > handles snapshot versions (0.09ms) > >cider-manual-url > returns the manual correct url for stable cider versions (0.09ms) > returns the manual correct url for snapshot cider versions (0.10ms) > >cider-refcard-url > returns the refcard correct url for stable cider versions (0.09ms) > returns the refcard correct url for snapshot cider versions (0.10ms) > >cider-second-sexp-in-list > returns the second sexp in the list (0.14ms) > >cider-ansi-color-string-detect > detect ansi color successfully (0.22ms) > >cider-add-face > works in strings > fontifies with correct face (0.16ms) > fontifies foreground with correct face (0.11ms) > fontifies sub-expression correctly (0.16ms) > works in buffers > fontifies with correct face (0.13ms) > >cider--find-symbol-xref > identifies all types of xref syntax (0.33ms) > >major-mode-predicates > matches clojure-mode (0.31ms) > matches clojurescript-mode (0.25ms) > matches clojurec-mode (0.24ms) > >nrepl--bdecode-message > when bencode structures are complete > decodes strings (0.11ms) > handles platform specific newlines (0.36ms) > decodes integers (0.18ms) > decodes lists (0.11ms) > decodes dict (0.12ms) > decodes queues (0.12ms) > decodes list of ints (0.11ms) > handles nils (0.19ms) > decodes nrepl response value (0.13ms) > decodes nrepl response status (0.12ms) > decodes nrepl error response (0.13ms) > decodes nrepl exception response (0.13ms) > decodes nrepl doc output (0.49ms) > decodes nrepl responses with multibyte chars (0.16ms) > when bencode strings have partial structures > decodes dict (0.20ms) > decodes list of ints (0.11ms) > decodes queues (0.14ms) > when bencode strings are split into parts > decodes dict (0.14ms) > decodes nrepl doc output (0.29ms) > when bencode strings have deeply nested structure > decodes the structures (3.92ms) > bencoding is idempotent > preserves the original obj value after encode/decode operations (0.20ms) > >nrepl-server-buffer-name > when nrepl-hide-special-buffers is t > returns the name of the server buffer, which hides it in buffer changing commands (0.91ms) > creates two separate server processes if needed (1.75ms) > >nrepl-dbind-response > destructures a nREPL response dict and binds values to given vars (0.12ms) > >nrepl-make-buffer-name > generates a buffer name from the given template (0.88ms) > respects the value of param `:project-dir' (0.14ms) > understands all formats (0.16ms) > strips trailing separators (0.36ms) > >nrepl--port-string-to-number > Converts a string to number when adequate (0.29ms) > >nrepl-parse-port > standard (0.25ms) > babashka (0.24ms) > shadow (0.24ms) > >nrepl-parse-sock > standard (0.18ms) > >nrepl--ssh-file-name-matches-host-p > works in the most basic case (0.19ms) > understands non-standart ssh ports and distinguishes between them (0.18ms) > works with tramps other ssh methods (0.08ms) > can handle nil (0.09ms) > >nrepl-client-lifecycle > start and stop nrepl client process[nREPL] Starting server via "emacs" -Q --batch --eval "(progn (setf package-user-dir \"~/.emacs.d/elpa\" load-path '(\"/var/tmp/portage/app-emacs/cider-1.14.0/work/cider-1.14.0\" \"/var/tmp/portage/app-emacs/cider-1.14.0/work/cider-1.14.0/test\" \"/etc/emacs\" \"/usr/share/emacs/site-lisp\" \"/usr/share/emacs/site-lisp/buttercup\" \"/usr/share/emacs/site-lisp/clojure-mode\" \"/usr/share/emacs/site-lisp/parseclj\" \"/usr/share/emacs/site-lisp/parseedn\" \"/usr/share/emacs/site-lisp/queue\" \"/usr/share/emacs/site-lisp/sesman\" \"/usr/share/emacs/site-lisp/site-gentoo.d\" \"/usr/share/emacs/site-lisp/spinner\" \"/usr/share/emacs/29.3/lisp\" \"/usr/share/emacs/29.3/lisp/vc\" \"/usr/share/emacs/29.3/lisp/use-package\" \"/usr/share/emacs/29.3/lisp/url\" \"/usr/share/emacs/29.3/lisp/textmodes\" \"/usr/share/emacs/29.3/lisp/progmodes\" \"/usr/share/emacs/29.3/lisp/play\" \"/usr/share/emacs/29.3/lisp/org\" \"/usr/share/emacs/29.3/lisp/nxml\" \"/usr/share/emacs/29.3/lisp/net\" \"/usr/share/emacs/29.3/lisp/mh-e\" \"/usr/share/emacs/29.3/lisp/mail\" \"/usr/share/emacs/29.3/lisp/leim\" \"/usr/share/emacs/29.3/lisp/language\" \"/usr/share/emacs/29.3/lisp/international\" \"/usr/share/emacs/29.3/lisp/image\" \"/usr/share/emacs/29.3/lisp/gnus\" \"/usr/share/emacs/29.3/lisp/eshell\" \"/usr/share/emacs/29.3/lisp/erc\" \"/usr/share/emacs/29.3/lisp/emulation\" \"/usr/share/emacs/29.3/lisp/emacs-lisp\" \"/usr/share/emacs/29.3/lisp/cedet\" \"/usr/share/emacs/29.3/lisp/calendar\" \"/usr/share/emacs/29.3/lisp/calc\" \"/usr/share/emacs/29.3/lisp/obsolete\") user-emacs-directory \"~/.emacs.d/\" ) (package-initialize))" -l test/nrepl-server-mock.el -f nrepl-server-mock-start >nREPL server exited. >[nREPL] server started on 44115 >[nREPL] Establishing direct connection to localhost:44115 ... >[nREPL] Direct connection to localhost:44115 established >[nREPL] Connection closed >nREPL server exited. > start and stop nrepl client process (666.72ms) > >nrepl-dict-merge > merges dictionaries (0.25ms) > handles nil values (0.25ms) > >nrepl-dict-contains > returns non-nil if dict contains the element (0.35ms) > allows `nil' to be a key in the nREPL dict (0.08ms) > returns `nil' if dict doesn't contain the element (0.46ms) > >nrepl-dict-get > when key is present in the dict > returns the corresponding value (0.46ms) > ignores the default value, if given (0.45ms) > when key is not present in the dict > returns nil, when default value is not given (0.38ms) > returns the default value, if given (0.44ms) > >nrepl--cons > cons's the obj onto the list or dict (0.12ms) > >nrepl--push > cons's the obj to the top element of the stack (0.43ms) > >nrepl--keys > returns all keys in the nREPL dict (0.10ms) > >nrepl--vals > returns all values in the nREPL dict (0.10ms) > >nrepl--map > maps a fn over all key-value pairs of a dict (0.12ms) > >nrepl--merge > preserves id and session keys of dict1 (0.12ms) > appends all other keys (0.12ms) > dict1 is updated destructively (0.16ms) > >File failed to load correctly: > ./test/clojure-ts-mode/cider-connection-ts-tests.el Cannot open load file: No such file or directory, clojure-ts-mode (0.03ms) > ./test/clojure-ts-mode/cider-selector-ts-tests.el Cannot open load file: No such file or directory, clojure-ts-mode (0.03ms) > ./test/clojure-ts-mode/cider-util-ts-tests.el Cannot open load file: No such file or directory, clojure-ts-mode (0.03ms) > >======================================== >File failed to load correctly: ./test/clojure-ts-mode/cider-connection-ts-tests.el > >Traceback (most recent call last): > load("./test/clojure-ts-mode/cider-connection-ts-tests.el" nil t nil nil) > load-with-code-conversion("/var/tmp/portage/app-emacs/cider-1.14.0/work/cider-1.14.0/test/clojure-ts-mode/cider-connection-ts-tests.el" "/var/tmp/portage/app-emacs/cider-1.14.0/work/cider-1.14.0/test/clojure-ts-mode/cider-connection-ts-tests.el" nil t) > eval-buffer(#<killed buffer> nil "/var/tmp/portage/app-emacs/cider-1.14.0/work/cider-1.14.0/test/clojure-ts-mode/cider-connection-ts-tests.el" nil t) > require(clojure-ts-mode) >FAILED: Cannot open load file: No such file or directory, clojure-ts-mode > >======================================== >File failed to load correctly: ./test/clojure-ts-mode/cider-selector-ts-tests.el > >Traceback (most recent call last): > load("./test/clojure-ts-mode/cider-selector-ts-tests.el" nil t nil nil) > load-with-code-conversion("/var/tmp/portage/app-emacs/cider-1.14.0/work/cider-1.14.0/test/clojure-ts-mode/cider-selector-ts-tests.el" "/var/tmp/portage/app-emacs/cider-1.14.0/work/cider-1.14.0/test/clojure-ts-mode/cider-selector-ts-tests.el" nil t) > eval-buffer(#<killed buffer> nil "/var/tmp/portage/app-emacs/cider-1.14.0/work/cider-1.14.0/test/clojure-ts-mode/cider-selector-ts-tests.el" nil t) > require(clojure-ts-mode) >FAILED: Cannot open load file: No such file or directory, clojure-ts-mode > >======================================== >File failed to load correctly: ./test/clojure-ts-mode/cider-util-ts-tests.el > >Traceback (most recent call last): > load("./test/clojure-ts-mode/cider-util-ts-tests.el" nil t nil nil) > load-with-code-conversion("/var/tmp/portage/app-emacs/cider-1.14.0/work/cider-1.14.0/test/clojure-ts-mode/cider-util-ts-tests.el" "/var/tmp/portage/app-emacs/cider-1.14.0/work/cider-1.14.0/test/clojure-ts-mode/cider-util-ts-tests.el" nil t) > eval-buffer(#<killed buffer> nil "/var/tmp/portage/app-emacs/cider-1.14.0/work/cider-1.14.0/test/clojure-ts-mode/cider-util-ts-tests.el" nil t) > require(clojure-ts-mode) >FAILED: Cannot open load file: No such file or directory, clojure-ts-mode > >Ran 435 out of 436 specs, 3 failed, in 2.73s. >buttercup-run failed: "" > * ERROR: app-emacs/cider-1.14.0::gentoo failed (test phase): > * tests failed > * > * Call stack: > * ebuild.sh, line 136: Called src_test > * environment, line 1095: Called die > * The specific snippet of code: > * buttercup -L . -L test --traceback full || die "tests failed" > * > * If you need support, post the output of `emerge --info '=app-emacs/cider-1.14.0::gentoo'`, > * the complete build log and the output of `emerge -pqv '=app-emacs/cider-1.14.0::gentoo'`. > * The complete build log is located at '/var/log/emerge-log/build/app-emacs/cider-1.14.0:20240604-154711.log'. > * For convenience, a symlink to the build log is located at '/var/tmp/portage/app-emacs/cider-1.14.0/temp/build.log'. > * The ebuild environment file is located at '/var/tmp/portage/app-emacs/cider-1.14.0/temp/environment'. > * Working directory: '/var/tmp/portage/app-emacs/cider-1.14.0/work/cider-1.14.0' > * S: '/var/tmp/portage/app-emacs/cider-1.14.0/work/cider-1.14.0' >
You cannot view the attachment while viewing its details because your browser does not support IFRAMEs.
View the attachment on a separate page
.
View Attachment As Raw
Actions:
View
Attachments on
bug 933583
: 895098