Go to:
Gentoo Home
Documentation
Forums
Lists
Bugs
Planet
Store
Wiki
Get Gentoo!
Gentoo's Bugzilla – Attachment 894597 Details for
Bug 933042
sci-mathematics/flint-3.1.0: stablereq
Home
|
New
–
[Ex]
|
Browse
|
Search
|
Privacy Policy
|
[?]
|
Reports
|
Requests
|
Help
|
New Account
|
Log In
[x]
|
Forgot Password
Login:
[x]
error messages from building singular-4.3.2 against flint-3.1.0 by running `sudo -u portage make -j12 -k` in /tmp/portage/sci-mathematics/singular-4.3.2_p10/work/singular-4.3.2
flint-3.1.0-singular-errors.txt (text/plain), 30.49 KB, created by
Ellen Emilia Anna Zscheile
on 2024-05-29 11:44:49 UTC
(
hide
)
Description:
error messages from building singular-4.3.2 against flint-3.1.0 by running `sudo -u portage make -j12 -k` in /tmp/portage/sci-mathematics/singular-4.3.2_p10/work/singular-4.3.2
Filename:
MIME Type:
Creator:
Ellen Emilia Anna Zscheile
Created:
2024-05-29 11:44:49 UTC
Size:
30.49 KB
patch
obsolete
>make all-recursive >make[1]: Entering directory '/tmp/portage/sci-mathematics/singular-4.3.2_p10/work/singular-4.3.2' >Making all in resources >make[2]: Entering directory '/tmp/portage/sci-mathematics/singular-4.3.2_p10/work/singular-4.3.2/resources' >make all-am >make[3]: Entering directory '/tmp/portage/sci-mathematics/singular-4.3.2_p10/work/singular-4.3.2/resources' >make[3]: Leaving directory '/tmp/portage/sci-mathematics/singular-4.3.2_p10/work/singular-4.3.2/resources' >make[2]: Leaving directory '/tmp/portage/sci-mathematics/singular-4.3.2_p10/work/singular-4.3.2/resources' >Making all in omalloc >make[2]: Entering directory '/tmp/portage/sci-mathematics/singular-4.3.2_p10/work/singular-4.3.2/omalloc' >make all-am >make[3]: Entering directory '/tmp/portage/sci-mathematics/singular-4.3.2_p10/work/singular-4.3.2/omalloc' >make[3]: Leaving directory '/tmp/portage/sci-mathematics/singular-4.3.2_p10/work/singular-4.3.2/omalloc' >make[2]: Leaving directory '/tmp/portage/sci-mathematics/singular-4.3.2_p10/work/singular-4.3.2/omalloc' >Making all in factory >make[2]: Entering directory '/tmp/portage/sci-mathematics/singular-4.3.2_p10/work/singular-4.3.2/factory' >Makefile:2225: warning: ignoring prerequisites on suffix rule definition >make all-recursive >make[3]: Entering directory '/tmp/portage/sci-mathematics/singular-4.3.2_p10/work/singular-4.3.2/factory' >Makefile:2225: warning: ignoring prerequisites on suffix rule definition >Making all in include/factory >make[4]: Entering directory '/tmp/portage/sci-mathematics/singular-4.3.2_p10/work/singular-4.3.2/factory/include/factory' >make[5]: Entering directory '/tmp/portage/sci-mathematics/singular-4.3.2_p10/work/singular-4.3.2/factory' >Makefile:2225: warning: ignoring prerequisites on suffix rule definition >make[5]: Leaving directory '/tmp/portage/sci-mathematics/singular-4.3.2_p10/work/singular-4.3.2/factory' >make[4]: Nothing to be done for 'all'. >make[4]: Leaving directory '/tmp/portage/sci-mathematics/singular-4.3.2_p10/work/singular-4.3.2/factory/include/factory' >make[4]: Entering directory '/tmp/portage/sci-mathematics/singular-4.3.2_p10/work/singular-4.3.2/factory' >Makefile:2225: warning: ignoring prerequisites on suffix rule definition >/bin/sh ./libtool --tag=CXX --mode=compile x86_64-pc-linux-gnu-g++ -DHAVE_CONFIG_H -I. -I./include -I./include -I. -DFACTORY_BUILDING_DLL -I/tmp/portage/sci-mathematics/singular-4.3.2_p10/work/singular-4.3.2 -I/tmp/portage/sci-mathematics/singular-4.3.2_p10/work/singular-4.3.2 -DSING_NDEBUG -DOM_NDEBUG -O2 -march=znver4 -pipe -fno-strict-aliasing -fno-common -c -o cfModGcd.lo cfModGcd.cc >/bin/sh ./libtool --tag=CXX --mode=compile x86_64-pc-linux-gnu-g++ -DHAVE_CONFIG_H -I. -I./include -I./include -I. -DFACTORY_BUILDING_DLL -I/tmp/portage/sci-mathematics/singular-4.3.2_p10/work/singular-4.3.2 -I/tmp/portage/sci-mathematics/singular-4.3.2_p10/work/singular-4.3.2 -DSING_NDEBUG -DOM_NDEBUG -O2 -march=znver4 -pipe -fno-strict-aliasing -fno-common -c -o facMul.lo facMul.cc >/bin/sh ./libtool --tag=CXX --mode=compile x86_64-pc-linux-gnu-g++ -DHAVE_CONFIG_H -I. -I./include -I./include -I. -DFACTORY_BUILDING_DLL -I/tmp/portage/sci-mathematics/singular-4.3.2_p10/work/singular-4.3.2 -I/tmp/portage/sci-mathematics/singular-4.3.2_p10/work/singular-4.3.2 -DSING_NDEBUG -DOM_NDEBUG -O2 -march=znver4 -pipe -fno-strict-aliasing -fno-common -c -o FLINTconvert.lo FLINTconvert.cc >[ -d ./gftables ] || ln -s ./gftables . >libtool: compile: x86_64-pc-linux-gnu-g++ -DHAVE_CONFIG_H -I. -I./include -I./include -I. -DFACTORY_BUILDING_DLL -I/tmp/portage/sci-mathematics/singular-4.3.2_p10/work/singular-4.3.2 -I/tmp/portage/sci-mathematics/singular-4.3.2_p10/work/singular-4.3.2 -DSING_NDEBUG -DOM_NDEBUG -O2 -march=znver4 -pipe -fno-strict-aliasing -fno-common -c facMul.cc -fPIC -DPIC -o .libs/facMul.o >libtool: compile: x86_64-pc-linux-gnu-g++ -DHAVE_CONFIG_H -I. -I./include -I./include -I. -DFACTORY_BUILDING_DLL -I/tmp/portage/sci-mathematics/singular-4.3.2_p10/work/singular-4.3.2 -I/tmp/portage/sci-mathematics/singular-4.3.2_p10/work/singular-4.3.2 -DSING_NDEBUG -DOM_NDEBUG -O2 -march=znver4 -pipe -fno-strict-aliasing -fno-common -c FLINTconvert.cc -fPIC -DPIC -o .libs/FLINTconvert.o >libtool: compile: x86_64-pc-linux-gnu-g++ -DHAVE_CONFIG_H -I. -I./include -I./include -I. -DFACTORY_BUILDING_DLL -I/tmp/portage/sci-mathematics/singular-4.3.2_p10/work/singular-4.3.2 -I/tmp/portage/sci-mathematics/singular-4.3.2_p10/work/singular-4.3.2 -DSING_NDEBUG -DOM_NDEBUG -O2 -march=znver4 -pipe -fno-strict-aliasing -fno-common -c cfModGcd.cc -fPIC -DPIC -o .libs/cfModGcd.o >FLINTconvert.cc: In function 'void convertFacCF2Fq_t(fmpz_poly_struct*, const CanonicalForm&, const fq_ctx_struct*)': >FLINTconvert.cc:499:3: error: '_fmpz_vec_scalar_mod_fmpz' was not declared in this scope; did you mean 'fmpz_mat_scalar_mod_fmpz'? > 499 | _fmpz_vec_scalar_mod_fmpz (result->coeffs, result->coeffs, result->length, > | ^~~~~~~~~~~~~~~~~~~~~~~~~ > | fmpz_mat_scalar_mod_fmpz >FLINTconvert.cc: In function 'void convFlint_RecPP(const CanonicalForm&, mp_limb_t*, nmod_mpoly_struct*, nmod_mpoly_ctx_struct*, int)': >FLINTconvert.cc:699:5: error: 'nmod_mpoly_push_term_ui_ui' was not declared in this scope; did you mean 'fmpz_mpoly_push_term_ui_ui'? > 699 | nmod_mpoly_push_term_ui_ui(result,c,exp,ctx); > | ^~~~~~~~~~~~~~~~~~~~~~~~~~ > | fmpz_mpoly_push_term_ui_ui >FLINTconvert.cc: In function 'CanonicalForm convFlintMPFactoryP(nmod_mpoly_struct*, nmod_mpoly_ctx_struct*, int)': >FLINTconvert.cc:821:9: error: 'nmod_mpoly_length' was not declared in this scope; did you mean 'nmod_poly_length'? > 821 | int d=nmod_mpoly_length(f,ctx)-1; > | ^~~~~~~~~~~~~~~~~ > | nmod_poly_length >FLINTconvert.cc:825:13: error: 'nmod_mpoly_get_term_coeff_ui' was not declared in this scope; did you mean 'fmpz_mpoly_get_term_coeff_ui'? > 825 | ulong c=nmod_mpoly_get_term_coeff_ui(f,i,ctx); > | ^~~~~~~~~~~~~~~~~~~~~~~~~~~~ > | fmpz_mpoly_get_term_coeff_ui >FLINTconvert.cc:826:5: error: 'nmod_mpoly_get_term_exp_ui' was not declared in this scope; did you mean 'fq_nmod_mpoly_get_term_exp_ui'? > 826 | nmod_mpoly_get_term_exp_ui(exp,f,i,ctx); > | ^~~~~~~~~~~~~~~~~~~~~~~~~~ > | fq_nmod_mpoly_get_term_exp_ui >FLINTconvert.cc: In function 'CanonicalForm mulFlintMP_Zp(const CanonicalForm&, int, const CanonicalForm&, int, int)': >FLINTconvert.cc:889:3: error: 'nmod_mpoly_ctx_init' was not declared in this scope; did you mean 'nmod_mpoly_ctx_t'? > 889 | nmod_mpoly_ctx_init(ctx,N,ORD_LEX,getCharacteristic()); > | ^~~~~~~~~~~~~~~~~~~ > | nmod_mpoly_ctx_t >FLINTconvert.cc:891:3: error: 'nmod_mpoly_init3' was not declared in this scope; did you mean 'nmod_poly_init2'? > 891 | nmod_mpoly_init3(f,lF,bits,ctx); > | ^~~~~~~~~~~~~~~~ > | nmod_poly_init2 >FLINTconvert.cc:895:3: error: 'nmod_mpoly_init' was not declared in this scope; did you mean 'nmod_poly_init'? > 895 | nmod_mpoly_init(res,ctx); > | ^~~~~~~~~~~~~~~ > | nmod_poly_init >FLINTconvert.cc:896:3: error: 'nmod_mpoly_mul' was not declared in this scope; did you mean 'nmod_poly_mul'? > 896 | nmod_mpoly_mul(res,f,g,ctx); > | ^~~~~~~~~~~~~~ > | nmod_poly_mul >FLINTconvert.cc:897:3: error: 'nmod_mpoly_clear' was not declared in this scope; did you mean 'nmod_poly_clear'? > 897 | nmod_mpoly_clear(g,ctx); > | ^~~~~~~~~~~~~~~~ > | nmod_poly_clear >FLINTconvert.cc:901:3: error: 'nmod_mpoly_ctx_clear' was not declared in this scope; did you mean 'fq_nmod_mpoly_ctx_clear'? > 901 | nmod_mpoly_ctx_clear(ctx); > | ^~~~~~~~~~~~~~~~~~~~ > | fq_nmod_mpoly_ctx_clear >FLINTconvert.cc: In function 'CanonicalForm gcdFlintMP_Zp(const CanonicalForm&, const CanonicalForm&)': >FLINTconvert.cc:934:3: error: 'nmod_mpoly_ctx_init' was not declared in this scope; did you mean 'nmod_mpoly_ctx_t'? > 934 | nmod_mpoly_ctx_init(ctx,N,ORD_LEX,getCharacteristic()); > | ^~~~~~~~~~~~~~~~~~~ > | nmod_mpoly_ctx_t >FLINTconvert.cc:936:3: error: 'nmod_mpoly_init3' was not declared in this scope; did you mean 'nmod_poly_init2'? > 936 | nmod_mpoly_init3(f,lf,bits,ctx); > | ^~~~~~~~~~~~~~~~ > | nmod_poly_init2 >FLINTconvert.cc:940:3: error: 'nmod_mpoly_init' was not declared in this scope; did you mean 'nmod_poly_init'? > 940 | nmod_mpoly_init(res,ctx); > | ^~~~~~~~~~~~~~~ > | nmod_poly_init >FLINTconvert.cc:941:10: error: 'nmod_mpoly_gcd' was not declared in this scope; did you mean 'nmod_poly_gcd'? > 941 | int ok=nmod_mpoly_gcd(res,f,g,ctx); > | ^~~~~~~~~~~~~~ > | nmod_poly_gcd >FLINTconvert.cc:942:3: error: 'nmod_mpoly_clear' was not declared in this scope; did you mean 'nmod_poly_clear'? > 942 | nmod_mpoly_clear(g,ctx); > | ^~~~~~~~~~~~~~~~ > | nmod_poly_clear >FLINTconvert.cc:950:3: error: 'nmod_mpoly_ctx_clear' was not declared in this scope; did you mean 'fq_nmod_mpoly_ctx_clear'? > 950 | nmod_mpoly_ctx_clear(ctx); > | ^~~~~~~~~~~~~~~~~~~~ > | fq_nmod_mpoly_ctx_clear >make[4]: *** [Makefile:1274: FLINTconvert.lo] Error 1 >facMul.cc: In function 'CanonicalForm reverseSubstQa(const fmpz_poly_struct*, int, const Variable&, const Variable&, const CanonicalForm&)': >facMul.cc:93:5: error: '_fmpz_vec_set' was not declared in this scope; did you mean 'fmpz_mat_set'? > 93 | _fmpz_vec_set (buf->coeffs, F->coeffs + k, repLength); > | ^~~~~~~~~~~~~ > | fmpz_mat_set >facMul.cc: In function 'void kronSubQa(fmpz_poly_struct*, const CanonicalForm&, int, int)': >facMul.cc:1374:7: error: '_fmpz_vec_set' was not declared in this scope; did you mean 'fmpz_mat_set'? > 1374 | _fmpz_vec_set (result->coeffs + k, buf->coeffs, buf->length); > | ^~~~~~~~~~~~~ > | fmpz_mat_set >facMul.cc:1384:9: error: '_fmpz_vec_set' was not declared in this scope; did you mean 'fmpz_mat_set'? > 1384 | _fmpz_vec_set (result->coeffs + k, buf->coeffs, buf->length); > | ^~~~~~~~~~~~~ > | fmpz_mat_set >facMul.cc: In function 'void kronSubReciproFp(nmod_poly_struct*, nmod_poly_struct*, const CanonicalForm&, int)': >facMul.cc:1397:19: error: 'n_preinvert_limb' was not declared in this scope > 1397 | mp_limb_t ninv= n_preinvert_limb (getCharacteristic()); > | ^~~~~~~~~~~~~~~~ >cfModGcd.cc: In function 'long int gaussianElimFq(CFMatrix&, CFArray&, const Variable&)': >cfModGcd.cc:1809:37: error: cannot convert 'fq_nmod_ctx_struct*' to 'const fq_nmod_mat_struct*' > 1809 | long rk= fq_nmod_mat_rref (FLINTN,ctx); > | ^~~ > | | > | fq_nmod_ctx_struct* >In file included from /usr/include/flint/fq_nmod_mat.h:36, > from FLINTconvert.h:42, > from cfModGcd.cc:53: >/usr/include/flint/fq_mat_templates.h:247:76: note: initializing argument 2 of 'mp_limb_signed_t fq_nmod_mat_rref(fq_nmod_mat_struct*, const fq_nmod_mat_struct*, const fq_nmod_ctx_struct*)' > 247 | slong TEMPLATE(T, mat_rref)(TEMPLATE(T, mat_t) B, const TEMPLATE(T, mat_t) A, const TEMPLATE(T, ctx_t) ctx); > | ~~~~~~~~~~~~~~~~~~~~~~~~~^ >cfModGcd.cc: In function 'CFArray solveSystemFq(const CFMatrix&, const CFArray&, const Variable&)': >cfModGcd.cc:1916:37: error: cannot convert 'fq_nmod_ctx_struct*' to 'const fq_nmod_mat_struct*' > 1916 | long rk= fq_nmod_mat_rref (FLINTN,ctx); > | ^~~ > | | > | fq_nmod_ctx_struct* >/usr/include/flint/fq_mat_templates.h:247:76: note: initializing argument 2 of 'mp_limb_signed_t fq_nmod_mat_rref(fq_nmod_mat_struct*, const fq_nmod_mat_struct*, const fq_nmod_ctx_struct*)' > 247 | slong TEMPLATE(T, mat_rref)(TEMPLATE(T, mat_t) B, const TEMPLATE(T, mat_t) A, const TEMPLATE(T, ctx_t) ctx); > | ~~~~~~~~~~~~~~~~~~~~~~~~~^ >facMul.cc:1414:31: error: 'n_addmod' was not declared in this scope; did you mean '_ntl_gaddmod'? > 1414 | n_addmod (nmod_poly_get_coeff_ui (subA1, j+k), > | ^~~~~~~~ > | _ntl_gaddmod >facMul.cc: In function 'void kronSubReciproQ(fmpz_poly_struct*, fmpz_poly_struct*, const CanonicalForm&, int)': >facMul.cc:1495:5: error: '_fmpz_vec_add' was not declared in this scope; did you mean 'fmpz_mod_add'? > 1495 | _fmpz_vec_add (subA1->coeffs+k, subA1->coeffs + k, buf->coeffs, buf->length); > | ^~~~~~~~~~~~~ > | fmpz_mod_add >facMul.cc: In function 'CanonicalForm reverseSubstQ(const fmpz_poly_struct*, int)': >facMul.cc:1525:5: error: '_fmpz_vec_set' was not declared in this scope; did you mean 'fmpz_mat_set'? > 1525 | _fmpz_vec_set (buf->coeffs, F->coeffs+k, repLength); > | ^~~~~~~~~~~~~ > | fmpz_mat_set >facMul.cc: In function 'CanonicalForm reverseSubstQa(const fmpz_poly_struct*, int, int, const Variable&, const fmpq_poly_struct*)': >facMul.cc:1637:7: error: '_fmpz_vec_set' was not declared in this scope; did you mean 'fmpz_mat_set'? > 1637 | _fmpz_vec_set (buf->coeffs, F->coeffs + k + j*d2, d2); > | ^~~~~~~~~~~~~ > | fmpz_mat_set >facMul.cc:1651:7: error: '_fmpz_vec_set' was not declared in this scope; did you mean 'fmpz_mat_set'? > 1651 | _fmpz_vec_set (buf->coeffs, F->coeffs + k + j*d2, repLength); > | ^~~~~~~~~~~~~ > | fmpz_mat_set >facMul.cc: In function 'CanonicalForm reverseSubstReciproFp(const nmod_poly_struct*, const nmod_poly_struct*, int, int)': >facMul.cc:1673:19: error: 'n_preinvert_limb' was not declared in this scope > 1673 | mp_limb_t ninv= n_preinvert_limb (getCharacteristic()); > | ^~~~~~~~~~~~~~~~ >facMul.cc:1750:33: error: 'n_submod' was not declared in this scope; did you mean '_ntl_gsubmod'? > 1750 | n_submod (nmod_poly_get_coeff_ui (g, ind + lg), > | ^~~~~~~~ > | _ntl_gsubmod >facMul.cc:1767:33: error: 'n_submod' was not declared in this scope; did you mean '_ntl_gsubmod'? > 1767 | n_submod (nmod_poly_get_coeff_ui (f, ind + lf), > | ^~~~~~~~ > | _ntl_gsubmod >facMul.cc: In function 'CanonicalForm reverseSubstFp(const nmod_poly_struct*, int)': >facMul.cc:2064:19: error: 'n_preinvert_limb' was not declared in this scope > 2064 | mp_limb_t ninv= n_preinvert_limb (getCharacteristic()); > | ^~~~~~~~~~~~~~~~ >make[4]: *** [Makefile:1274: cfModGcd.lo] Error 1 >make[4]: *** [Makefile:1274: facMul.lo] Error 1 >make[4]: Target 'all-am' not remade because of errors. >make[4]: Leaving directory '/tmp/portage/sci-mathematics/singular-4.3.2_p10/work/singular-4.3.2/factory' >make[3]: *** [Makefile:1379: all-recursive] Error 1 >make[3]: Leaving directory '/tmp/portage/sci-mathematics/singular-4.3.2_p10/work/singular-4.3.2/factory' >make[2]: *** [Makefile:1041: all] Error 2 >make[2]: Leaving directory '/tmp/portage/sci-mathematics/singular-4.3.2_p10/work/singular-4.3.2/factory' >Making all in libpolys >make[2]: Entering directory '/tmp/portage/sci-mathematics/singular-4.3.2_p10/work/singular-4.3.2/libpolys' >make all-recursive >make[3]: Entering directory '/tmp/portage/sci-mathematics/singular-4.3.2_p10/work/singular-4.3.2/libpolys' >Making all in misc >make[4]: Entering directory '/tmp/portage/sci-mathematics/singular-4.3.2_p10/work/singular-4.3.2/libpolys/misc' >make[4]: Nothing to be done for 'all'. >make[4]: Leaving directory '/tmp/portage/sci-mathematics/singular-4.3.2_p10/work/singular-4.3.2/libpolys/misc' >Making all in reporter >make[4]: Entering directory '/tmp/portage/sci-mathematics/singular-4.3.2_p10/work/singular-4.3.2/libpolys/reporter' >make[4]: Nothing to be done for 'all'. >make[4]: Leaving directory '/tmp/portage/sci-mathematics/singular-4.3.2_p10/work/singular-4.3.2/libpolys/reporter' >Making all in coeffs >make[4]: Entering directory '/tmp/portage/sci-mathematics/singular-4.3.2_p10/work/singular-4.3.2/libpolys/coeffs' >/bin/sh ../libtool --tag=CXX --mode=link x86_64-pc-linux-gnu-g++ -O2 -march=znver4 -pipe -fno-strict-aliasing -fno-common -Wl,-O1 -Wl,--as-needed -Wl,-z,pack-relative-relocs -pipe -fno-common -rdynamic -Wl,-undefined,dynamic_lookup -o libcoeffs.la numbers.lo rintegers.lo rmodulo2m.lo rmodulon.lo shortfl.lo gnumpc.lo gnumpfl.lo longrat.lo longrat0.lo ffields.lo modulop.lo mpr_complex.lo ntupel.lo bigintmat.lo flintcf_Qrat.lo flintcf_Q.lo flintcf_Zn.lo ../reporter/libreporter.la ../misc/libmisc.la /tmp/portage/sci-mathematics/singular-4.3.2_p10/work/singular-4.3.2/factory/libfactory.la /tmp/portage/sci-mathematics/singular-4.3.2_p10/work/singular-4.3.2/resources/libsingular_resources.la /tmp/portage/sci-mathematics/singular-4.3.2_p10/work/singular-4.3.2/omalloc/libomalloc.la -lflint -lmpfr -lgmp -lgmp -lntl -lgmp >libtool: error: cannot find the library '/tmp/portage/sci-mathematics/singular-4.3.2_p10/work/singular-4.3.2/factory/libfactory.la' or unhandled argument '/tmp/portage/sci-mathematics/singular-4.3.2_p10/work/singular-4.3.2/factory/libfactory.la' >make[4]: *** [Makefile:692: libcoeffs.la] Error 1 >make[4]: Target 'all' not remade because of errors. >make[4]: Leaving directory '/tmp/portage/sci-mathematics/singular-4.3.2_p10/work/singular-4.3.2/libpolys/coeffs' >Making all in polys >make[4]: Entering directory '/tmp/portage/sci-mathematics/singular-4.3.2_p10/work/singular-4.3.2/libpolys/polys' >if [ -d "../libpolys/polys/.libs" ]; then \ > ln -snf ../libpolys/polys/.libs/ /tmp/portage/sci-mathematics/singular-4.3.2_p10/work/singular-4.3.2/libpolys/polys/MOD; \ >fi >make all-am >make[5]: Entering directory '/tmp/portage/sci-mathematics/singular-4.3.2_p10/work/singular-4.3.2/libpolys/polys' >make[5]: *** No rule to make target '../coeffs/libcoeffs.la', needed by 'libpolys.la'. >make[5]: Target 'all-am' not remade because of errors. >make[5]: Leaving directory '/tmp/portage/sci-mathematics/singular-4.3.2_p10/work/singular-4.3.2/libpolys/polys' >make[4]: *** [Makefile:792: all] Error 2 >make[4]: Leaving directory '/tmp/portage/sci-mathematics/singular-4.3.2_p10/work/singular-4.3.2/libpolys/polys' >Making all in tests >make[4]: Entering directory '/tmp/portage/sci-mathematics/singular-4.3.2_p10/work/singular-4.3.2/libpolys/tests' >if [ -d "../libpolys/polys/.libs" ]; then \ > ln -snf ../libpolys/polys/.libs/ /tmp/portage/sci-mathematics/singular-4.3.2_p10/work/singular-4.3.2/libpolys/tests/MOD; \ >fi >make all-am >make[5]: Entering directory '/tmp/portage/sci-mathematics/singular-4.3.2_p10/work/singular-4.3.2/libpolys/tests' >make[5]: Nothing to be done for 'all-am'. >make[5]: Leaving directory '/tmp/portage/sci-mathematics/singular-4.3.2_p10/work/singular-4.3.2/libpolys/tests' >make[4]: Leaving directory '/tmp/portage/sci-mathematics/singular-4.3.2_p10/work/singular-4.3.2/libpolys/tests' >make[4]: Entering directory '/tmp/portage/sci-mathematics/singular-4.3.2_p10/work/singular-4.3.2/libpolys' >make[4]: Leaving directory '/tmp/portage/sci-mathematics/singular-4.3.2_p10/work/singular-4.3.2/libpolys' >make[3]: *** [Makefile:593: all-recursive] Error 1 >make[3]: Leaving directory '/tmp/portage/sci-mathematics/singular-4.3.2_p10/work/singular-4.3.2/libpolys' >make[2]: *** [Makefile:444: all] Error 2 >make[2]: Leaving directory '/tmp/portage/sci-mathematics/singular-4.3.2_p10/work/singular-4.3.2/libpolys' >Making all in gfanlib >make[2]: Entering directory '/tmp/portage/sci-mathematics/singular-4.3.2_p10/work/singular-4.3.2/gfanlib' >make all-am >make[3]: Entering directory '/tmp/portage/sci-mathematics/singular-4.3.2_p10/work/singular-4.3.2/gfanlib' >make[3]: Leaving directory '/tmp/portage/sci-mathematics/singular-4.3.2_p10/work/singular-4.3.2/gfanlib' >make[2]: Leaving directory '/tmp/portage/sci-mathematics/singular-4.3.2_p10/work/singular-4.3.2/gfanlib' >Making all in IntegerProgramming >make[2]: Entering directory '/tmp/portage/sci-mathematics/singular-4.3.2_p10/work/singular-4.3.2/IntegerProgramming' >make[2]: Nothing to be done for 'all'. >make[2]: Leaving directory '/tmp/portage/sci-mathematics/singular-4.3.2_p10/work/singular-4.3.2/IntegerProgramming' >Making all in kernel >make[2]: Entering directory '/tmp/portage/sci-mathematics/singular-4.3.2_p10/work/singular-4.3.2/kernel' >Making all in numeric >make[3]: Entering directory '/tmp/portage/sci-mathematics/singular-4.3.2_p10/work/singular-4.3.2/kernel/numeric' >make[3]: Nothing to be done for 'all'. >make[3]: Leaving directory '/tmp/portage/sci-mathematics/singular-4.3.2_p10/work/singular-4.3.2/kernel/numeric' >Making all in fglm >make[3]: Entering directory '/tmp/portage/sci-mathematics/singular-4.3.2_p10/work/singular-4.3.2/kernel/fglm' >make[3]: Nothing to be done for 'all'. >make[3]: Leaving directory '/tmp/portage/sci-mathematics/singular-4.3.2_p10/work/singular-4.3.2/kernel/fglm' >Making all in groebner_walk >make[3]: Entering directory '/tmp/portage/sci-mathematics/singular-4.3.2_p10/work/singular-4.3.2/kernel/groebner_walk' >make[3]: Nothing to be done for 'all'. >make[3]: Leaving directory '/tmp/portage/sci-mathematics/singular-4.3.2_p10/work/singular-4.3.2/kernel/groebner_walk' >Making all in combinatorics >make[3]: Entering directory '/tmp/portage/sci-mathematics/singular-4.3.2_p10/work/singular-4.3.2/kernel/combinatorics' >make[3]: Nothing to be done for 'all'. >make[3]: Leaving directory '/tmp/portage/sci-mathematics/singular-4.3.2_p10/work/singular-4.3.2/kernel/combinatorics' >Making all in spectrum >make[3]: Entering directory '/tmp/portage/sci-mathematics/singular-4.3.2_p10/work/singular-4.3.2/kernel/spectrum' >make[3]: Nothing to be done for 'all'. >make[3]: Leaving directory '/tmp/portage/sci-mathematics/singular-4.3.2_p10/work/singular-4.3.2/kernel/spectrum' >Making all in linear_algebra >make[3]: Entering directory '/tmp/portage/sci-mathematics/singular-4.3.2_p10/work/singular-4.3.2/kernel/linear_algebra' >make[3]: Nothing to be done for 'all'. >make[3]: Leaving directory '/tmp/portage/sci-mathematics/singular-4.3.2_p10/work/singular-4.3.2/kernel/linear_algebra' >Making all in maps >make[3]: Entering directory '/tmp/portage/sci-mathematics/singular-4.3.2_p10/work/singular-4.3.2/kernel/maps' >make[3]: Nothing to be done for 'all'. >make[3]: Leaving directory '/tmp/portage/sci-mathematics/singular-4.3.2_p10/work/singular-4.3.2/kernel/maps' >Making all in GBEngine >make[3]: Entering directory '/tmp/portage/sci-mathematics/singular-4.3.2_p10/work/singular-4.3.2/kernel/GBEngine' >make[3]: Nothing to be done for 'all'. >make[3]: Leaving directory '/tmp/portage/sci-mathematics/singular-4.3.2_p10/work/singular-4.3.2/kernel/GBEngine' >Making all in oswrapper >make[3]: Entering directory '/tmp/portage/sci-mathematics/singular-4.3.2_p10/work/singular-4.3.2/kernel/oswrapper' >make[3]: Nothing to be done for 'all'. >make[3]: Leaving directory '/tmp/portage/sci-mathematics/singular-4.3.2_p10/work/singular-4.3.2/kernel/oswrapper' >make[3]: Entering directory '/tmp/portage/sci-mathematics/singular-4.3.2_p10/work/singular-4.3.2/kernel' >make[3]: *** No rule to make target '/tmp/portage/sci-mathematics/singular-4.3.2_p10/work/singular-4.3.2/libpolys/polys/libpolys.la', needed by 'libkernelCommon.la'. >make[3]: Target 'all-am' not remade because of errors. >make[3]: Leaving directory '/tmp/portage/sci-mathematics/singular-4.3.2_p10/work/singular-4.3.2/kernel' >make[2]: *** [Makefile:884: all-recursive] Error 1 >make[2]: Target 'all' not remade because of errors. >make[2]: Leaving directory '/tmp/portage/sci-mathematics/singular-4.3.2_p10/work/singular-4.3.2/kernel' >Making all in Singular >make[2]: Entering directory '/tmp/portage/sci-mathematics/singular-4.3.2_p10/work/singular-4.3.2/Singular' >make all-recursive >make[3]: Entering directory '/tmp/portage/sci-mathematics/singular-4.3.2_p10/work/singular-4.3.2/Singular' >Making all in dyn_modules >make[4]: Entering directory '/tmp/portage/sci-mathematics/singular-4.3.2_p10/work/singular-4.3.2/Singular/dyn_modules' >Making all in subsets >make[5]: Entering directory '/tmp/portage/sci-mathematics/singular-4.3.2_p10/work/singular-4.3.2/Singular/dyn_modules/subsets' >make[5]: Nothing to be done for 'all'. >make[5]: Leaving directory '/tmp/portage/sci-mathematics/singular-4.3.2_p10/work/singular-4.3.2/Singular/dyn_modules/subsets' >Making all in syzextra >make[5]: Entering directory '/tmp/portage/sci-mathematics/singular-4.3.2_p10/work/singular-4.3.2/Singular/dyn_modules/syzextra' >make[5]: Nothing to be done for 'all'. >make[5]: Leaving directory '/tmp/portage/sci-mathematics/singular-4.3.2_p10/work/singular-4.3.2/Singular/dyn_modules/syzextra' >Making all in customstd >make[5]: Entering directory '/tmp/portage/sci-mathematics/singular-4.3.2_p10/work/singular-4.3.2/Singular/dyn_modules/customstd' >make[5]: Nothing to be done for 'all'. >make[5]: Leaving directory '/tmp/portage/sci-mathematics/singular-4.3.2_p10/work/singular-4.3.2/Singular/dyn_modules/customstd' >Making all in gfanlib >make[5]: Entering directory '/tmp/portage/sci-mathematics/singular-4.3.2_p10/work/singular-4.3.2/Singular/dyn_modules/gfanlib' >make[5]: Nothing to be done for 'all'. >make[5]: Leaving directory '/tmp/portage/sci-mathematics/singular-4.3.2_p10/work/singular-4.3.2/Singular/dyn_modules/gfanlib' >Making all in gitfan >make[5]: Entering directory '/tmp/portage/sci-mathematics/singular-4.3.2_p10/work/singular-4.3.2/Singular/dyn_modules/gitfan' >make[5]: Nothing to be done for 'all'. >make[5]: Leaving directory '/tmp/portage/sci-mathematics/singular-4.3.2_p10/work/singular-4.3.2/Singular/dyn_modules/gitfan' >Making all in singmathic >make[5]: Entering directory '/tmp/portage/sci-mathematics/singular-4.3.2_p10/work/singular-4.3.2/Singular/dyn_modules/singmathic' >make[5]: Nothing to be done for 'all'. >make[5]: Leaving directory '/tmp/portage/sci-mathematics/singular-4.3.2_p10/work/singular-4.3.2/Singular/dyn_modules/singmathic' >Making all in interval >make[5]: Entering directory '/tmp/portage/sci-mathematics/singular-4.3.2_p10/work/singular-4.3.2/Singular/dyn_modules/interval' >make[5]: Nothing to be done for 'all'. >make[5]: Leaving directory '/tmp/portage/sci-mathematics/singular-4.3.2_p10/work/singular-4.3.2/Singular/dyn_modules/interval' >Making all in cohomo >make[5]: Entering directory '/tmp/portage/sci-mathematics/singular-4.3.2_p10/work/singular-4.3.2/Singular/dyn_modules/cohomo' >make[5]: Nothing to be done for 'all'. >make[5]: Leaving directory '/tmp/portage/sci-mathematics/singular-4.3.2_p10/work/singular-4.3.2/Singular/dyn_modules/cohomo' >Making all in freealgebra >make[5]: Entering directory '/tmp/portage/sci-mathematics/singular-4.3.2_p10/work/singular-4.3.2/Singular/dyn_modules/freealgebra' >make[5]: Nothing to be done for 'all'. >make[5]: Leaving directory '/tmp/portage/sci-mathematics/singular-4.3.2_p10/work/singular-4.3.2/Singular/dyn_modules/freealgebra' >Making all in partialgb >make[5]: Entering directory '/tmp/portage/sci-mathematics/singular-4.3.2_p10/work/singular-4.3.2/Singular/dyn_modules/partialgb' >make[5]: Nothing to be done for 'all'. >make[5]: Leaving directory '/tmp/portage/sci-mathematics/singular-4.3.2_p10/work/singular-4.3.2/Singular/dyn_modules/partialgb' >Making all in systhreads >make[5]: Entering directory '/tmp/portage/sci-mathematics/singular-4.3.2_p10/work/singular-4.3.2/Singular/dyn_modules/systhreads' >make[5]: Nothing to be done for 'all'. >make[5]: Leaving directory '/tmp/portage/sci-mathematics/singular-4.3.2_p10/work/singular-4.3.2/Singular/dyn_modules/systhreads' >Making all in loctriv >make[5]: Entering directory '/tmp/portage/sci-mathematics/singular-4.3.2_p10/work/singular-4.3.2/Singular/dyn_modules/loctriv' >make[5]: Nothing to be done for 'all'. >make[5]: Leaving directory '/tmp/portage/sci-mathematics/singular-4.3.2_p10/work/singular-4.3.2/Singular/dyn_modules/loctriv' >Making all in machinelearning >make[5]: Entering directory '/tmp/portage/sci-mathematics/singular-4.3.2_p10/work/singular-4.3.2/Singular/dyn_modules/machinelearning' >make[5]: Nothing to be done for 'all'. >make[5]: Leaving directory '/tmp/portage/sci-mathematics/singular-4.3.2_p10/work/singular-4.3.2/Singular/dyn_modules/machinelearning' >Making all in sispasm >make[5]: Entering directory '/tmp/portage/sci-mathematics/singular-4.3.2_p10/work/singular-4.3.2/Singular/dyn_modules/sispasm' >make[5]: Nothing to be done for 'all'. >make[5]: Leaving directory '/tmp/portage/sci-mathematics/singular-4.3.2_p10/work/singular-4.3.2/Singular/dyn_modules/sispasm' >make[5]: Entering directory '/tmp/portage/sci-mathematics/singular-4.3.2_p10/work/singular-4.3.2/Singular/dyn_modules' >make[5]: Nothing to be done for 'all-am'. >make[5]: Leaving directory '/tmp/portage/sci-mathematics/singular-4.3.2_p10/work/singular-4.3.2/Singular/dyn_modules' >make[4]: Leaving directory '/tmp/portage/sci-mathematics/singular-4.3.2_p10/work/singular-4.3.2/Singular/dyn_modules' >Making all in . >make[4]: Entering directory '/tmp/portage/sci-mathematics/singular-4.3.2_p10/work/singular-4.3.2/Singular' >make[4]: *** No rule to make target '../kernel/libkernel.la', needed by 'libSingular.la'. >make[4]: Target 'all-am' not remade because of errors. >make[4]: Leaving directory '/tmp/portage/sci-mathematics/singular-4.3.2_p10/work/singular-4.3.2/Singular' >make[3]: *** [Makefile:1910: all-recursive] Error 1 >make[3]: Leaving directory '/tmp/portage/sci-mathematics/singular-4.3.2_p10/work/singular-4.3.2/Singular' >make[2]: *** [Makefile:983: all] Error 2 >make[2]: Leaving directory '/tmp/portage/sci-mathematics/singular-4.3.2_p10/work/singular-4.3.2/Singular' >Making all in dox >make[2]: Entering directory '/tmp/portage/sci-mathematics/singular-4.3.2_p10/work/singular-4.3.2/dox' >make[2]: Nothing to be done for 'all'. >make[2]: Leaving directory '/tmp/portage/sci-mathematics/singular-4.3.2_p10/work/singular-4.3.2/dox' >Making all in emacs >make[2]: Entering directory '/tmp/portage/sci-mathematics/singular-4.3.2_p10/work/singular-4.3.2/emacs' >make[2]: Nothing to be done for 'all'. >make[2]: Leaving directory '/tmp/portage/sci-mathematics/singular-4.3.2_p10/work/singular-4.3.2/emacs' >Making all in redhat >make[2]: Entering directory '/tmp/portage/sci-mathematics/singular-4.3.2_p10/work/singular-4.3.2/redhat' >make[2]: Nothing to be done for 'all'. >make[2]: Leaving directory '/tmp/portage/sci-mathematics/singular-4.3.2_p10/work/singular-4.3.2/redhat' >Making all in desktop >make[2]: Entering directory '/tmp/portage/sci-mathematics/singular-4.3.2_p10/work/singular-4.3.2/desktop' >make[2]: Nothing to be done for 'all'. >make[2]: Leaving directory '/tmp/portage/sci-mathematics/singular-4.3.2_p10/work/singular-4.3.2/desktop' >make[2]: Entering directory '/tmp/portage/sci-mathematics/singular-4.3.2_p10/work/singular-4.3.2' >make[2]: Leaving directory '/tmp/portage/sci-mathematics/singular-4.3.2_p10/work/singular-4.3.2' >make[1]: *** [Makefile:624: all-recursive] Error 1 >make[1]: Leaving directory '/tmp/portage/sci-mathematics/singular-4.3.2_p10/work/singular-4.3.2' >make: *** [Makefile:475: all] Error 2
You cannot view the attachment while viewing its details because your browser does not support IFRAMEs.
View the attachment on a separate page
.
View Attachment As Raw
Actions:
View
Attachments on
bug 933042
: 894597