Go to:
Gentoo Home
Documentation
Forums
Lists
Bugs
Planet
Store
Wiki
Get Gentoo!
Gentoo's Bugzilla – Attachment 892074 Details for
Bug 931017
dev-python/pdm-backend-2.3.0 fails tests: ERROR test_scm.py::test__get_version_from_scm__returns_tag_if_method_unspecified[hg] - AssertionError: Cannot find hg in path
Home
|
New
–
[Ex]
|
Browse
|
Search
|
Privacy Policy
|
[?]
|
Reports
|
Requests
|
Help
|
New Account
|
Log In
[x]
|
Forgot Password
Login:
[x]
build.log
build.log (text/plain), 124.44 KB, created by
Agostino Sarubbo
on 2024-05-01 11:19:53 UTC
(
hide
)
Description:
build.log
Filename:
MIME Type:
Creator:
Agostino Sarubbo
Created:
2024-05-01 11:19:53 UTC
Size:
124.44 KB
patch
obsolete
> * Package: dev-python/pdm-backend-2.3.0:0 > * Repository: gentoo > * Maintainer: python@gentoo.org > * USE: abi_x86_64 amd64 elibc_glibc kernel_linux python_targets_pypy3 python_targets_python3_10 python_targets_python3_11 python_targets_python3_12 test > * FEATURES: network-sandbox preserve-libs sandbox test userpriv usersandbox > > >@@@@@ PLEASE PAY ATTENTION HERE!!! @@@@@ >This information may help you to understand if this is a duplicate or if this bug exists after you pushed a fix; >This ebuild was merged at the following commit: >https://github.com/gentoo/gentoo/commit/855c073a6c797999fab4fb6807af82227ecbcc37 (Wed May 1 05:00:05 UTC 2024) >@@@@@ END @@@@@ > > > >@@@@@ PLEASE PAY ATTENTION HERE!!! @@@@@ >This ebuild was merged (directly or as a dependency) because of the following commit: >https://github.com/gentoo/gentoo/commit/dfea4480979a79920e90bd5a6976cb51280954c2 >@@@@@ END @@@@@ > > > >################## ># emerge --info: # >################## >Portage 3.0.64 (python 3.12.3-final-0, default/linux/amd64/17.1, gcc-13, glibc-2.39-r4, 6.1.87-gentoo-dist x86_64) >================================================================= >System uname: Linux-6.1.87-gentoo-dist-x86_64-AMD_EPYC_7513_32-Core_Processor-with-glibc2.39 >KiB Mem: 263449376 total, 175229512 free >KiB Swap: 0 total, 0 free >sh bash 5.2_p26-r3 >ld GNU ld (Gentoo 2.42 p3) 2.42.0 >app-misc/pax-utils: 1.3.7::gentoo >app-shells/bash: 5.2_p26-r3::gentoo >dev-build/autoconf: 2.72-r1::gentoo >dev-build/automake: 1.16.5-r2::gentoo >dev-build/cmake: 3.29.2::gentoo >dev-build/libtool: 2.4.7-r4::gentoo >dev-build/make: 4.4.1-r1::gentoo >dev-build/meson: 1.4.0-r1::gentoo >dev-lang/perl: 5.38.2-r2::gentoo >dev-lang/python: 3.10.14_p1::gentoo, 3.11.9::gentoo, 3.12.3::gentoo >sys-apps/baselayout: 2.15::gentoo >sys-apps/openrc: 0.54::gentoo >sys-apps/sandbox: 2.38::gentoo >sys-devel/binutils: 2.42-r1::gentoo >sys-devel/binutils-config: 5.5::gentoo >sys-devel/gcc: 13.2.1_p20240210::gentoo >sys-devel/gcc-config: 2.11::gentoo >sys-kernel/linux-headers: 6.8-r1::gentoo (virtual/os-headers) >sys-libs/glibc: 2.39-r4::gentoo >Repositories: > >gentoo > location: /usr/portage > sync-type: rsync > sync-uri: rsync://rsync.gentoo.org/gentoo-portage > priority: -1000 > volatile: True > sync-rsync-verify-jobs: 1 > sync-rsync-verify-metamanifest: yes > sync-rsync-extra-opts: > sync-rsync-verify-max-age: 3 > >ACCEPT_KEYWORDS="amd64 ~amd64" >ACCEPT_LICENSE="* MIT" >CBUILD="x86_64-pc-linux-gnu" >CFLAGS="-O2 -march=x86-64 -pipe -pipe -frecord-gcc-switches -fno-diagnostics-color -fmessage-length=0" >CHOST="x86_64-pc-linux-gnu" >CONFIG_PROTECT="/etc /usr/share/gnupg/qualified.txt" >CONFIG_PROTECT_MASK="/etc/ca-certificates.conf /etc/env.d /etc/fonts/fonts.conf /etc/gconf /etc/gentoo-release /etc/revdep-rebuild /etc/sandbox.d /etc/terminfo" >CXXFLAGS="-O2 -march=x86-64 -pipe -pipe -frecord-gcc-switches -fno-diagnostics-color -fmessage-length=0" >DISTDIR="/var/tmp/portage/dev-python/pdm-backend-2.3.0/distdir" >EMERGE_DEFAULT_OPTS="--complete-graph y --with-bdeps=y -1 -k -b --backtrack=100" >ENV_UNSET="CARGO_HOME DBUS_SESSION_BUS_ADDRESS DISPLAY GDK_PIXBUF_MODULE_FILE GOBIN GOPATH PERL5LIB PERL5OPT PERLPREFIX PERL_CORE PERL_MB_OPT PERL_MM_OPT XAUTHORITY XDG_CACHE_HOME XDG_CONFIG_HOME XDG_DATA_HOME XDG_RUNTIME_DIR XDG_STATE_HOME" >FCFLAGS="-O2 -march=x86-64 -pipe -pipe -frecord-gcc-switches -fno-diagnostics-color -fmessage-length=0" >FEATURES="assume-digests binpkg-docompress binpkg-dostrip binpkg-logs binpkg-multi-instance buildpkg buildpkg-live config-protect-if-modified distlocks ebuild-locks fixlafiles ipc-sandbox merge-sync merge-wait multilib-strict network-sandbox news parallel-fetch pid-sandbox pkgdir-index-trusted preserve-libs protect-owned qa-unresolved-soname-deps sandbox sfperms sign split-log strict test unknown-features-warn unmerge-logs unmerge-orphans userfetch userpriv usersandbox usersync xattr" >FFLAGS="-O2 -march=x86-64 -pipe -pipe -frecord-gcc-switches -fno-diagnostics-color -fmessage-length=0" >GENTOO_MIRRORS="http://mirror.leaseweb.com/gentoo/ http://ftp.snt.utwente.nl/pub/os/linux/gentoo/ http://ftp.belnet.be/pub/rsync.gentoo.org/gentoo/ http://distfiles.gentoo.org" >LANG="en_US.utf8" >LDFLAGS="-Wl,-O1 -Wl,--as-needed -Wl,--defsym=__gentoo_check_ldflags__=0" >LEX="flex" >MAKEOPTS="-j30" >PKGDIR="/root/tbci/binpkg" >PORTAGE_CONFIGROOT="/" >PORTAGE_RSYNC_OPTS="--recursive --links --safe-links --perms --times --omit-dir-times --compress --force --whole-file --delete --stats --human-readable --timeout=180 --exclude=/distfiles --exclude=/local --exclude=/packages --exclude=/.git" >PORTAGE_TMPDIR="/var/tmp" >SHELL="/bin/bash" >USE="acl amd64 bzip2 cli crypt debug dri elogind fortran gdbm iconv ipv6 jumbo-build libtirpc multilib native-symlinks ncurses nls openmp pam pcre readline seccomp split-usr ssl test test-rust unicode xattr zlib" ABI_X86="64" ELIBC="glibc" KERNEL="linux" PYTHON_TARGETS="pypy3 python3_10 python3_11 python3_12" >Unset: ADDR2LINE, AR, ARFLAGS, AS, ASFLAGS, CC, CCLD, CONFIG_SHELL, CPP, CPPFLAGS, CTARGET, CXX, CXXFILT, ELFEDIT, EXTRA_ECONF, F77FLAGS, FC, GCOV, GPROF, INSTALL_MASK, LC_ALL, LD, LFLAGS, LIBTOOL, LINGUAS, MAKE, MAKEFLAGS, NM, OBJCOPY, OBJDUMP, PORTAGE_BINHOST, PORTAGE_BUNZIP2_COMMAND, PORTAGE_COMPRESS, PORTAGE_COMPRESS_FLAGS, PORTAGE_RSYNC_EXTRA_OPTS, PYTHONPATH, RANLIB, READELF, RUSTFLAGS, SIZE, STRINGS, STRIP, YACC, YFLAGS > > > > > >############################## ># emerge history (qlop -mv): # >############################## >2024-05-01T08:19:24 >>> dev-python/tomli-w-1.0.0-r1 >2024-05-01T08:19:30 >>> dev-python/pyproject-metadata-0.8.0 >2024-05-01T08:19:37 >>> dev-python/iniconfig-2.0.0 >2024-05-01T08:19:42 >>> dev-python/exceptiongroup-1.2.1 >2024-05-01T08:19:48 >>> dev-python/pytest-8.2.0 > > > > >####################################### ># installed packages (qlist -ICvUSS): # >####################################### >acct-group/audio-0-r3:0 >acct-group/cdrom-0-r3:0 >acct-group/dialout-0-r3:0 >acct-group/disk-0-r3:0 >acct-group/floppy-0-r1:0 >acct-group/input-0-r3:0 >acct-group/kmem-0-r3:0 >acct-group/kvm-0-r3:0 >acct-group/lp-0-r3:0 >acct-group/man-0-r3:0 >acct-group/messagebus-0-r3:0 >acct-group/polkitd-0-r3:0 >acct-group/portage-0-r2:0 >acct-group/render-0-r3:0 >acct-group/root-0-r2:0 >acct-group/sgx-0-r2:0 >acct-group/sshd-0-r3:0 >acct-group/tape-0-r3:0 >acct-group/tty-0-r3:0 >acct-group/usb-0-r3:0 >acct-group/video-0-r3:0 >acct-user/man-1-r3:0 >acct-user/messagebus-0-r3:0 >acct-user/polkitd-0-r3:0 >acct-user/portage-0-r3:0 >acct-user/sshd-0-r3:0 >app-admin/eselect-1.4.27-r1:0 -doc -emacs -vim-syntax >app-admin/perl-cleaner-2.31:0 -pkgcore >app-alternatives/awk-4:0 -busybox gawk -mawk -nawk split-usr >app-alternatives/bc-0:0 -gh gnu >app-alternatives/bzip2-1:0 -lbzip2 -pbzip2 reference split-usr >app-alternatives/cpio-0:0 gnu -libarchive split-usr >app-alternatives/gzip-1:0 -pigz reference split-usr >app-alternatives/lex-0-r1:0 flex -reflex >app-alternatives/ninja-1:0 reference -samurai >app-alternatives/sh-0:0 bash -busybox -dash -ksh -lksh -mksh >app-alternatives/tar-0:0 gnu -libarchive split-usr >app-alternatives/yacc-1-r2:0 bison -byacc -reference >app-arch/bzip2-1.0.8-r5:0/1 -abi_mips_n32 -abi_mips_n64 -abi_mips_o32 -abi_s390_32 -abi_s390_64 -abi_x86_32 abi_x86_64 -abi_x86_x32 -static -static-libs -verify-sig >app-arch/cpio-2.15:0 nls >app-arch/gzip-1.13:0 -pic -static -verify-sig >app-arch/libarchive-3.7.4:0/13 -abi_mips_n32 -abi_mips_n64 -abi_mips_o32 -abi_s390_32 -abi_s390_64 -abi_x86_32 abi_x86_64 -abi_x86_x32 acl -blake2 bzip2 e2fsprogs -expat iconv -lz4 lzma -lzo -nettle -static-libs -test -verify-sig xattr zstd >app-arch/tar-1.35:0 acl -minimal nls -selinux -verify-sig xattr >app-arch/unzip-6.0_p27-r1:0 bzip2 -natspec unicode >app-arch/xz-utils-5.4.2:0 -abi_mips_n32 -abi_mips_n64 -abi_mips_o32 -abi_s390_32 -abi_s390_64 -abi_x86_32 abi_x86_64 -abi_x86_x32 -doc extra-filters nls -pgo -static-libs -verify-sig >app-arch/zstd-1.5.6:0/1 -abi_mips_n32 -abi_mips_n64 -abi_mips_o32 -abi_s390_32 -abi_s390_64 -abi_x86_32 abi_x86_64 -abi_x86_x32 -lz4 lzma -static-libs -test zlib >app-crypt/gnupg-2.4.5:0 bzip2 -doc -ldap nls readline -selinux smartcard ssl -test tofu -tools -tpm -usb -user-socket -verify-sig -wks-server >app-crypt/gpgme-1.23.2:1/11.6.15.2 -common-lisp cxx debug -python python_targets_python3_10 python_targets_python3_11 python_targets_python3_12 -qt5 -qt6 -static-libs -test -verify-sig >app-crypt/libb2-0.98.1-r3:0 -abi_mips_n32 -abi_mips_n64 -abi_mips_o32 -abi_s390_32 -abi_s390_64 -abi_x86_32 abi_x86_64 -abi_x86_x32 -native-cflags openmp -static-libs >app-crypt/libmd-1.1.0:0 -abi_mips_n32 -abi_mips_n64 -abi_mips_o32 -abi_s390_32 -abi_s390_64 -abi_x86_32 abi_x86_64 -abi_x86_x32 >app-crypt/pinentry-1.3.0-r2:0 -X -caps -efl -emacs -gtk -keyring ncurses -qt5 -qt6 -verify-sig -wayland >app-crypt/rhash-1.4.4-r1:0/1 -abi_mips_n32 -abi_mips_n64 -abi_mips_o32 -abi_s390_32 -abi_s390_64 -abi_x86_32 abi_x86_64 -abi_x86_x32 debug nls ssl -static-libs >app-editors/nano-7.2-r1:0 -debug -justify -magic -minimal ncurses nls spell -static unicode >app-eselect/eselect-fontconfig-20220403:0 >app-eselect/eselect-iptables-20220320:0 >app-eselect/eselect-lib-bin-symlink-0.1.1-r1:0 >app-eselect/eselect-pinentry-0.7.4:0 >app-i18n/man-pages-ja-20180315-r2:0 >app-i18n/man-pages-l10n-4.19.0:0 l10n_cs l10n_da l10n_de l10n_el l10n_es l10n_fi l10n_fr l10n_hu l10n_id l10n_it l10n_mk l10n_nb l10n_nl l10n_pl l10n_pt-BR l10n_ro l10n_ru l10n_sr l10n_sv l10n_uk l10n_vi >app-i18n/man-pages-zh_CN-1.6.4.0:0 >app-misc/ca-certificates-20240203.3.98:0 -cacert >app-misc/editor-wrapper-4-r1:0 >app-misc/mime-types-2.1.54:0 -nginx >app-misc/pax-utils-1.3.7:0 -caps -man -python -python_single_target_python3_10 python_single_target_python3_11 -python_single_target_python3_12 -seccomp -test >app-misc/tmux-3.4:0 debug -selinux -systemd -utempter -vim-syntax >app-portage/eix-0.36.7-r1:0 debug -doc nls -sqlite >app-portage/elt-patches-20240415:0 >app-portage/gemato-20.5:0 gpg -pretty-log python_targets_pypy3 python_targets_python3_10 python_targets_python3_11 python_targets_python3_12 -test -tools >app-portage/gentoolkit-0.6.6:0 python_targets_pypy3 python_targets_python3_10 python_targets_python3_11 python_targets_python3_12 -test >app-portage/getuto-1.11:0 -test >app-portage/portage-utils-0.97:0 openmp qmanifest -static >app-shells/bash-5.2_p26-r3:0 -afs -bashlogger -examples -mem-scramble net nls -pgo -plugins readline -verify-sig >app-shells/bash-completion-2.11:0 eselect -test >app-shells/gentoo-bashcomp-20230313:0 >app-shells/push-3.4:0 >app-shells/quoter-4.2:0 >app-text/ansifilter-2.20:0 -gui -verify-sig >app-text/asciidoc-10.2.0:0 -python_single_target_pypy3 -python_single_target_python3_10 python_single_target_python3_11 -python_single_target_python3_12 >app-text/build-docbook-catalog-2.4:0 >app-text/docbook-xml-dtd-4.5-r2:4.5 >app-text/docbook-xml-dtd-4.4-r3:4.4 >app-text/docbook-xml-dtd-4.2-r3:4.2 >app-text/docbook-xml-dtd-4.1.2-r7:4.1.2 >app-text/docbook-xsl-ns-stylesheets-1.79.1:0 -ruby >app-text/docbook-xsl-stylesheets-1.79.1-r4:0 -ruby >app-text/manpager-1:0 >app-text/opensp-1.5.2-r10:0 -doc nls -static-libs -test >app-text/po4a-0.71:0 -test -test >app-text/sgml-common-0.6.3-r7:0 >app-text/xmlto-0.0.28-r11:0 -latex text >dev-build/autoconf-2.72-r1:2.72 -emacs -verify-sig >dev-build/autoconf-archive-2023.02.20:0 >dev-build/autoconf-wrapper-20231224:0 >dev-build/automake-1.16.5-r2:1.16 -test >dev-build/automake-wrapper-20221207:0 >dev-build/cmake-3.29.2:0 -dap -doc -gui ncurses -qt6 -test -test -verify-sig >dev-build/gtk-doc-am-1.33.2:0 >dev-build/libtool-2.4.7-r4:2 -vanilla >dev-build/make-4.4.1-r1:0 -doc -guile nls -static -test -verify-sig >dev-build/meson-1.4.0-r1:0 python_targets_pypy3 python_targets_python3_10 python_targets_python3_11 python_targets_python3_12 -test -verify-sig >dev-build/meson-format-array-0:0 python_targets_python3_10 python_targets_python3_11 python_targets_python3_12 >dev-build/ninja-1.11.1-r5:0 -doc -test >dev-db/sqlite-3.45.3:3 -abi_mips_n32 -abi_mips_n64 -abi_mips_o32 -abi_s390_32 -abi_s390_64 -abi_x86_32 abi_x86_64 -abi_x86_x32 debug -doc -icu readline -secure-delete -static-libs -tcl -test -tools >dev-lang/duktape-2.7.0-r3:0/2.7.0 >dev-lang/perl-5.38.2-r2:0/5.38 -berkdb debug -doc gdbm ithreads -minimal -quadmath >dev-lang/python-3.12.3:3.12 -bluetooth -build debug ensurepip -examples gdbm -libedit ncurses -pgo readline sqlite ssl -test -tk -valgrind -verify-sig >dev-lang/python-3.11.9:3.11 -bluetooth -build debug ensurepip -examples gdbm -libedit ncurses -pgo readline sqlite ssl -test -tk -valgrind -verify-sig >dev-lang/python-3.10.14_p1:3.10 -bluetooth -build debug ensurepip -examples gdbm -libedit ncurses -pgo readline sqlite ssl -test -tk -valgrind -verify-sig >dev-lang/python-exec-2.4.10:2 native-symlinks python_targets_pypy3 python_targets_python3_10 python_targets_python3_11 python_targets_python3_12 -test >dev-lang/python-exec-conf-2.4.6:2 python_targets_pypy3 python_targets_python3_10 python_targets_python3_11 python_targets_python3_12 >dev-lang/tcl-8.6.14:0/8.6 -abi_mips_n32 -abi_mips_n64 -abi_mips_o32 -abi_s390_32 -abi_s390_64 -abi_x86_32 abi_x86_64 -abi_x86_x32 debug threads >dev-libs/boehm-gc-8.2.6:0 -abi_mips_n32 -abi_mips_n64 -abi_mips_o32 -abi_s390_32 -abi_s390_64 abi_x86_32 abi_x86_64 -abi_x86_x32 -cxx large -static-libs threads >dev-libs/elfutils-0.191:0 -abi_mips_n32 -abi_mips_n64 -abi_mips_o32 -abi_s390_32 -abi_s390_64 -abi_x86_32 abi_x86_64 -abi_x86_x32 bzip2 -debuginfod -lzma nls -static-libs -test utils -verify-sig -zstd >dev-libs/expat-2.6.2:0 -abi_mips_n32 -abi_mips_n64 -abi_mips_o32 -abi_s390_32 -abi_s390_64 -abi_x86_32 abi_x86_64 -abi_x86_x32 -examples -static-libs -test unicode >dev-libs/glib-2.78.4-r1:2 -abi_mips_n32 -abi_mips_n64 -abi_mips_o32 -abi_s390_32 -abi_s390_64 -abi_x86_32 abi_x86_64 -abi_x86_x32 -dbus debug elf -gtk-doc mime -selinux -static-libs -sysprof -systemtap -test -utils xattr >dev-libs/gmp-6.3.0-r1:0/10.4 -abi_mips_n32 -abi_mips_n64 -abi_mips_o32 -abi_s390_32 -abi_s390_64 -abi_x86_32 abi_x86_64 -abi_x86_x32 asm cpudetection cxx -doc -pic -static-libs >dev-libs/gobject-introspection-1.78.1:0 -doctool -gtk-doc -python_single_target_python3_10 python_single_target_python3_11 -python_single_target_python3_12 -test >dev-libs/gobject-introspection-common-1.78.1:0 >dev-libs/isl-0.26:0/23 -abi_mips_n32 -abi_mips_n64 -abi_mips_o32 -abi_s390_32 -abi_s390_64 -abi_x86_32 abi_x86_64 -abi_x86_x32 -static-libs >dev-libs/jsoncpp-1.9.5:0/25 -doc -test >dev-libs/libassuan-2.5.7:0 -verify-sig >dev-libs/libatomic_ops-7.8.2:0 -abi_mips_n32 -abi_mips_n64 -abi_mips_o32 -abi_s390_32 -abi_s390_64 abi_x86_32 abi_x86_64 -abi_x86_x32 >dev-libs/libbsd-0.11.8:0 -abi_mips_n32 -abi_mips_n64 -abi_mips_o32 -abi_s390_32 -abi_s390_64 -abi_x86_32 abi_x86_64 -abi_x86_x32 -static-libs -verify-sig >dev-libs/libevent-2.1.12-r1:0/2.1-7 -abi_mips_n32 -abi_mips_n64 -abi_mips_o32 -abi_s390_32 -abi_s390_64 -abi_x86_32 abi_x86_64 -abi_x86_x32 clock-gettime debug -malloc-replacement ssl -static-libs -test -verbose-debug -verify-sig >dev-libs/libffi-3.4.6:0/8 -abi_mips_n32 -abi_mips_n64 -abi_mips_o32 -abi_s390_32 -abi_s390_64 -abi_x86_32 abi_x86_64 -abi_x86_x32 debug -exec-static-trampoline -pax-kernel -static-libs -test >dev-libs/libgcrypt-1.10.3-r2:0/20 -abi_mips_n32 -abi_mips_n64 -abi_mips_o32 -abi_s390_32 -abi_s390_64 -abi_x86_32 abi_x86_64 -abi_x86_x32 asm -cpu_flags_arm_aes -cpu_flags_arm_neon -cpu_flags_arm_sha1 -cpu_flags_arm_sha2 -cpu_flags_ppc_altivec -cpu_flags_ppc_vsx2 -cpu_flags_ppc_vsx3 cpu_flags_x86_aes cpu_flags_x86_avx cpu_flags_x86_avx2 -cpu_flags_x86_padlock -cpu_flags_x86_sha cpu_flags_x86_sse4_1 -doc getentropy -static-libs -verify-sig >dev-libs/libgpg-error-1.49:0 -abi_mips_n32 -abi_mips_n64 -abi_mips_o32 -abi_s390_32 -abi_s390_64 -abi_x86_32 abi_x86_64 -abi_x86_x32 -common-lisp nls -static-libs -test -verify-sig >dev-libs/libksba-1.6.6:0 -static-libs -verify-sig >dev-libs/libpcre2-10.43:0/3 -abi_mips_n32 -abi_mips_n64 -abi_mips_o32 -abi_s390_32 -abi_s390_64 -abi_x86_32 abi_x86_64 -abi_x86_x32 bzip2 jit -libedit pcre16 pcre32 readline -static-libs unicode -valgrind -verify-sig zlib >dev-libs/libpipeline-1.5.7:0 -test >dev-libs/libtasn1-4.19.0:0/6 -abi_mips_n32 -abi_mips_n64 -abi_mips_o32 -abi_s390_32 -abi_s390_64 -abi_x86_32 abi_x86_64 -abi_x86_x32 -static-libs -test -verify-sig >dev-libs/libunistring-1.2:0/5 -abi_mips_n32 -abi_mips_n64 -abi_mips_o32 -abi_s390_32 -abi_s390_64 -abi_x86_32 abi_x86_64 -abi_x86_x32 -doc -static-libs >dev-libs/libuv-1.48.0:0/1 -verify-sig >dev-libs/libxml2-2.12.6:2 -abi_mips_n32 -abi_mips_n64 -abi_mips_o32 -abi_s390_32 -abi_s390_64 -abi_x86_32 abi_x86_64 -abi_x86_x32 -debug -examples ftp -icu -lzma python python_targets_python3_10 python_targets_python3_11 python_targets_python3_12 readline -static-libs -test >dev-libs/libxslt-1.1.39:0 -abi_mips_n32 -abi_mips_n64 -abi_mips_o32 -abi_s390_32 -abi_s390_64 -abi_x86_32 abi_x86_64 -abi_x86_x32 crypt debug -examples -python python_targets_python3_10 python_targets_python3_11 python_targets_python3_12 -static-libs >dev-libs/lzo-2.10:2 -abi_mips_n32 -abi_mips_n64 -abi_mips_o32 -abi_s390_32 -abi_s390_64 -abi_x86_32 abi_x86_64 -abi_x86_x32 -examples split-usr -static-libs >dev-libs/mpc-1.3.1:0/3 -abi_mips_n32 -abi_mips_n64 -abi_mips_o32 -abi_s390_32 -abi_s390_64 -abi_x86_32 abi_x86_64 -abi_x86_x32 -static-libs >dev-libs/mpfr-4.2.1:0/6 -abi_mips_n32 -abi_mips_n64 -abi_mips_o32 -abi_s390_32 -abi_s390_64 -abi_x86_32 abi_x86_64 -abi_x86_x32 -static-libs -verify-sig >dev-libs/nettle-3.9.1:0/8-6 -abi_mips_n32 -abi_mips_n64 -abi_mips_o32 -abi_s390_32 -abi_s390_64 -abi_x86_32 abi_x86_64 -abi_x86_x32 asm -cpu_flags_arm_aes -cpu_flags_arm_neon -cpu_flags_arm_sha1 -cpu_flags_arm_sha2 -cpu_flags_ppc_altivec -cpu_flags_ppc_vsx2 -cpu_flags_ppc_vsx3 cpu_flags_x86_aes cpu_flags_x86_pclmul -cpu_flags_x86_sha -doc gmp -static-libs -verify-sig >dev-libs/npth-1.7-r1:0 -test >dev-libs/openssl-3.2.1-r2:0/3 -abi_mips_n32 -abi_mips_n64 -abi_mips_o32 -abi_s390_32 -abi_s390_64 -abi_x86_32 abi_x86_64 -abi_x86_x32 asm cpu_flags_x86_sse2 -fips -ktls -rfc3779 -sctp -static-libs -test -tls-compression -vanilla -verify-sig -verify-sig -weak-ssl-ciphers >dev-libs/popt-1.19-r1:0 -abi_mips_n32 -abi_mips_n64 -abi_mips_o32 -abi_s390_32 -abi_s390_64 -abi_x86_32 abi_x86_64 -abi_x86_x32 nls -static-libs >dev-perl/Encode-EUCJPASCII-0.30.0-r1:0 -test >dev-perl/Encode-HanExtra-0.230.0-r3:0 >dev-perl/Encode-Locale-1.50.0-r1:0 -test >dev-perl/ExtUtils-CChecker-0.110.0:0 -test >dev-perl/File-BaseDir-0.90.0:0 -test >dev-perl/File-DesktopEntry-0.220.0-r1:0 -test >dev-perl/File-MimeInfo-0.330.0:0 -test >dev-perl/IO-Socket-SSL-2.85.0:0 -examples -idn -test >dev-perl/IPC-System-Simple-1.300.0:0 -test >dev-perl/Locale-gettext-1.70.0-r1:0 -test >dev-perl/MIME-Charset-1.13.1:0 l10n_ja l10n_zh -test >dev-perl/Module-Build-0.423.400:0 -test >dev-perl/Mozilla-CA-20999999-r1:0 -test >dev-perl/Net-SSLeay-1.940.0:0 -examples -examples -minimal -test >dev-perl/Pod-Parser-1.660.0:0 -test >dev-perl/Regexp-IPv6-0.30.0-r2:0 -test >dev-perl/SGMLSpm-1.1-r2:0 -test >dev-perl/Syntax-Keyword-Try-0.290.0:0 -test >dev-perl/TermReadKey-2.380.0-r1:0 -examples -test >dev-perl/Text-CharWidth-0.40.0-r2:0 -test >dev-perl/Text-WrapI18N-0.60.0-r2:0 -test >dev-perl/Unicode-LineBreak-2019.1.0:0 >dev-perl/URI-5.210.0:0 -test >dev-perl/XS-Parse-Keyword-0.410.0:0 -test >dev-perl/YAML-Tiny-1.740.0:0 -minimal -test >dev-python/backports-tarfile-1.1.1:0 python_targets_pypy3 python_targets_python3_10 python_targets_python3_11 -test >dev-python/certifi-3021.3.16-r4:0 python_targets_pypy3 python_targets_python3_10 python_targets_python3_11 python_targets_python3_12 -test >dev-python/charset-normalizer-3.3.2:0 python_targets_pypy3 python_targets_python3_10 python_targets_python3_11 python_targets_python3_12 -test >dev-python/cython-3.0.10:0 debug -doc python_targets_pypy3 python_targets_python3_10 python_targets_python3_11 python_targets_python3_12 -test >dev-python/editables-0.5:0 python_targets_pypy3 python_targets_python3_10 python_targets_python3_11 python_targets_python3_12 -test >dev-python/ensurepip-pip-24.0:0 >dev-python/ensurepip-setuptools-69.5.1:0 >dev-python/ensurepip-wheels-100:0 >dev-python/exceptiongroup-1.2.1:0 python_targets_pypy3 python_targets_python3_10 python_targets_python3_11 python_targets_python3_12 -test >dev-python/flit-core-3.9.0:0 python_targets_pypy3 python_targets_python3_10 python_targets_python3_11 python_targets_python3_12 -test >dev-python/gentoo-common-1:0 >dev-python/gpep517-15:0 python_targets_pypy3 python_targets_python3_10 python_targets_python3_11 python_targets_python3_12 -test >dev-python/hatchling-1.24.2:0 python_targets_pypy3 python_targets_python3_10 python_targets_python3_11 python_targets_python3_12 -test >dev-python/idna-3.7:0 python_targets_pypy3 python_targets_python3_10 python_targets_python3_11 python_targets_python3_12 -test >dev-python/iniconfig-2.0.0:0 python_targets_pypy3 python_targets_python3_10 python_targets_python3_11 python_targets_python3_12 -test >dev-python/installer-0.7.0:0 python_targets_pypy3 python_targets_python3_10 python_targets_python3_11 python_targets_python3_12 -test >dev-python/jaraco-context-5.3.0:0 python_targets_pypy3 python_targets_python3_10 python_targets_python3_11 python_targets_python3_12 -test >dev-python/jaraco-functools-4.0.1:0 python_targets_pypy3 python_targets_python3_10 python_targets_python3_11 python_targets_python3_12 -test >dev-python/jaraco-text-3.12.0:0 python_targets_pypy3 python_targets_python3_10 python_targets_python3_11 python_targets_python3_12 -test >dev-python/jinja-3.1.3:0 -doc -examples python_targets_pypy3 python_targets_python3_10 python_targets_python3_11 python_targets_python3_12 -test >dev-python/lxml-5.2.1:0 debug -doc -examples python_targets_pypy3 python_targets_python3_10 python_targets_python3_11 python_targets_python3_12 -test threads >dev-python/markupsafe-2.1.5:0 debug python_targets_pypy3 python_targets_python3_10 python_targets_python3_11 python_targets_python3_12 -test >dev-python/more-itertools-10.2.0:0 -doc python_targets_pypy3 python_targets_python3_10 python_targets_python3_11 python_targets_python3_12 -test >dev-python/ordered-set-4.1.0:0 python_targets_pypy3 python_targets_python3_10 python_targets_python3_11 python_targets_python3_12 -test >dev-python/packaging-24.0:0 python_targets_pypy3 python_targets_python3_10 python_targets_python3_11 python_targets_python3_12 -test >dev-python/pathspec-0.12.1:0 python_targets_pypy3 python_targets_python3_10 python_targets_python3_11 python_targets_python3_12 -test >dev-python/platformdirs-4.2.1:0 python_targets_pypy3 python_targets_python3_10 python_targets_python3_11 python_targets_python3_12 -test >dev-python/pluggy-1.5.0:0 python_targets_pypy3 python_targets_python3_10 python_targets_python3_11 python_targets_python3_12 -test >dev-python/pyproject-metadata-0.8.0:0 python_targets_pypy3 python_targets_python3_10 python_targets_python3_11 python_targets_python3_12 -test >dev-python/pypy3-7.3.16:0/pypy310-pp73-384 gdbm ncurses sqlite -tk >dev-python/pypy3_10-7.3.16:0/pypy310-pp73-384 ensurepip gdbm jit ncurses sqlite -tk >dev-python/pypy3_10-exe-bin-7.3.16:7.3.16 >dev-python/PySocks-1.7.1-r2:0 python_targets_pypy3 python_targets_python3_10 python_targets_python3_11 python_targets_python3_12 >dev-python/pytest-8.2.0:0 python_targets_pypy3 python_targets_python3_10 python_targets_python3_11 python_targets_python3_12 -test >dev-python/requests-2.31.0:0 python_targets_pypy3 python_targets_python3_10 python_targets_python3_11 python_targets_python3_12 -socks5 -test test-rust >dev-python/setuptools-69.5.1-r1:0 python_targets_pypy3 python_targets_python3_10 python_targets_python3_11 python_targets_python3_12 -test >dev-python/setuptools-scm-8.0.4:0 python_targets_pypy3 python_targets_python3_10 python_targets_python3_11 python_targets_python3_12 -test >dev-python/tomli-2.0.1-r1:0 python_targets_pypy3 python_targets_python3_10 python_targets_python3_11 python_targets_python3_12 -test >dev-python/tomli-w-1.0.0-r1:0 python_targets_pypy3 python_targets_python3_10 python_targets_python3_11 python_targets_python3_12 -test >dev-python/trove-classifiers-2024.4.10:0 python_targets_pypy3 python_targets_python3_10 python_targets_python3_11 python_targets_python3_12 -test >dev-python/typing-extensions-4.11.0:0 python_targets_pypy3 python_targets_python3_10 python_targets_python3_11 python_targets_python3_12 -test >dev-python/urllib3-2.2.1:0 -brotli -http2 python_targets_pypy3 python_targets_python3_10 python_targets_python3_11 python_targets_python3_12 -test -zstd >dev-python/wheel-0.43.0:0 python_targets_pypy3 python_targets_python3_10 python_targets_python3_11 python_targets_python3_12 -test >dev-util/checkbashisms-2.23.5:0 >dev-util/desktop-file-utils-0.27-r1:0 >dev-util/glib-utils-2.78.4:0 -python_single_target_python3_10 python_single_target_python3_11 -python_single_target_python3_12 >dev-util/gperf-3.1-r2:0 >dev-util/pkgconf-2.2.0:0/5 -abi_mips_n32 -abi_mips_n64 -abi_mips_o32 -abi_s390_32 -abi_s390_64 -abi_x86_32 abi_x86_64 -abi_x86_x32 native-symlinks -test >dev-util/re2c-3.1:0 debug -test >dev-vcs/git-2.45.0:0 blksha1 -cgi curl -cvs -doc gpg -highlight iconv -keyring -mediawiki nls pcre -perforce -perl -python_single_target_python3_10 python_single_target_python3_11 -python_single_target_python3_12 safe-directory -selinux -subversion -test -tk webdav -xinetd >media-fonts/liberation-fonts-2.1.5:0 -X -X -fontforge >media-gfx/graphite2-1.3.14_p20210810-r3:0 -abi_mips_n32 -abi_mips_n64 -abi_mips_o32 -abi_s390_32 -abi_s390_64 -abi_x86_32 abi_x86_64 -abi_x86_x32 -perl -test >media-libs/fontconfig-2.15.0:1.0 -abi_mips_n32 -abi_mips_n64 -abi_mips_o32 -abi_s390_32 -abi_s390_64 -abi_x86_32 abi_x86_64 -abi_x86_x32 -doc nls -test >media-libs/freetype-2.13.2:2 -X -abi_mips_n32 -abi_mips_n64 -abi_mips_o32 -abi_s390_32 -abi_s390_64 -abi_x86_32 abi_x86_64 -abi_x86_x32 adobe-cff -brotli bzip2 cleartype-hinting debug -doc -fontforge harfbuzz png -static-libs -svg -utils >media-libs/harfbuzz-8.3.1:0/6.0.0 -abi_mips_n32 -abi_mips_n64 -abi_mips_o32 -abi_s390_32 -abi_s390_64 -abi_x86_32 abi_x86_64 -abi_x86_x32 cairo debug -doc -experimental glib graphite -icu introspection -test truetype >media-libs/libpng-1.6.43:0/16 -abi_mips_n32 -abi_mips_n64 -abi_mips_o32 -abi_s390_32 -abi_s390_64 -abi_x86_32 abi_x86_64 -abi_x86_x32 -apng -cpu_flags_arm_neon cpu_flags_x86_sse -static-libs -test >net-dns/c-ares-1.28.1:0/2 -abi_mips_n32 -abi_mips_n64 -abi_mips_o32 -abi_s390_32 -abi_s390_64 -abi_x86_32 abi_x86_64 -abi_x86_x32 -static-libs -test -verify-sig >net-dns/libidn2-2.3.7:0/2 -abi_mips_n32 -abi_mips_n64 -abi_mips_o32 -abi_s390_32 -abi_s390_64 -abi_x86_32 abi_x86_64 -abi_x86_x32 nls -static-libs -verify-sig >net-firewall/iptables-1.8.10-r1:0/1.8.3 -conntrack -netlink -nftables -pcap -static-libs -test >net-libs/gnutls-3.8.5-r1:0/30.30 -abi_mips_n32 -abi_mips_n64 -abi_mips_o32 -abi_s390_32 -abi_s390_64 -abi_x86_32 abi_x86_64 -abi_x86_x32 -brotli cxx -dane -doc -examples idn nls openssl -pkcs11 seccomp -sslv2 -sslv3 -static-libs -test -test-full tls-heartbeat -tools -verify-sig zlib -zstd >net-libs/libmnl-1.0.5:0/0.2.0 -examples -verify-sig >net-libs/libnsl-2.0.1:0/3 -abi_mips_n32 -abi_mips_n64 -abi_mips_o32 -abi_s390_32 -abi_s390_64 -abi_x86_32 abi_x86_64 -abi_x86_x32 -static-libs >net-libs/libpsl-0.21.5:0 -abi_mips_n32 -abi_mips_n64 -abi_mips_o32 -abi_s390_32 -abi_s390_64 -abi_x86_32 abi_x86_64 -abi_x86_x32 -icu idn -test >net-libs/libtirpc-1.3.4-r2:0/3 -abi_mips_n32 -abi_mips_n64 -abi_mips_o32 -abi_s390_32 -abi_s390_64 -abi_x86_32 abi_x86_64 -abi_x86_x32 -kerberos -static-libs >net-libs/nghttp2-1.61.0:0/1.14 -abi_mips_n32 -abi_mips_n64 -abi_mips_o32 -abi_s390_32 -abi_s390_64 -abi_x86_32 abi_x86_64 -abi_x86_x32 debug -hpack-tools -jemalloc -static-libs -systemd -test -utils -xml >net-misc/curl-8.7.1-r4:0 -abi_mips_n32 -abi_mips_n64 -abi_mips_o32 -abi_s390_32 -abi_s390_64 -abi_x86_32 abi_x86_64 -abi_x86_x32 adns alt-svc -brotli -curl_ssl_gnutls -curl_ssl_mbedtls curl_ssl_openssl -curl_ssl_rustls ftp -gnutls -gopher hsts http2 -idn imap -kerberos -ldap -mbedtls -nghttp3 openssl pop3 progress-meter psl -rtmp -rustls -samba smtp -ssh ssl -sslv3 -static-libs -telnet -test tftp -verify-sig -websockets -zstd >net-misc/dhcpcd-10.0.6-r2:0 debug embedded ipv6 -privsep udev >net-misc/iputils-20240117:0 arping -caps -clockdiff -doc filecaps -idn nls -test -tracepath >net-misc/netifrc-0.7.8:0 dhcp >net-misc/openssh-contrib-9.7_p1-r1:0 -X -X509 -abi_mips_n32 -audit debug -hpn -kerberos -ldns -libedit -livecd pam -pie -security-key -selinux ssl -static -test -verify-sig -xmss >net-misc/rsync-3.3.0:0 acl -examples iconv -lz4 -python_single_target_python3_10 python_single_target_python3_11 -python_single_target_python3_12 -rrsync ssl -stunnel -system-zlib -verify-sig xattr -xxhash -zstd >net-misc/wget-1.24.5:0 -cookie-check debug -gnutls -idn ipv6 -libproxy -metalink nls -ntlm pcre ssl -static -test -uuid -verify-sig zlib >perl-core/File-Temp-0.231.100-r1:0 >perl-core/Getopt-Long-2.570.0:0 >perl-core/Math-BigInt-1.999.842:0 -examples -test >sec-keys/openpgp-keys-gentoo-release-20230329:0 -test >sys-apps/acl-2.3.2-r1:0 -abi_mips_n32 -abi_mips_n64 -abi_mips_o32 -abi_s390_32 -abi_s390_64 -abi_x86_32 abi_x86_64 -abi_x86_x32 nls -static-libs >sys-apps/attr-2.5.2-r1:0 -abi_mips_n32 -abi_mips_n64 -abi_mips_o32 -abi_s390_32 -abi_s390_64 -abi_x86_32 abi_x86_64 -abi_x86_x32 debug nls -static-libs >sys-apps/baselayout-2.15:0 -build split-usr >sys-apps/coreutils-9.5:0 acl -caps -gmp -hostname -kill -multicall nls openssl -selinux split-usr -static -test -vanilla -verify-sig xattr >sys-apps/dbus-1.15.8:0 -X -abi_mips_n32 -abi_mips_n64 -abi_mips_o32 -abi_s390_32 -abi_s390_64 -abi_x86_32 abi_x86_64 -abi_x86_x32 debug -doc elogind -selinux -static-libs -systemd -test -test -valgrind >sys-apps/diffutils-3.10:0 nls -verify-sig >sys-apps/file-5.45-r4:0 -abi_mips_n32 -abi_mips_n64 -abi_mips_o32 -abi_s390_32 -abi_s390_64 -abi_x86_32 abi_x86_64 -abi_x86_x32 bzip2 -lzip -lzma -python python_targets_python3_10 python_targets_python3_11 -seccomp -static-libs -verify-sig zlib -zstd >sys-apps/findutils-4.9.0-r2:0 nls -selinux -static -test -verify-sig >sys-apps/gawk-5.3.0-r1:0 -mpfr nls -pma readline -verify-sig >sys-apps/gentoo-functions-0.19:0 >sys-apps/grep-3.11-r1:0 egrep-fgrep nls pcre -static -verify-sig >sys-apps/groff-1.23.0:0 -X -examples -uchardet >sys-apps/help2man-1.49.3:0 nls >sys-apps/install-xattr-0.8-r1:0 >sys-apps/iproute2-6.8.0-r2:0 -atm -berkdb -bpf -caps -elf iptables -minimal -nfs -selinux >sys-apps/kbd-2.6.4:0 nls pam -selinux -test >sys-apps/kmod-32-r1:0 debug -doc lzma -pkcs7 split-usr -static-libs tools zlib zstd >sys-apps/less-643-r2:0 pcre -test >sys-apps/locale-gen-2.23-r1:0 >sys-apps/man-db-2.12.1:0 manpager nls seccomp -selinux -static-libs zlib >sys-apps/man-pages-6.06:0 l10n_cs l10n_da l10n_de l10n_el l10n_es l10n_fi l10n_fr l10n_hu l10n_id l10n_it l10n_ja l10n_mk l10n_nb l10n_nl l10n_pl l10n_pt-BR l10n_ro l10n_ru l10n_sr l10n_sv l10n_uk l10n_vi l10n_zh-CN -verify-sig >sys-apps/miscfiles-1.5-r4:0 -minimal >sys-apps/net-tools-2.10:0 arp hostname ipv6 -nis nls -plipconfig -selinux -slattach -static >sys-apps/openrc-0.54:0 -audit -bash debug netifrc -newnet pam -s6 -selinux -sysv-utils sysvinit unicode >sys-apps/portage-3.0.64:0 -apidoc -build -doc -gentoo-dev ipc native-extensions python_targets_pypy3 python_targets_python3_10 python_targets_python3_11 python_targets_python3_12 rsync-verify -selinux -test xattr >sys-apps/sandbox-2.38:0 -abi_mips_n32 -abi_mips_n64 -abi_mips_o32 -abi_s390_32 -abi_s390_64 abi_x86_32 abi_x86_64 -abi_x86_x32 nnp >sys-apps/sed-4.9:0 acl nls -selinux -static -verify-sig >sys-apps/shadow-4.14.6:0/4 acl -audit -cracklib nls pam -selinux -skey split-usr -su -systemd -verify-sig xattr >sys-apps/systemd-utils-254.11:0 -abi_mips_n32 -abi_mips_n64 -abi_mips_o32 -abi_s390_32 -abi_s390_64 -abi_x86_32 abi_x86_64 -abi_x86_x32 acl -boot -kernel-install kmod -python_single_target_python3_10 python_single_target_python3_11 -python_single_target_python3_12 -secureboot -selinux split-usr -sysusers -test tmpfiles udev -ukify >sys-apps/sysvinit-3.09:0 -ibm nls -selinux -static -verify-sig >sys-apps/texinfo-7.1-r1:0 nls standalone -static >sys-apps/util-linux-2.39.3-r7:0 -abi_mips_n32 -abi_mips_n64 -abi_mips_o32 -abi_s390_32 -abi_s390_64 -abi_x86_32 abi_x86_64 -abi_x86_x32 -audit -build -caps cramfs -cryptsetup -fdformat hardlink -kill logger -magic ncurses nls pam -python python_targets_python3_10 python_targets_python3_11 python_targets_python3_12 readline -rtas -selinux -slang -static-libs su suid -systemd -test -tty-helpers -udev unicode -verify-sig >sys-apps/which-2.21:0 >sys-auth/elogind-252.9:0 acl -audit cgroup-hybrid debug -doc pam policykit -selinux -test >sys-auth/pambase-20240128:0 -caps -debug elogind -gnome-keyring -homed -minimal -mktemp nullok -pam_krb5 -pam_ssh passwdqc -pwhistory -pwquality -securetty -selinux sha512 -sssd -systemd -yescrypt >sys-auth/passwdqc-2.0.3-r1:0 >sys-auth/polkit-124-r1:0 daemon duktape -examples -gtk introspection -kde pam -selinux -systemd -test >sys-devel/bc-1.07.1-r6:0 -libedit readline -static >sys-devel/binutils-2.42-r1:2.42 -cet -debuginfod -doc -gold -gprofng -hardened -multitarget nls -pgo plugins -static-libs -test -vanilla -zstd >sys-devel/binutils-config-5.5:0 native-symlinks >sys-devel/bison-3.8.2-r2:0 -examples nls -static -test -verify-sig >sys-devel/flex-2.6.4-r6:0 -abi_mips_n32 -abi_mips_n64 -abi_mips_o32 -abi_s390_32 -abi_s390_64 -abi_x86_32 abi_x86_64 -abi_x86_x32 nls -static -test >sys-devel/gcc-13.2.1_p20240210:13 -ada -cet -custom-cflags cxx -d -debug -default-stack-clash-protection -default-znow -doc -fixed-point fortran -go graphite -hardened -ieee-long-double -jit -libssp lto -modula2 multilib nls -objc -objc++ -objc-gc openmp -pch -pgo pie sanitize ssp -systemtap -test -valgrind -vanilla -vtv -zstd >sys-devel/gcc-config-2.11:0 cc-wrappers native-symlinks >sys-devel/gettext-0.22.5:0 -abi_mips_n32 -abi_mips_n64 -abi_mips_o32 -abi_s390_32 -abi_s390_64 -abi_x86_32 abi_x86_64 -abi_x86_x32 acl cxx -doc -emacs -git -java -java ncurses nls openmp -static-libs -verify-sig xattr >sys-devel/gnuconfig-20230731:0 >sys-devel/m4-1.4.19-r2:0 -examples nls -verify-sig >sys-devel/patch-2.7.6-r5:0 -static -test -verify-sig xattr >sys-fs/e2fsprogs-1.47.0-r3:0 -abi_mips_n32 -abi_mips_n64 -abi_mips_o32 -abi_s390_32 -abi_s390_64 -abi_x86_32 abi_x86_64 -abi_x86_x32 -cron -fuse nls -static-libs -test tools >sys-fs/udev-init-scripts-35:0 >sys-kernel/dracut-101:0 -selinux -test >sys-kernel/gentoo-kernel-bin-6.1.89:6.1.89 initramfs -test >sys-kernel/installkernel-37:0 dracut -efistub -grub -refind -systemd -systemd-boot -uki -ukify >sys-kernel/linux-headers-6.8-r1:0 -headers-only >sys-libs/gdbm-1.23:0/6 -abi_mips_n32 -abi_mips_n64 -abi_mips_o32 -abi_s390_32 -abi_s390_64 -abi_x86_32 abi_x86_64 -abi_x86_x32 berkdb nls readline -static-libs -test -verify-sig >sys-libs/glibc-2.39-r4:2.2 -audit -caps -cet -compile-locales -custom-cflags -doc -gd -hash-sysv-compat -headers-only multiarch multilib -multilib-bootstrap -nscd -perl -profile -selinux ssp stack-realign static-libs -suid -systemd -systemtap -test -vanilla >sys-libs/libcap-2.69-r1:0 -abi_mips_n32 -abi_mips_n64 -abi_mips_o32 -abi_s390_32 -abi_s390_64 -abi_x86_32 abi_x86_64 -abi_x86_x32 pam -static-libs -tools >sys-libs/libseccomp-2.5.5-r1:0 -abi_mips_n32 -abi_mips_n64 -abi_mips_o32 -abi_s390_32 -abi_s390_64 -abi_x86_32 abi_x86_64 -abi_x86_x32 debug -experimental-loong -python python_targets_python3_10 python_targets_python3_11 python_targets_python3_12 -static-libs -test >sys-libs/libxcrypt-4.4.36-r3:0/1 -abi_mips_n32 -abi_mips_n64 -abi_mips_o32 -abi_s390_32 -abi_s390_64 abi_x86_32 abi_x86_64 -abi_x86_x32 compat -headers-only -static-libs system -test >sys-libs/ncurses-6.4_p20240414:0/6 -abi_mips_n32 -abi_mips_n64 -abi_mips_o32 -abi_s390_32 -abi_s390_64 -abi_x86_32 abi_x86_64 -abi_x86_x32 -ada cxx debug -doc -gpm -minimal -profile split-usr -split-usr stack-realign -static-libs -test tinfo -trace -verify-sig >sys-libs/pam-1.5.3-r1:0 -abi_mips_n32 -abi_mips_n64 -abi_mips_o32 -abi_s390_32 -abi_s390_64 -abi_x86_32 abi_x86_64 -abi_x86_x32 -audit -berkdb -debug filecaps -nis -selinux >sys-libs/readline-8.2_p10:0/8 -abi_mips_n32 -abi_mips_n64 -abi_mips_o32 -abi_s390_32 -abi_s390_64 -abi_x86_32 abi_x86_64 -abi_x86_x32 -static-libs unicode -utils -verify-sig >sys-libs/timezone-data-2024a-r1:0 -leaps-timezone nls -zic-slim >sys-libs/zlib-1.3.1-r1:0/1 -abi_mips_n32 -abi_mips_n64 -abi_mips_o32 -abi_s390_32 -abi_s390_64 -abi_x86_32 abi_x86_64 -abi_x86_x32 minizip -static-libs -verify-sig >sys-process/procps-4.0.4-r1:0/0-ng -abi_mips_n32 -abi_mips_n64 -abi_mips_o32 -abi_s390_32 -abi_s390_64 -abi_x86_32 abi_x86_64 -abi_x86_x32 elogind kill -modern-top ncurses nls -selinux -static-libs -systemd -test unicode >sys-process/psmisc-23.7:0 -X -apparmor nls -selinux -test >virtual/acl-0-r2:0 -abi_mips_n32 -abi_mips_n64 -abi_mips_o32 -abi_s390_32 -abi_s390_64 -abi_x86_32 abi_x86_64 -abi_x86_x32 -static-libs >virtual/dev-manager-0-r2:0 >virtual/dist-kernel-6.1.89:0/6.1.89 >virtual/editor-0-r7:0 >virtual/libc-1-r1:0 >virtual/libcrypt-2-r1:0/2 -abi_mips_n32 -abi_mips_n64 -abi_mips_o32 -abi_s390_32 -abi_s390_64 abi_x86_32 abi_x86_64 -abi_x86_x32 -static-libs >virtual/libelf-3-r1:0/1 -abi_mips_n32 -abi_mips_n64 -abi_mips_o32 -abi_s390_32 -abi_s390_64 -abi_x86_32 abi_x86_64 -abi_x86_x32 >virtual/libiconv-0-r2:0 -abi_mips_n32 -abi_mips_n64 -abi_mips_o32 -abi_s390_32 -abi_s390_64 -abi_x86_32 abi_x86_64 -abi_x86_x32 >virtual/libintl-0-r2:0 -abi_mips_n32 -abi_mips_n64 -abi_mips_o32 -abi_s390_32 -abi_s390_64 -abi_x86_32 abi_x86_64 -abi_x86_x32 >virtual/libudev-251-r2:0/1 -abi_mips_n32 -abi_mips_n64 -abi_mips_o32 -abi_s390_32 -abi_s390_64 -abi_x86_32 abi_x86_64 -abi_x86_x32 -systemd >virtual/man-0-r4:0 >virtual/openssh-0:0 ssl >virtual/os-headers-0-r2:0 >virtual/package-manager-1:0 >virtual/pager-0-r1:0 >virtual/perl-bignum-0.660.0:0 >virtual/perl-Carp-1.540.0:0 >virtual/perl-CPAN-2.360.0:0 >virtual/perl-CPAN-Meta-2.150.10-r7:0 >virtual/perl-CPAN-Meta-YAML-0.18.0-r9:0 >virtual/perl-Data-Dumper-2.188.0:0 >virtual/perl-Encode-3.190.0:0 >virtual/perl-Exporter-5.770.0-r1:0 >virtual/perl-ExtUtils-CBuilder-0.280.238:0 >virtual/perl-ExtUtils-Install-2.220.0:0 >virtual/perl-ExtUtils-MakeMaker-7.700.0:0 >virtual/perl-ExtUtils-Manifest-1.730.0-r2:0 >virtual/perl-ExtUtils-ParseXS-3.510.0:0 >virtual/perl-File-Path-2.180.0-r2:0 >virtual/perl-File-Spec-3.880.0:0 >virtual/perl-File-Temp-0.231.100:0 >virtual/perl-Getopt-Long-2.570.0:0 >virtual/perl-JSON-PP-4.160.0-r1:0 >virtual/perl-libnet-3.150.0:0 ssl >virtual/perl-Math-BigInt-1.999.842:0 >virtual/perl-Math-BigInt-FastCalc-0.501.300:0 >virtual/perl-Math-BigRat-0.262.400:0 >virtual/perl-Math-Complex-1.620.0:0 >virtual/perl-MIME-Base64-3.160.100_rc:0 >virtual/perl-Module-Metadata-1.0.37-r3:0 >virtual/perl-parent-0.241.0:0 >virtual/perl-Parse-CPAN-Meta-2.150.10-r7:0 >virtual/perl-Perl-OSType-1.10.0-r7:0 >virtual/perl-podlators-5.10.0:0 >virtual/perl-Scalar-List-Utils-1.630.0:0 >virtual/perl-Test-Harness-3.440.0-r1:0 >virtual/perl-Text-ParseWords-3.310.0-r1:0 >virtual/perl-Unicode-Collate-1.310.0-r1:0 >virtual/perl-version-0.992.900-r1:0 >virtual/pkgconfig-3:0 native-symlinks >virtual/service-manager-1-r1:0 >virtual/ssh-0-r2:0 -minimal >virtual/tmpfiles-0-r5:0 -systemd >virtual/ttf-fonts-1-r2:0 >virtual/udev-217-r7:0 -systemd >virtual/w3m-1:0 >www-client/pybugz-0.14:0 python_targets_python3_10 python_targets_python3_11 python_targets_python3_12 >www-client/w3m-0.5.3_p20230121:0 -X -fbcon -gdk-pixbuf -gpm -imlib l10n_ja -lynxkeymap nls -nntp ssl unicode -xface >x11-base/xcb-proto-1.17.0:0 python_targets_python3_10 python_targets_python3_11 python_targets_python3_12 >x11-base/xorg-proto-2024.1:0 -test >x11-libs/cairo-1.18.0:0 X -abi_mips_n32 -abi_mips_n64 -abi_mips_o32 -abi_s390_32 -abi_s390_64 -abi_x86_32 abi_x86_64 -abi_x86_x32 -aqua -debug glib -gtk-doc -test >x11-libs/libX11-1.8.9:0 -abi_mips_n32 -abi_mips_n64 -abi_mips_o32 -abi_s390_32 -abi_s390_64 -abi_x86_32 abi_x86_64 -abi_x86_x32 -doc -test >x11-libs/libXau-1.0.11:0 -abi_mips_n32 -abi_mips_n64 -abi_mips_o32 -abi_s390_32 -abi_s390_64 -abi_x86_32 abi_x86_64 -abi_x86_x32 -doc >x11-libs/libxcb-1.17.0:0/1.12 -abi_mips_n32 -abi_mips_n64 -abi_mips_o32 -abi_s390_32 -abi_s390_64 -abi_x86_32 abi_x86_64 -abi_x86_x32 -doc -doc -selinux -test xkb >x11-libs/libXdmcp-1.1.5:0 -abi_mips_n32 -abi_mips_n64 -abi_mips_o32 -abi_s390_32 -abi_s390_64 -abi_x86_32 abi_x86_64 -abi_x86_x32 -doc >x11-libs/libXext-1.3.6:0 -abi_mips_n32 -abi_mips_n64 -abi_mips_o32 -abi_s390_32 -abi_s390_64 -abi_x86_32 abi_x86_64 -abi_x86_x32 -doc >x11-libs/libXrender-0.9.11:0 -abi_mips_n32 -abi_mips_n64 -abi_mips_o32 -abi_s390_32 -abi_s390_64 -abi_x86_32 abi_x86_64 -abi_x86_x32 >x11-libs/pixman-0.43.4:0 -abi_mips_n32 -abi_mips_n64 -abi_mips_o32 -abi_s390_32 -abi_s390_64 -abi_x86_32 abi_x86_64 -abi_x86_x32 -cpu_flags_arm_iwmmxt -cpu_flags_arm_iwmmxt2 -cpu_flags_arm_neon -cpu_flags_ppc_altivec cpu_flags_x86_mmxext cpu_flags_x86_sse2 cpu_flags_x86_ssse3 -loongson2f -static-libs -test >x11-libs/xtrans-1.5.0:0 -doc >x11-misc/compose-tables-1.8.9:0 >x11-misc/shared-mime-info-2.4-r1:0 -test >x11-misc/xdg-utils-1.2.1-r1:0 -X -dbus -doc -gnome > > >############# ># build.log # >############# > > >>>> Unpacking source... >>>> Unpacking pdm-backend-2.3.0.gh.tar.gz to /var/tmp/portage/dev-python/pdm-backend-2.3.0/work >>>> Source unpacked in /var/tmp/portage/dev-python/pdm-backend-2.3.0/work >>>> Preparing source in /var/tmp/portage/dev-python/pdm-backend-2.3.0/work/pdm-backend-2.3.0 ... > * Build system packages: > * dev-python/gpep517 : 15 > * dev-python/installer : 0.7.0 >>>> Source prepared. >>>> Configuring source in /var/tmp/portage/dev-python/pdm-backend-2.3.0/work/pdm-backend-2.3.0 ... >>>> Source configured. >>>> Compiling source in /var/tmp/portage/dev-python/pdm-backend-2.3.0/work/pdm-backend-2.3.0 ... > * pypy3: running distutils-r1_run_phase distutils-r1_python_compile > * Building the wheel for pdm-backend-2.3.0 via pdm.backend.intree >pypy3 -m gpep517 build-wheel --prefix=/usr --backend pdm.backend.intree --output-fd 3 --wheel-dir /var/tmp/portage/dev-python/pdm-backend-2.3.0/work/pdm-backend-2.3.0-pypy3/wheel >2024-05-01 08:20:03,073 gpep517 INFO Building wheel via backend pdm.backend.intree >2024-05-01 08:20:03,397 gpep517 INFO The backend produced /var/tmp/portage/dev-python/pdm-backend-2.3.0/work/pdm-backend-2.3.0-pypy3/wheel/pdm_backend-2.3.0-py3-none-any.whl > - Adding src/pdm/backend/__init__.py -> pdm/backend/__init__.py > - Adding src/pdm/backend/base.py -> pdm/backend/base.py > - Adding src/pdm/backend/config.py -> pdm/backend/config.py > - Adding src/pdm/backend/editable.py -> pdm/backend/editable.py > - Adding src/pdm/backend/exceptions.py -> pdm/backend/exceptions.py > - Adding src/pdm/backend/hooks/__init__.py -> pdm/backend/hooks/__init__.py > - Adding src/pdm/backend/hooks/base.py -> pdm/backend/hooks/base.py > - Adding src/pdm/backend/hooks/setuptools.py -> pdm/backend/hooks/setuptools.py > - Adding src/pdm/backend/hooks/version/__init__.py -> pdm/backend/hooks/version/__init__.py > - Adding src/pdm/backend/hooks/version/scm.py -> pdm/backend/hooks/version/scm.py > - Adding src/pdm/backend/intree.py -> pdm/backend/intree.py > - Adding src/pdm/backend/py.typed -> pdm/backend/py.typed > - Adding src/pdm/backend/sdist.py -> pdm/backend/sdist.py > - Adding src/pdm/backend/structures.py -> pdm/backend/structures.py > - Adding src/pdm/backend/utils.py -> pdm/backend/utils.py > - Adding src/pdm/backend/wheel.py -> pdm/backend/wheel.py > - Adding .pdm-build/pdm_backend-2.3.0.dist-info/METADATA -> pdm_backend-2.3.0.dist-info/METADATA > - Adding .pdm-build/pdm_backend-2.3.0.dist-info/WHEEL -> pdm_backend-2.3.0.dist-info/WHEEL > - Adding .pdm-build/pdm_backend-2.3.0.dist-info/licenses/LICENSE -> pdm_backend-2.3.0.dist-info/licenses/LICENSE > - Adding pdm_backend-2.3.0.dist-info/RECORD -> pdm_backend-2.3.0.dist-info/RECORD > * Installing pdm_backend-2.3.0-py3-none-any.whl to /var/tmp/portage/dev-python/pdm-backend-2.3.0/work/pdm-backend-2.3.0-pypy3/install >pypy3 -m gpep517 install-wheel --destdir=/var/tmp/portage/dev-python/pdm-backend-2.3.0/work/pdm-backend-2.3.0-pypy3/install --interpreter=/usr/bin/pypy3 --prefix=/usr --optimize=all /var/tmp/portage/dev-python/pdm-backend-2.3.0/work/pdm-backend-2.3.0-pypy3/wheel/pdm_backend-2.3.0-py3-none-any.whl >2024-05-01 08:20:03,714 gpep517 INFO Installing /var/tmp/portage/dev-python/pdm-backend-2.3.0/work/pdm-backend-2.3.0-pypy3/wheel/pdm_backend-2.3.0-py3-none-any.whl into /var/tmp/portage/dev-python/pdm-backend-2.3.0/work/pdm-backend-2.3.0-pypy3/install >2024-05-01 08:20:03,852 gpep517 INFO Installation complete > * python3_10: running distutils-r1_run_phase distutils-r1_python_compile > * Building the wheel for pdm-backend-2.3.0 via pdm.backend.intree >python3.10 -m gpep517 build-wheel --prefix=/usr --backend pdm.backend.intree --output-fd 3 --wheel-dir /var/tmp/portage/dev-python/pdm-backend-2.3.0/work/pdm-backend-2.3.0-python3_10/wheel >2024-05-01 08:20:04,393 gpep517 INFO Building wheel via backend pdm.backend.intree >2024-05-01 08:20:04,555 gpep517 INFO The backend produced /var/tmp/portage/dev-python/pdm-backend-2.3.0/work/pdm-backend-2.3.0-python3_10/wheel/pdm_backend-2.3.0-py3-none-any.whl > - Adding src/pdm/backend/__init__.py -> pdm/backend/__init__.py > - Adding src/pdm/backend/base.py -> pdm/backend/base.py > - Adding src/pdm/backend/config.py -> pdm/backend/config.py > - Adding src/pdm/backend/editable.py -> pdm/backend/editable.py > - Adding src/pdm/backend/exceptions.py -> pdm/backend/exceptions.py > - Adding src/pdm/backend/hooks/__init__.py -> pdm/backend/hooks/__init__.py > - Adding src/pdm/backend/hooks/base.py -> pdm/backend/hooks/base.py > - Adding src/pdm/backend/hooks/setuptools.py -> pdm/backend/hooks/setuptools.py > - Adding src/pdm/backend/hooks/version/__init__.py -> pdm/backend/hooks/version/__init__.py > - Adding src/pdm/backend/hooks/version/scm.py -> pdm/backend/hooks/version/scm.py > - Adding src/pdm/backend/intree.py -> pdm/backend/intree.py > - Adding src/pdm/backend/py.typed -> pdm/backend/py.typed > - Adding src/pdm/backend/sdist.py -> pdm/backend/sdist.py > - Adding src/pdm/backend/structures.py -> pdm/backend/structures.py > - Adding src/pdm/backend/utils.py -> pdm/backend/utils.py > - Adding src/pdm/backend/wheel.py -> pdm/backend/wheel.py > - Adding .pdm-build/pdm_backend-2.3.0.dist-info/METADATA -> pdm_backend-2.3.0.dist-info/METADATA > - Adding .pdm-build/pdm_backend-2.3.0.dist-info/WHEEL -> pdm_backend-2.3.0.dist-info/WHEEL > - Adding .pdm-build/pdm_backend-2.3.0.dist-info/licenses/LICENSE -> pdm_backend-2.3.0.dist-info/licenses/LICENSE > - Adding pdm_backend-2.3.0.dist-info/RECORD -> pdm_backend-2.3.0.dist-info/RECORD > * Installing pdm_backend-2.3.0-py3-none-any.whl to /var/tmp/portage/dev-python/pdm-backend-2.3.0/work/pdm-backend-2.3.0-python3_10/install >python3.10 -m gpep517 install-wheel --destdir=/var/tmp/portage/dev-python/pdm-backend-2.3.0/work/pdm-backend-2.3.0-python3_10/install --interpreter=/usr/bin/python3.10 --prefix=/usr --optimize=all /var/tmp/portage/dev-python/pdm-backend-2.3.0/work/pdm-backend-2.3.0-python3_10/wheel/pdm_backend-2.3.0-py3-none-any.whl >2024-05-01 08:20:04,674 gpep517 INFO Installing /var/tmp/portage/dev-python/pdm-backend-2.3.0/work/pdm-backend-2.3.0-python3_10/wheel/pdm_backend-2.3.0-py3-none-any.whl into /var/tmp/portage/dev-python/pdm-backend-2.3.0/work/pdm-backend-2.3.0-python3_10/install >2024-05-01 08:20:04,751 gpep517 INFO Installation complete > * python3_11: running distutils-r1_run_phase distutils-r1_python_compile > * Building the wheel for pdm-backend-2.3.0 via pdm.backend.intree >python3.11 -m gpep517 build-wheel --prefix=/usr --backend pdm.backend.intree --output-fd 3 --wheel-dir /var/tmp/portage/dev-python/pdm-backend-2.3.0/work/pdm-backend-2.3.0-python3_11/wheel >2024-05-01 08:20:05,222 gpep517 INFO Building wheel via backend pdm.backend.intree >2024-05-01 08:20:05,353 gpep517 INFO The backend produced /var/tmp/portage/dev-python/pdm-backend-2.3.0/work/pdm-backend-2.3.0-python3_11/wheel/pdm_backend-2.3.0-py3-none-any.whl > - Adding src/pdm/backend/__init__.py -> pdm/backend/__init__.py > - Adding src/pdm/backend/base.py -> pdm/backend/base.py > - Adding src/pdm/backend/config.py -> pdm/backend/config.py > - Adding src/pdm/backend/editable.py -> pdm/backend/editable.py > - Adding src/pdm/backend/exceptions.py -> pdm/backend/exceptions.py > - Adding src/pdm/backend/hooks/__init__.py -> pdm/backend/hooks/__init__.py > - Adding src/pdm/backend/hooks/base.py -> pdm/backend/hooks/base.py > - Adding src/pdm/backend/hooks/setuptools.py -> pdm/backend/hooks/setuptools.py > - Adding src/pdm/backend/hooks/version/__init__.py -> pdm/backend/hooks/version/__init__.py > - Adding src/pdm/backend/hooks/version/scm.py -> pdm/backend/hooks/version/scm.py > - Adding src/pdm/backend/intree.py -> pdm/backend/intree.py > - Adding src/pdm/backend/py.typed -> pdm/backend/py.typed > - Adding src/pdm/backend/sdist.py -> pdm/backend/sdist.py > - Adding src/pdm/backend/structures.py -> pdm/backend/structures.py > - Adding src/pdm/backend/utils.py -> pdm/backend/utils.py > - Adding src/pdm/backend/wheel.py -> pdm/backend/wheel.py > - Adding .pdm-build/pdm_backend-2.3.0.dist-info/METADATA -> pdm_backend-2.3.0.dist-info/METADATA > - Adding .pdm-build/pdm_backend-2.3.0.dist-info/WHEEL -> pdm_backend-2.3.0.dist-info/WHEEL > - Adding .pdm-build/pdm_backend-2.3.0.dist-info/licenses/LICENSE -> pdm_backend-2.3.0.dist-info/licenses/LICENSE > - Adding pdm_backend-2.3.0.dist-info/RECORD -> pdm_backend-2.3.0.dist-info/RECORD > * Installing pdm_backend-2.3.0-py3-none-any.whl to /var/tmp/portage/dev-python/pdm-backend-2.3.0/work/pdm-backend-2.3.0-python3_11/install >python3.11 -m gpep517 install-wheel --destdir=/var/tmp/portage/dev-python/pdm-backend-2.3.0/work/pdm-backend-2.3.0-python3_11/install --interpreter=/usr/bin/python3.11 --prefix=/usr --optimize=all /var/tmp/portage/dev-python/pdm-backend-2.3.0/work/pdm-backend-2.3.0-python3_11/wheel/pdm_backend-2.3.0-py3-none-any.whl >2024-05-01 08:20:05,546 gpep517 INFO Installing /var/tmp/portage/dev-python/pdm-backend-2.3.0/work/pdm-backend-2.3.0-python3_11/wheel/pdm_backend-2.3.0-py3-none-any.whl into /var/tmp/portage/dev-python/pdm-backend-2.3.0/work/pdm-backend-2.3.0-python3_11/install >2024-05-01 08:20:05,683 gpep517 INFO Installation complete > * python3_12: running distutils-r1_run_phase distutils-r1_python_compile > * Building the wheel for pdm-backend-2.3.0 via pdm.backend.intree >python3.12 -m gpep517 build-wheel --prefix=/usr --backend pdm.backend.intree --output-fd 3 --wheel-dir /var/tmp/portage/dev-python/pdm-backend-2.3.0/work/pdm-backend-2.3.0-python3_12/wheel >2024-05-01 08:20:06,322 gpep517 INFO Building wheel via backend pdm.backend.intree >2024-05-01 08:20:06,494 gpep517 INFO The backend produced /var/tmp/portage/dev-python/pdm-backend-2.3.0/work/pdm-backend-2.3.0-python3_12/wheel/pdm_backend-2.3.0-py3-none-any.whl > - Adding src/pdm/backend/__init__.py -> pdm/backend/__init__.py > - Adding src/pdm/backend/base.py -> pdm/backend/base.py > - Adding src/pdm/backend/config.py -> pdm/backend/config.py > - Adding src/pdm/backend/editable.py -> pdm/backend/editable.py > - Adding src/pdm/backend/exceptions.py -> pdm/backend/exceptions.py > - Adding src/pdm/backend/hooks/__init__.py -> pdm/backend/hooks/__init__.py > - Adding src/pdm/backend/hooks/base.py -> pdm/backend/hooks/base.py > - Adding src/pdm/backend/hooks/setuptools.py -> pdm/backend/hooks/setuptools.py > - Adding src/pdm/backend/hooks/version/__init__.py -> pdm/backend/hooks/version/__init__.py > - Adding src/pdm/backend/hooks/version/scm.py -> pdm/backend/hooks/version/scm.py > - Adding src/pdm/backend/intree.py -> pdm/backend/intree.py > - Adding src/pdm/backend/py.typed -> pdm/backend/py.typed > - Adding src/pdm/backend/sdist.py -> pdm/backend/sdist.py > - Adding src/pdm/backend/structures.py -> pdm/backend/structures.py > - Adding src/pdm/backend/utils.py -> pdm/backend/utils.py > - Adding src/pdm/backend/wheel.py -> pdm/backend/wheel.py > - Adding .pdm-build/pdm_backend-2.3.0.dist-info/METADATA -> pdm_backend-2.3.0.dist-info/METADATA > - Adding .pdm-build/pdm_backend-2.3.0.dist-info/WHEEL -> pdm_backend-2.3.0.dist-info/WHEEL > - Adding .pdm-build/pdm_backend-2.3.0.dist-info/licenses/LICENSE -> pdm_backend-2.3.0.dist-info/licenses/LICENSE > - Adding pdm_backend-2.3.0.dist-info/RECORD -> pdm_backend-2.3.0.dist-info/RECORD > * Installing pdm_backend-2.3.0-py3-none-any.whl to /var/tmp/portage/dev-python/pdm-backend-2.3.0/work/pdm-backend-2.3.0-python3_12/install >python3.12 -m gpep517 install-wheel --destdir=/var/tmp/portage/dev-python/pdm-backend-2.3.0/work/pdm-backend-2.3.0-python3_12/install --interpreter=/usr/bin/python3.12 --prefix=/usr --optimize=all /var/tmp/portage/dev-python/pdm-backend-2.3.0/work/pdm-backend-2.3.0-python3_12/wheel/pdm_backend-2.3.0-py3-none-any.whl >2024-05-01 08:20:06,656 gpep517 INFO Installing /var/tmp/portage/dev-python/pdm-backend-2.3.0/work/pdm-backend-2.3.0-python3_12/wheel/pdm_backend-2.3.0-py3-none-any.whl into /var/tmp/portage/dev-python/pdm-backend-2.3.0/work/pdm-backend-2.3.0-python3_12/install >2024-05-01 08:20:06,749 gpep517 INFO Installation complete >>>> Source compiled. >>>> Test phase: dev-python/pdm-backend-2.3.0 > * pypy3: running distutils-r1_run_phase python_test >pypy3 -m pytest -vv -ra -l -Wdefault -Werror::pytest.PytestUnhandledCoroutineWarning --color=yes -o console_output_style=count -o tmp_path_retention_count=0 -o tmp_path_retention_policy=failed -p no:cov -p no:flake8 -p no:flakes -p no:pylint -p no:markdown -p no:sugar -p no:xvfb -p no:pytest-describe -p no:plus -p no:tavern -p no:salt-factories >============================= test session starts ============================== >platform linux -- Python 3.10.14[pypy-7.3.16-final], pytest-8.2.0, pluggy-1.5.0 -- /var/tmp/portage/dev-python/pdm-backend-2.3.0/work/pdm-backend-2.3.0-pypy3/install/usr/bin/pypy3 >cachedir: .pytest_cache >rootdir: /var/tmp/portage/dev-python/pdm-backend-2.3.0/work/pdm-backend-2.3.0 >configfile: pyproject.toml >collecting ... collected 87 items > >tests/pdm/backend/hooks/version/test_scm.py::test__get_version_from_scm__returns_tag_if_method_unspecified[git] PASSED [ 1/87] >tests/pdm/backend/hooks/version/test_scm.py::test__get_version_from_scm__returns_tag_if_method_unspecified[hg] ERROR [ 2/87] >tests/pdm/backend/hooks/version/test_scm.py::test__get_version_from_scm__adds_details_if_project_is_dirty[git] PASSED [ 3/87] >tests/pdm/backend/hooks/version/test_scm.py::test__get_version_from_scm__adds_details_if_project_is_dirty[hg] ERROR [ 4/87] >tests/pdm/backend/hooks/version/test_scm.py::test__get_version_from_scm__returns_version_if_tag_has_v[git] PASSED [ 5/87] >tests/pdm/backend/hooks/version/test_scm.py::test__get_version_from_scm__returns_version_if_tag_has_v[hg] ERROR [ 6/87] >tests/pdm/backend/hooks/version/test_scm.py::test__get_version_from_scm__returns_default_if_tag_cannot_be_parsed[git] PASSED [ 7/87] >tests/pdm/backend/hooks/version/test_scm.py::test__get_version_from_scm__returns_default_if_tag_cannot_be_parsed[hg] ERROR [ 8/87] >tests/pdm/backend/hooks/version/test_scm.py::test__get_version_from_scm__tag_regex[git] PASSED [ 9/87] >tests/pdm/backend/hooks/version/test_scm.py::test__get_version_from_scm__tag_regex[hg] ERROR [10/87] >tests/pdm/backend/hooks/version/test_scm.py::test__get_version_from_scm__selects_by_tag_filter_on_same_commit[git-0] PASSED [11/87] >tests/pdm/backend/hooks/version/test_scm.py::test__get_version_from_scm__selects_by_tag_filter_on_same_commit[git-1] PASSED [12/87] >tests/pdm/backend/hooks/version/test_scm.py::test__get_version_from_scm__selects_by_tag_filter_on_same_commit[hg-0] ERROR [13/87] >tests/pdm/backend/hooks/version/test_scm.py::test__get_version_from_scm__selects_by_tag_filter_on_same_commit[hg-1] ERROR [14/87] >tests/pdm/backend/hooks/version/test_scm.py::test__get_version_from_scm__selects_by_tag_filter_on_different_commits[git-0] PASSED [15/87] >tests/pdm/backend/hooks/version/test_scm.py::test__get_version_from_scm__selects_by_tag_filter_on_different_commits[git-1] PASSED [16/87] >tests/pdm/backend/hooks/version/test_scm.py::test__get_version_from_scm__selects_by_tag_filter_on_different_commits[hg-0] ERROR [17/87] >tests/pdm/backend/hooks/version/test_scm.py::test__get_version_from_scm__selects_by_tag_filter_on_different_commits[hg-1] ERROR [18/87] >tests/test_api.py::test_build_single_module[demo-module] PASSED [19/87] >tests/test_api.py::test_build_single_module_with_build_number[demo-module] PASSED [20/87] >tests/test_api.py::test_build_single_module_without_build_number[demo-module] PASSED [21/87] >tests/test_api.py::test_build_package[demo-package] PASSED [22/87] >tests/test_api.py::test_build_src_package[demo-src-package] PASSED [23/87] >tests/test_api.py::test_build_package_include[demo-package-include] PASSED [24/87] >tests/test_api.py::test_build_package_data_relative[demo-package-include] PASSED [25/87] >tests/test_api.py::test_namespace_package_by_include[demo-pep420-package] PASSED [26/87] >tests/test_api.py::test_build_explicit_package_dir[demo-explicit-package-dir] PASSED [27/87] >tests/test_api.py::test_demo_metadata_test__sdist__pkg_info[demo-metadata-test] PASSED [28/87] >tests/test_api.py::test_prepare_metadata[demo-package] PASSED [29/87] >tests/test_api.py::test_build_wheel_metadata_identical[demo-package] PASSED [30/87] >tests/test_api.py::test_build_package_with_modules_in_src[demo-src-pymodule] PASSED [31/87] >tests/test_api.py::test_build_with_cextension[demo-cextension] PASSED [32/87] >tests/test_api.py::test_build_with_cextension_in_src[demo-cextension-in-src] PASSED [33/87] >tests/test_api.py::test_build_editable[demo-package] PASSED [34/87] >tests/test_api.py::test_build_editable_src[demo-src-package-include] PASSED [35/87] >tests/test_api.py::test_build_editable_pep420[demo-pep420-package] PASSED [36/87] >tests/test_api.py::test_prepare_metadata_for_editable[demo-package] PASSED [37/87] >tests/test_api.py::test_build_purelib_project_with_build[demo-purelib-with-build] PASSED [38/87] >tests/test_api.py::test_build_wheel_preserve_permission[demo-package] PASSED [39/87] >tests/test_api.py::test_build_wheel_write_version_to_file[demo-using-scm] PASSED [40/87] >tests/test_api.py::test_build_wheel_write_version_to_file_template[demo-using-scm] PASSED [41/87] >tests/test_api.py::test_override_scm_version_via_env_var[demo-using-scm] PASSED [42/87] >tests/test_api.py::test_build_wheel_custom_version_format[demo-using-scm] PASSED [43/87] >tests/test_api.py::test_get_version_from_call[demo-using-scm-get_version:run] PASSED [44/87] >tests/test_api.py::test_get_version_from_call[demo-using-scm-get_version:run()] PASSED [45/87] >tests/test_api.py::test_clean_not_called_if_envset[demo-using-scm-true-False] PASSED [46/87] >tests/test_api.py::test_clean_not_called_if_envset[demo-using-scm-false-True] PASSED [47/87] >tests/test_api.py::test_clean_not_called_if_envset[demo-using-scm-0-True] PASSED [48/87] >tests/test_api.py::test_clean_not_called_if_envset[demo-using-scm-1-False] PASSED [49/87] >tests/test_api.py::test_clean_not_called_if_config_settings_exist[demo-using-scm--False] PASSED [50/87] >tests/test_api.py::test_clean_not_called_if_config_settings_exist[demo-using-scm-True-False] PASSED [51/87] >tests/test_api.py::test_clean_not_called_if_config_settings_exist[demo-using-scm-None-False] PASSED [52/87] >tests/test_file_finder.py::test_auto_include_tests_for_sdist[WheelBuilder] PASSED [53/87] >tests/test_file_finder.py::test_auto_include_tests_for_sdist[SdistBuilder] PASSED [54/87] >tests/test_file_finder.py::test_is_same_or_descendant_path[a/b-a-True] PASSED [55/87] >tests/test_file_finder.py::test_is_same_or_descendant_path[a/b/c-a/b/c-True] PASSED [56/87] >tests/test_file_finder.py::test_is_same_or_descendant_path[b/c-a-False] PASSED [57/87] >tests/test_file_finder.py::test_is_same_or_descendant_path[a-a/b-False] PASSED [58/87] >tests/test_file_finder.py::test_is_same_or_descendant_path[a-b/c-False] PASSED [59/87] >tests/test_file_finder.py::test_recursive_glob_patterns_in_includes[WheelBuilder] PASSED [60/87] >tests/test_file_finder.py::test_recursive_glob_patterns_in_includes[SdistBuilder] PASSED [61/87] >tests/test_file_finder.py::test_merge_includes_and_excludes[includes0-excludes0-False-True] PASSED [62/87] >tests/test_file_finder.py::test_merge_includes_and_excludes[includes1-excludes1-True-False] PASSED [63/87] >tests/test_file_finder.py::test_merge_includes_and_excludes[includes2-excludes2-False-True] PASSED [64/87] >tests/test_file_finder.py::test_merge_includes_and_excludes[includes3-excludes3-True-False] PASSED [65/87] >tests/test_file_finder.py::test_merge_includes_and_excludes[includes4-excludes4-False-False] PASSED [66/87] >tests/test_file_finder.py::test_license_file_globs_no_matching PASSED [67/87] >tests/test_file_finder.py::test_license_file_paths_no_matching PASSED [68/87] >tests/test_file_finder.py::test_license_file_explicit_empty[paths] PASSED [69/87] >tests/test_file_finder.py::test_license_file_explicit_empty[globs] PASSED [70/87] >tests/test_file_finder.py::test_reuse_spec_licenses_dir PASSED [71/87] >tests/test_file_finder.py::test_collect_build_files_with_src_layout PASSED [72/87] >tests/test_hooks.py::test_load_hooks PASSED [73/87] >tests/test_metadata.py::test_parse_module PASSED [74/87] >tests/test_metadata.py::test_parse_package PASSED [75/87] >tests/test_metadata.py::test_parse_error_package PASSED [76/87] >tests/test_metadata.py::test_parse_src_package PASSED [77/87] >tests/test_metadata.py::test_parse_pep420_namespace_package PASSED [78/87] >tests/test_metadata.py::test_explicit_package_dir PASSED [79/87] >tests/test_metadata.py::test_implicit_namespace_package PASSED [80/87] >tests/test_metadata.py::test_src_dir_containing_modules PASSED [81/87] >tests/test_metadata.py::test_default_license_files PASSED [82/87] >tests/test_utils.py::test_expand_vars_posix PASSED [83/87] >tests/test_utils.py::test_expand_vars_win SKIPPED (Windows path) [84/87] >tests/test_wheel.py::test_override_tags_in_wheel_filename[cp36-abi3-win_amd64-cp36-abi3-win_amd64] SKIPPED [85/87] >tests/test_wheel.py::test_override_tags_in_wheel_filename[py3-none-win_amd64-py3-none-win_amd64] SKIPPED [86/87] >tests/test_wheel.py::test_dist_info_name_with_no_version PASSED [87/87] > >==================================== ERRORS ==================================== >_ ERROR at setup of test__get_version_from_scm__returns_tag_if_method_unspecified[hg] _ > >request = <SubRequest 'scm' for <Function test__get_version_from_scm__returns_tag_if_method_unspecified[hg]>> >scm_dir = PosixPath('/var/tmp/portage/dev-python/pdm-backend-2.3.0/temp/tmps9v71hfw') > > @pytest.fixture(params=["git", "hg"]) > def scm(request: pytest.FixtureRequest, scm_dir: Path) -> Scm: >> scm = cast(Scm, request.getfixturevalue(request.param)) > >request = <SubRequest 'scm' for <Function test__get_version_from_scm__returns_tag_if_method_unspecified[hg]>> >scm_dir = PosixPath('/var/tmp/portage/dev-python/pdm-backend-2.3.0/temp/tmps9v71hfw') > >tests/pdm/backend/hooks/version/test_scm.py:167: >_ _ _ _ _ _ _ _ _ _ _ _ _ _ _ _ _ _ _ _ _ _ _ _ _ _ _ _ _ _ _ _ _ _ _ _ _ _ _ _ >/usr/lib/pypy3.10/site-packages/_pytest/fixtures.py:518: in getfixturevalue > fixturedef = self._get_active_fixturedef(argname) > argname = 'hg' > self = <SubRequest 'scm' for <Function test__get_version_from_scm__returns_tag_if_method_unspecified[hg]>> >/usr/lib/pypy3.10/site-packages/_pytest/fixtures.py:603: in _get_active_fixturedef > fixturedef.execute(request=subrequest) > argname = 'hg' > callspec = CallSpec2(params={'scm': 'hg'}, > indices={'scm': 1}, > _arg2scope={'scm': <Scope.Function: 'function'>}, > _idlist=['hg'], > marks=[]) > fixturedef = <FixtureDef argname='hg' scope='function' baseid='tests/pdm/backend/hooks/version/test_scm.py'> > fixturedefs = (<FixtureDef argname='hg' scope='function' baseid='tests/pdm/backend/hooks/version/test_scm.py'>,) > index = -1 > param = <NotSetType.token: 0> > param_index = 0 > request = <SubRequest 'scm' for <Function test__get_version_from_scm__returns_tag_if_method_unspecified[hg]>> > scope = <Scope.Function: 'function'> > self = <SubRequest 'scm' for <Function test__get_version_from_scm__returns_tag_if_method_unspecified[hg]>> > subrequest = <SubRequest 'hg' for <Function test__get_version_from_scm__returns_tag_if_method_unspecified[hg]>> >/usr/lib/pypy3.10/site-packages/_pytest/fixtures.py:1073: in execute > result = ihook.pytest_fixture_setup(fixturedef=self, request=request) > argname = 'scm_dir' > finalizer = functools.partial(<bound method FixtureDef.finish of <FixtureDef argname='hg' scope='function' baseid='tests/pdm/backend/hooks/version/test_scm.py'>>, request=<SubRequest 'hg' for <Function test__get_version_from_scm__returns_tag_if_method_unspecified[hg]>>) > fixturedef = <FixtureDef argname='scm_dir' scope='function' baseid='tests/pdm/backend/hooks/version/test_scm.py'> > ihook = <_pytest.config.compat.PathAwareHookProxy object at 0x000075a91577d130> > my_cache_key = None > parent_fixture = <FixtureDef argname='scm_dir' scope='function' baseid='tests/pdm/backend/hooks/version/test_scm.py'> > request = <SubRequest 'hg' for <Function test__get_version_from_scm__returns_tag_if_method_unspecified[hg]>> > requested_fixtures_that_should_finalize_us = [<FixtureDef argname='scm_dir' scope='function' baseid='tests/pdm/backend/hooks/version/test_scm.py'>] > self = <FixtureDef argname='hg' scope='function' baseid='tests/pdm/backend/hooks/version/test_scm.py'> >/usr/lib/pypy3.10/site-packages/pluggy/_hooks.py:513: in __call__ > return self._hookexec(self.name, self._hookimpls.copy(), kwargs, firstresult) > firstresult = True > kwargs = {'fixturedef': <FixtureDef argname='hg' scope='function' baseid='tests/pdm/backend/hooks/version/test_scm.py'>, > 'request': <SubRequest 'hg' for <Function test__get_version_from_scm__returns_tag_if_method_unspecified[hg]>>} > self = <HookCaller 'pytest_fixture_setup'> >/usr/lib/pypy3.10/site-packages/pluggy/_manager.py:120: in _hookexec > return self._inner_hookexec(hook_name, methods, kwargs, firstresult) > firstresult = True > hook_name = 'pytest_fixture_setup' > kwargs = {'fixturedef': <FixtureDef argname='hg' scope='function' baseid='tests/pdm/backend/hooks/version/test_scm.py'>, > 'request': <SubRequest 'hg' for <Function test__get_version_from_scm__returns_tag_if_method_unspecified[hg]>>} > methods = [<HookImpl plugin_name='fixtures', plugin=<module '_pytest.fixtures' from '/usr/lib/pypy3.10/site-packages/_pytest/fixtures.py'>>, > <HookImpl plugin_name='setupplan', plugin=<module '_pytest.setupplan' from '/usr/lib/pypy3.10/site-packages/_pytest/setupplan.py'>>, > <HookImpl plugin_name='setuponly', plugin=<module '_pytest.setuponly' from '/usr/lib/pypy3.10/site-packages/_pytest/setuponly.py'>>] > self = <_pytest.config.PytestPluginManager object at 0x000075a91577cb80> >/usr/lib/pypy3.10/site-packages/_pytest/setuponly.py:36: in pytest_fixture_setup > return (yield) > fixturedef = <FixtureDef argname='hg' scope='function' baseid='tests/pdm/backend/hooks/version/test_scm.py'> > request = <SubRequest 'hg' for <Function test__get_version_from_scm__returns_tag_if_method_unspecified[hg]>> >/usr/lib/pypy3.10/site-packages/_pytest/fixtures.py:1122: in pytest_fixture_setup > result = call_fixture_func(fixturefunc, request, kwargs) > argname = 'scm_dir' > fixturedef = <FixtureDef argname='hg' scope='function' baseid='tests/pdm/backend/hooks/version/test_scm.py'> > fixturefunc = <function hg at 0x000075a9152ed1a0> > kwargs = {'scm_dir': PosixPath('/var/tmp/portage/dev-python/pdm-backend-2.3.0/temp/tmps9v71hfw')} > my_cache_key = None > request = <SubRequest 'hg' for <Function test__get_version_from_scm__returns_tag_if_method_unspecified[hg]>> >/usr/lib/pypy3.10/site-packages/_pytest/fixtures.py:884: in call_fixture_func > fixture_result = fixturefunc(**kwargs) > fixturefunc = <function hg at 0x000075a9152ed1a0> > kwargs = {'scm_dir': PosixPath('/var/tmp/portage/dev-python/pdm-backend-2.3.0/temp/tmps9v71hfw')} > request = <SubRequest 'hg' for <Function test__get_version_from_scm__returns_tag_if_method_unspecified[hg]>> >_ _ _ _ _ _ _ _ _ _ _ _ _ _ _ _ _ _ _ _ _ _ _ _ _ _ _ _ _ _ _ _ _ _ _ _ _ _ _ _ > >scm_dir = PosixPath('/var/tmp/portage/dev-python/pdm-backend-2.3.0/temp/tmps9v71hfw') > > @pytest.fixture > def hg(scm_dir: Path) -> HgScm: > hg = shutil.which("hg") >> assert hg is not None, "Cannot find hg in path" >E AssertionError: Cannot find hg in path >E assert None is not None > >hg = None >scm_dir = PosixPath('/var/tmp/portage/dev-python/pdm-backend-2.3.0/temp/tmps9v71hfw') > >tests/pdm/backend/hooks/version/test_scm.py:158: AssertionError >_ ERROR at setup of test__get_version_from_scm__adds_details_if_project_is_dirty[hg] _ > >request = <SubRequest 'scm' for <Function test__get_version_from_scm__adds_details_if_project_is_dirty[hg]>> >scm_dir = PosixPath('/var/tmp/portage/dev-python/pdm-backend-2.3.0/temp/tmp838o67cm') > > @pytest.fixture(params=["git", "hg"]) > def scm(request: pytest.FixtureRequest, scm_dir: Path) -> Scm: >> scm = cast(Scm, request.getfixturevalue(request.param)) > >request = <SubRequest 'scm' for <Function test__get_version_from_scm__adds_details_if_project_is_dirty[hg]>> >scm_dir = PosixPath('/var/tmp/portage/dev-python/pdm-backend-2.3.0/temp/tmp838o67cm') > >tests/pdm/backend/hooks/version/test_scm.py:167: >_ _ _ _ _ _ _ _ _ _ _ _ _ _ _ _ _ _ _ _ _ _ _ _ _ _ _ _ _ _ _ _ _ _ _ _ _ _ _ _ >/usr/lib/pypy3.10/site-packages/_pytest/fixtures.py:518: in getfixturevalue > fixturedef = self._get_active_fixturedef(argname) > argname = 'hg' > self = <SubRequest 'scm' for <Function test__get_version_from_scm__adds_details_if_project_is_dirty[hg]>> >/usr/lib/pypy3.10/site-packages/_pytest/fixtures.py:603: in _get_active_fixturedef > fixturedef.execute(request=subrequest) > argname = 'hg' > callspec = CallSpec2(params={'scm': 'hg'}, > indices={'scm': 1}, > _arg2scope={'scm': <Scope.Function: 'function'>}, > _idlist=['hg'], > marks=[]) > fixturedef = <FixtureDef argname='hg' scope='function' baseid='tests/pdm/backend/hooks/version/test_scm.py'> > fixturedefs = (<FixtureDef argname='hg' scope='function' baseid='tests/pdm/backend/hooks/version/test_scm.py'>,) > index = -1 > param = <NotSetType.token: 0> > param_index = 0 > request = <SubRequest 'scm' for <Function test__get_version_from_scm__adds_details_if_project_is_dirty[hg]>> > scope = <Scope.Function: 'function'> > self = <SubRequest 'scm' for <Function test__get_version_from_scm__adds_details_if_project_is_dirty[hg]>> > subrequest = <SubRequest 'hg' for <Function test__get_version_from_scm__adds_details_if_project_is_dirty[hg]>> >/usr/lib/pypy3.10/site-packages/_pytest/fixtures.py:1073: in execute > result = ihook.pytest_fixture_setup(fixturedef=self, request=request) > argname = 'scm_dir' > finalizer = functools.partial(<bound method FixtureDef.finish of <FixtureDef argname='hg' scope='function' baseid='tests/pdm/backend/hooks/version/test_scm.py'>>, request=<SubRequest 'hg' for <Function test__get_version_from_scm__adds_details_if_project_is_dirty[hg]>>) > fixturedef = <FixtureDef argname='scm_dir' scope='function' baseid='tests/pdm/backend/hooks/version/test_scm.py'> > ihook = <_pytest.config.compat.PathAwareHookProxy object at 0x000075a91577d130> > my_cache_key = None > parent_fixture = <FixtureDef argname='scm_dir' scope='function' baseid='tests/pdm/backend/hooks/version/test_scm.py'> > request = <SubRequest 'hg' for <Function test__get_version_from_scm__adds_details_if_project_is_dirty[hg]>> > requested_fixtures_that_should_finalize_us = [<FixtureDef argname='scm_dir' scope='function' baseid='tests/pdm/backend/hooks/version/test_scm.py'>] > self = <FixtureDef argname='hg' scope='function' baseid='tests/pdm/backend/hooks/version/test_scm.py'> >/usr/lib/pypy3.10/site-packages/pluggy/_hooks.py:513: in __call__ > return self._hookexec(self.name, self._hookimpls.copy(), kwargs, firstresult) > firstresult = True > kwargs = {'fixturedef': <FixtureDef argname='hg' scope='function' baseid='tests/pdm/backend/hooks/version/test_scm.py'>, > 'request': <SubRequest 'hg' for <Function test__get_version_from_scm__adds_details_if_project_is_dirty[hg]>>} > self = <HookCaller 'pytest_fixture_setup'> >/usr/lib/pypy3.10/site-packages/pluggy/_manager.py:120: in _hookexec > return self._inner_hookexec(hook_name, methods, kwargs, firstresult) > firstresult = True > hook_name = 'pytest_fixture_setup' > kwargs = {'fixturedef': <FixtureDef argname='hg' scope='function' baseid='tests/pdm/backend/hooks/version/test_scm.py'>, > 'request': <SubRequest 'hg' for <Function test__get_version_from_scm__adds_details_if_project_is_dirty[hg]>>} > methods = [<HookImpl plugin_name='fixtures', plugin=<module '_pytest.fixtures' from '/usr/lib/pypy3.10/site-packages/_pytest/fixtures.py'>>, > <HookImpl plugin_name='setupplan', plugin=<module '_pytest.setupplan' from '/usr/lib/pypy3.10/site-packages/_pytest/setupplan.py'>>, > <HookImpl plugin_name='setuponly', plugin=<module '_pytest.setuponly' from '/usr/lib/pypy3.10/site-packages/_pytest/setuponly.py'>>] > self = <_pytest.config.PytestPluginManager object at 0x000075a91577cb80> >/usr/lib/pypy3.10/site-packages/_pytest/setuponly.py:36: in pytest_fixture_setup > return (yield) > fixturedef = <FixtureDef argname='hg' scope='function' baseid='tests/pdm/backend/hooks/version/test_scm.py'> > request = <SubRequest 'hg' for <Function test__get_version_from_scm__adds_details_if_project_is_dirty[hg]>> >/usr/lib/pypy3.10/site-packages/_pytest/fixtures.py:1122: in pytest_fixture_setup > result = call_fixture_func(fixturefunc, request, kwargs) > argname = 'scm_dir' > fixturedef = <FixtureDef argname='hg' scope='function' baseid='tests/pdm/backend/hooks/version/test_scm.py'> > fixturefunc = <function hg at 0x000075a9152ed1a0> > kwargs = {'scm_dir': PosixPath('/var/tmp/portage/dev-python/pdm-backend-2.3.0/temp/tmp838o67cm')} > my_cache_key = None > request = <SubRequest 'hg' for <Function test__get_version_from_scm__adds_details_if_project_is_dirty[hg]>> >/usr/lib/pypy3.10/site-packages/_pytest/fixtures.py:884: in call_fixture_func > fixture_result = fixturefunc(**kwargs) > fixturefunc = <function hg at 0x000075a9152ed1a0> > kwargs = {'scm_dir': PosixPath('/var/tmp/portage/dev-python/pdm-backend-2.3.0/temp/tmp838o67cm')} > request = <SubRequest 'hg' for <Function test__get_version_from_scm__adds_details_if_project_is_dirty[hg]>> >_ _ _ _ _ _ _ _ _ _ _ _ _ _ _ _ _ _ _ _ _ _ _ _ _ _ _ _ _ _ _ _ _ _ _ _ _ _ _ _ > >scm_dir = PosixPath('/var/tmp/portage/dev-python/pdm-backend-2.3.0/temp/tmp838o67cm') > > @pytest.fixture > def hg(scm_dir: Path) -> HgScm: > hg = shutil.which("hg") >> assert hg is not None, "Cannot find hg in path" >E AssertionError: Cannot find hg in path >E assert None is not None > >hg = None >scm_dir = PosixPath('/var/tmp/portage/dev-python/pdm-backend-2.3.0/temp/tmp838o67cm') > >tests/pdm/backend/hooks/version/test_scm.py:158: AssertionError >_ ERROR at setup of test__get_version_from_scm__returns_version_if_tag_has_v[hg] _ > >request = <SubRequest 'scm' for <Function test__get_version_from_scm__returns_version_if_tag_has_v[hg]>> >scm_dir = PosixPath('/var/tmp/portage/dev-python/pdm-backend-2.3.0/temp/tmp7zefcg3b') > > @pytest.fixture(params=["git", "hg"]) > def scm(request: pytest.FixtureRequest, scm_dir: Path) -> Scm: >> scm = cast(Scm, request.getfixturevalue(request.param)) > >request = <SubRequest 'scm' for <Function test__get_version_from_scm__returns_version_if_tag_has_v[hg]>> >scm_dir = PosixPath('/var/tmp/portage/dev-python/pdm-backend-2.3.0/temp/tmp7zefcg3b') > >tests/pdm/backend/hooks/version/test_scm.py:167: >_ _ _ _ _ _ _ _ _ _ _ _ _ _ _ _ _ _ _ _ _ _ _ _ _ _ _ _ _ _ _ _ _ _ _ _ _ _ _ _ >/usr/lib/pypy3.10/site-packages/_pytest/fixtures.py:518: in getfixturevalue > fixturedef = self._get_active_fixturedef(argname) > argname = 'hg' > self = <SubRequest 'scm' for <Function test__get_version_from_scm__returns_version_if_tag_has_v[hg]>> >/usr/lib/pypy3.10/site-packages/_pytest/fixtures.py:603: in _get_active_fixturedef > fixturedef.execute(request=subrequest) > argname = 'hg' > callspec = CallSpec2(params={'scm': 'hg'}, > indices={'scm': 1}, > _arg2scope={'scm': <Scope.Function: 'function'>}, > _idlist=['hg'], > marks=[]) > fixturedef = <FixtureDef argname='hg' scope='function' baseid='tests/pdm/backend/hooks/version/test_scm.py'> > fixturedefs = (<FixtureDef argname='hg' scope='function' baseid='tests/pdm/backend/hooks/version/test_scm.py'>,) > index = -1 > param = <NotSetType.token: 0> > param_index = 0 > request = <SubRequest 'scm' for <Function test__get_version_from_scm__returns_version_if_tag_has_v[hg]>> > scope = <Scope.Function: 'function'> > self = <SubRequest 'scm' for <Function test__get_version_from_scm__returns_version_if_tag_has_v[hg]>> > subrequest = <SubRequest 'hg' for <Function test__get_version_from_scm__returns_version_if_tag_has_v[hg]>> >/usr/lib/pypy3.10/site-packages/_pytest/fixtures.py:1073: in execute > result = ihook.pytest_fixture_setup(fixturedef=self, request=request) > argname = 'scm_dir' > finalizer = functools.partial(<bound method FixtureDef.finish of <FixtureDef argname='hg' scope='function' baseid='tests/pdm/backend/hooks/version/test_scm.py'>>, request=<SubRequest 'hg' for <Function test__get_version_from_scm__returns_version_if_tag_has_v[hg]>>) > fixturedef = <FixtureDef argname='scm_dir' scope='function' baseid='tests/pdm/backend/hooks/version/test_scm.py'> > ihook = <_pytest.config.compat.PathAwareHookProxy object at 0x000075a91577d130> > my_cache_key = None > parent_fixture = <FixtureDef argname='scm_dir' scope='function' baseid='tests/pdm/backend/hooks/version/test_scm.py'> > request = <SubRequest 'hg' for <Function test__get_version_from_scm__returns_version_if_tag_has_v[hg]>> > requested_fixtures_that_should_finalize_us = [<FixtureDef argname='scm_dir' scope='function' baseid='tests/pdm/backend/hooks/version/test_scm.py'>] > self = <FixtureDef argname='hg' scope='function' baseid='tests/pdm/backend/hooks/version/test_scm.py'> >/usr/lib/pypy3.10/site-packages/pluggy/_hooks.py:513: in __call__ > return self._hookexec(self.name, self._hookimpls.copy(), kwargs, firstresult) > firstresult = True > kwargs = {'fixturedef': <FixtureDef argname='hg' scope='function' baseid='tests/pdm/backend/hooks/version/test_scm.py'>, > 'request': <SubRequest 'hg' for <Function test__get_version_from_scm__returns_version_if_tag_has_v[hg]>>} > self = <HookCaller 'pytest_fixture_setup'> >/usr/lib/pypy3.10/site-packages/pluggy/_manager.py:120: in _hookexec > return self._inner_hookexec(hook_name, methods, kwargs, firstresult) > firstresult = True > hook_name = 'pytest_fixture_setup' > kwargs = {'fixturedef': <FixtureDef argname='hg' scope='function' baseid='tests/pdm/backend/hooks/version/test_scm.py'>, > 'request': <SubRequest 'hg' for <Function test__get_version_from_scm__returns_version_if_tag_has_v[hg]>>} > methods = [<HookImpl plugin_name='fixtures', plugin=<module '_pytest.fixtures' from '/usr/lib/pypy3.10/site-packages/_pytest/fixtures.py'>>, > <HookImpl plugin_name='setupplan', plugin=<module '_pytest.setupplan' from '/usr/lib/pypy3.10/site-packages/_pytest/setupplan.py'>>, > <HookImpl plugin_name='setuponly', plugin=<module '_pytest.setuponly' from '/usr/lib/pypy3.10/site-packages/_pytest/setuponly.py'>>] > self = <_pytest.config.PytestPluginManager object at 0x000075a91577cb80> >/usr/lib/pypy3.10/site-packages/_pytest/setuponly.py:36: in pytest_fixture_setup > return (yield) > fixturedef = <FixtureDef argname='hg' scope='function' baseid='tests/pdm/backend/hooks/version/test_scm.py'> > request = <SubRequest 'hg' for <Function test__get_version_from_scm__returns_version_if_tag_has_v[hg]>> >/usr/lib/pypy3.10/site-packages/_pytest/fixtures.py:1122: in pytest_fixture_setup > result = call_fixture_func(fixturefunc, request, kwargs) > argname = 'scm_dir' > fixturedef = <FixtureDef argname='hg' scope='function' baseid='tests/pdm/backend/hooks/version/test_scm.py'> > fixturefunc = <function hg at 0x000075a9152ed1a0> > kwargs = {'scm_dir': PosixPath('/var/tmp/portage/dev-python/pdm-backend-2.3.0/temp/tmp7zefcg3b')} > my_cache_key = None > request = <SubRequest 'hg' for <Function test__get_version_from_scm__returns_version_if_tag_has_v[hg]>> >/usr/lib/pypy3.10/site-packages/_pytest/fixtures.py:884: in call_fixture_func > fixture_result = fixturefunc(**kwargs) > fixturefunc = <function hg at 0x000075a9152ed1a0> > kwargs = {'scm_dir': PosixPath('/var/tmp/portage/dev-python/pdm-backend-2.3.0/temp/tmp7zefcg3b')} > request = <SubRequest 'hg' for <Function test__get_version_from_scm__returns_version_if_tag_has_v[hg]>> >_ _ _ _ _ _ _ _ _ _ _ _ _ _ _ _ _ _ _ _ _ _ _ _ _ _ _ _ _ _ _ _ _ _ _ _ _ _ _ _ > >scm_dir = PosixPath('/var/tmp/portage/dev-python/pdm-backend-2.3.0/temp/tmp7zefcg3b') > > @pytest.fixture > def hg(scm_dir: Path) -> HgScm: > hg = shutil.which("hg") >> assert hg is not None, "Cannot find hg in path" >E AssertionError: Cannot find hg in path >E assert None is not None > >hg = None >scm_dir = PosixPath('/var/tmp/portage/dev-python/pdm-backend-2.3.0/temp/tmp7zefcg3b') > >tests/pdm/backend/hooks/version/test_scm.py:158: AssertionError >_ ERROR at setup of test__get_version_from_scm__returns_default_if_tag_cannot_be_parsed[hg] _ > >request = <SubRequest 'scm' for <Function test__get_version_from_scm__returns_default_if_tag_cannot_be_parsed[hg]>> >scm_dir = PosixPath('/var/tmp/portage/dev-python/pdm-backend-2.3.0/temp/tmphw9e4lat') > > @pytest.fixture(params=["git", "hg"]) > def scm(request: pytest.FixtureRequest, scm_dir: Path) -> Scm: >> scm = cast(Scm, request.getfixturevalue(request.param)) > >request = <SubRequest 'scm' for <Function test__get_version_from_scm__returns_default_if_tag_cannot_be_parsed[hg]>> >scm_dir = PosixPath('/var/tmp/portage/dev-python/pdm-backend-2.3.0/temp/tmphw9e4lat') > >tests/pdm/backend/hooks/version/test_scm.py:167: >_ _ _ _ _ _ _ _ _ _ _ _ _ _ _ _ _ _ _ _ _ _ _ _ _ _ _ _ _ _ _ _ _ _ _ _ _ _ _ _ >/usr/lib/pypy3.10/site-packages/_pytest/fixtures.py:518: in getfixturevalue > fixturedef = self._get_active_fixturedef(argname) > argname = 'hg' > self = <SubRequest 'scm' for <Function test__get_version_from_scm__returns_default_if_tag_cannot_be_parsed[hg]>> >/usr/lib/pypy3.10/site-packages/_pytest/fixtures.py:603: in _get_active_fixturedef > fixturedef.execute(request=subrequest) > argname = 'hg' > callspec = CallSpec2(params={'scm': 'hg'}, > indices={'scm': 1}, > _arg2scope={'scm': <Scope.Function: 'function'>}, > _idlist=['hg'], > marks=[]) > fixturedef = <FixtureDef argname='hg' scope='function' baseid='tests/pdm/backend/hooks/version/test_scm.py'> > fixturedefs = (<FixtureDef argname='hg' scope='function' baseid='tests/pdm/backend/hooks/version/test_scm.py'>,) > index = -1 > param = <NotSetType.token: 0> > param_index = 0 > request = <SubRequest 'scm' for <Function test__get_version_from_scm__returns_default_if_tag_cannot_be_parsed[hg]>> > scope = <Scope.Function: 'function'> > self = <SubRequest 'scm' for <Function test__get_version_from_scm__returns_default_if_tag_cannot_be_parsed[hg]>> > subrequest = <SubRequest 'hg' for <Function test__get_version_from_scm__returns_default_if_tag_cannot_be_parsed[hg]>> >/usr/lib/pypy3.10/site-packages/_pytest/fixtures.py:1073: in execute > result = ihook.pytest_fixture_setup(fixturedef=self, request=request) > argname = 'scm_dir' > finalizer = functools.partial(<bound method FixtureDef.finish of <FixtureDef argname='hg' scope='function' baseid='tests/pdm/backend/hooks/version/test_scm.py'>>, request=<SubRequest 'hg' for <Function test__get_version_from_scm__returns_default_if_tag_cannot_be_parsed[hg]>>) > fixturedef = <FixtureDef argname='scm_dir' scope='function' baseid='tests/pdm/backend/hooks/version/test_scm.py'> > ihook = <_pytest.config.compat.PathAwareHookProxy object at 0x000075a91577d130> > my_cache_key = None > parent_fixture = <FixtureDef argname='scm_dir' scope='function' baseid='tests/pdm/backend/hooks/version/test_scm.py'> > request = <SubRequest 'hg' for <Function test__get_version_from_scm__returns_default_if_tag_cannot_be_parsed[hg]>> > requested_fixtures_that_should_finalize_us = [<FixtureDef argname='scm_dir' scope='function' baseid='tests/pdm/backend/hooks/version/test_scm.py'>] > self = <FixtureDef argname='hg' scope='function' baseid='tests/pdm/backend/hooks/version/test_scm.py'> >/usr/lib/pypy3.10/site-packages/pluggy/_hooks.py:513: in __call__ > return self._hookexec(self.name, self._hookimpls.copy(), kwargs, firstresult) > firstresult = True > kwargs = {'fixturedef': <FixtureDef argname='hg' scope='function' baseid='tests/pdm/backend/hooks/version/test_scm.py'>, > 'request': <SubRequest 'hg' for <Function test__get_version_from_scm__returns_default_if_tag_cannot_be_parsed[hg]>>} > self = <HookCaller 'pytest_fixture_setup'> >/usr/lib/pypy3.10/site-packages/pluggy/_manager.py:120: in _hookexec > return self._inner_hookexec(hook_name, methods, kwargs, firstresult) > firstresult = True > hook_name = 'pytest_fixture_setup' > kwargs = {'fixturedef': <FixtureDef argname='hg' scope='function' baseid='tests/pdm/backend/hooks/version/test_scm.py'>, > 'request': <SubRequest 'hg' for <Function test__get_version_from_scm__returns_default_if_tag_cannot_be_parsed[hg]>>} > methods = [<HookImpl plugin_name='fixtures', plugin=<module '_pytest.fixtures' from '/usr/lib/pypy3.10/site-packages/_pytest/fixtures.py'>>, > <HookImpl plugin_name='setupplan', plugin=<module '_pytest.setupplan' from '/usr/lib/pypy3.10/site-packages/_pytest/setupplan.py'>>, > <HookImpl plugin_name='setuponly', plugin=<module '_pytest.setuponly' from '/usr/lib/pypy3.10/site-packages/_pytest/setuponly.py'>>] > self = <_pytest.config.PytestPluginManager object at 0x000075a91577cb80> >/usr/lib/pypy3.10/site-packages/_pytest/setuponly.py:36: in pytest_fixture_setup > return (yield) > fixturedef = <FixtureDef argname='hg' scope='function' baseid='tests/pdm/backend/hooks/version/test_scm.py'> > request = <SubRequest 'hg' for <Function test__get_version_from_scm__returns_default_if_tag_cannot_be_parsed[hg]>> >/usr/lib/pypy3.10/site-packages/_pytest/fixtures.py:1122: in pytest_fixture_setup > result = call_fixture_func(fixturefunc, request, kwargs) > argname = 'scm_dir' > fixturedef = <FixtureDef argname='hg' scope='function' baseid='tests/pdm/backend/hooks/version/test_scm.py'> > fixturefunc = <function hg at 0x000075a9152ed1a0> > kwargs = {'scm_dir': PosixPath('/var/tmp/portage/dev-python/pdm-backend-2.3.0/temp/tmphw9e4lat')} > my_cache_key = None > request = <SubRequest 'hg' for <Function test__get_version_from_scm__returns_default_if_tag_cannot_be_parsed[hg]>> >/usr/lib/pypy3.10/site-packages/_pytest/fixtures.py:884: in call_fixture_func > fixture_result = fixturefunc(**kwargs) > fixturefunc = <function hg at 0x000075a9152ed1a0> > kwargs = {'scm_dir': PosixPath('/var/tmp/portage/dev-python/pdm-backend-2.3.0/temp/tmphw9e4lat')} > request = <SubRequest 'hg' for <Function test__get_version_from_scm__returns_default_if_tag_cannot_be_parsed[hg]>> >_ _ _ _ _ _ _ _ _ _ _ _ _ _ _ _ _ _ _ _ _ _ _ _ _ _ _ _ _ _ _ _ _ _ _ _ _ _ _ _ > >scm_dir = PosixPath('/var/tmp/portage/dev-python/pdm-backend-2.3.0/temp/tmphw9e4lat') > > @pytest.fixture > def hg(scm_dir: Path) -> HgScm: > hg = shutil.which("hg") >> assert hg is not None, "Cannot find hg in path" >E AssertionError: Cannot find hg in path >E assert None is not None > >hg = None >scm_dir = PosixPath('/var/tmp/portage/dev-python/pdm-backend-2.3.0/temp/tmphw9e4lat') > >tests/pdm/backend/hooks/version/test_scm.py:158: AssertionError >_________ ERROR at setup of test__get_version_from_scm__tag_regex[hg] __________ > >request = <SubRequest 'scm' for <Function test__get_version_from_scm__tag_regex[hg]>> >scm_dir = PosixPath('/var/tmp/portage/dev-python/pdm-backend-2.3.0/temp/tmpz2qwr6mb') > > @pytest.fixture(params=["git", "hg"]) > def scm(request: pytest.FixtureRequest, scm_dir: Path) -> Scm: >> scm = cast(Scm, request.getfixturevalue(request.param)) > >request = <SubRequest 'scm' for <Function test__get_version_from_scm__tag_regex[hg]>> >scm_dir = PosixPath('/var/tmp/portage/dev-python/pdm-backend-2.3.0/temp/tmpz2qwr6mb') > >tests/pdm/backend/hooks/version/test_scm.py:167: >_ _ _ _ _ _ _ _ _ _ _ _ _ _ _ _ _ _ _ _ _ _ _ _ _ _ _ _ _ _ _ _ _ _ _ _ _ _ _ _ >/usr/lib/pypy3.10/site-packages/_pytest/fixtures.py:518: in getfixturevalue > fixturedef = self._get_active_fixturedef(argname) > argname = 'hg' > self = <SubRequest 'scm' for <Function test__get_version_from_scm__tag_regex[hg]>> >/usr/lib/pypy3.10/site-packages/_pytest/fixtures.py:603: in _get_active_fixturedef > fixturedef.execute(request=subrequest) > argname = 'hg' > callspec = CallSpec2(params={'scm': 'hg'}, > indices={'scm': 1}, > _arg2scope={'scm': <Scope.Function: 'function'>}, > _idlist=['hg'], > marks=[]) > fixturedef = <FixtureDef argname='hg' scope='function' baseid='tests/pdm/backend/hooks/version/test_scm.py'> > fixturedefs = (<FixtureDef argname='hg' scope='function' baseid='tests/pdm/backend/hooks/version/test_scm.py'>,) > index = -1 > param = <NotSetType.token: 0> > param_index = 0 > request = <SubRequest 'scm' for <Function test__get_version_from_scm__tag_regex[hg]>> > scope = <Scope.Function: 'function'> > self = <SubRequest 'scm' for <Function test__get_version_from_scm__tag_regex[hg]>> > subrequest = <SubRequest 'hg' for <Function test__get_version_from_scm__tag_regex[hg]>> >/usr/lib/pypy3.10/site-packages/_pytest/fixtures.py:1073: in execute > result = ihook.pytest_fixture_setup(fixturedef=self, request=request) > argname = 'scm_dir' > finalizer = functools.partial(<bound method FixtureDef.finish of <FixtureDef argname='hg' scope='function' baseid='tests/pdm/backend/hooks/version/test_scm.py'>>, request=<SubRequest 'hg' for <Function test__get_version_from_scm__tag_regex[hg]>>) > fixturedef = <FixtureDef argname='scm_dir' scope='function' baseid='tests/pdm/backend/hooks/version/test_scm.py'> > ihook = <_pytest.config.compat.PathAwareHookProxy object at 0x000075a91577d130> > my_cache_key = None > parent_fixture = <FixtureDef argname='scm_dir' scope='function' baseid='tests/pdm/backend/hooks/version/test_scm.py'> > request = <SubRequest 'hg' for <Function test__get_version_from_scm__tag_regex[hg]>> > requested_fixtures_that_should_finalize_us = [<FixtureDef argname='scm_dir' scope='function' baseid='tests/pdm/backend/hooks/version/test_scm.py'>] > self = <FixtureDef argname='hg' scope='function' baseid='tests/pdm/backend/hooks/version/test_scm.py'> >/usr/lib/pypy3.10/site-packages/pluggy/_hooks.py:513: in __call__ > return self._hookexec(self.name, self._hookimpls.copy(), kwargs, firstresult) > firstresult = True > kwargs = {'fixturedef': <FixtureDef argname='hg' scope='function' baseid='tests/pdm/backend/hooks/version/test_scm.py'>, > 'request': <SubRequest 'hg' for <Function test__get_version_from_scm__tag_regex[hg]>>} > self = <HookCaller 'pytest_fixture_setup'> >/usr/lib/pypy3.10/site-packages/pluggy/_manager.py:120: in _hookexec > return self._inner_hookexec(hook_name, methods, kwargs, firstresult) > firstresult = True > hook_name = 'pytest_fixture_setup' > kwargs = {'fixturedef': <FixtureDef argname='hg' scope='function' baseid='tests/pdm/backend/hooks/version/test_scm.py'>, > 'request': <SubRequest 'hg' for <Function test__get_version_from_scm__tag_regex[hg]>>} > methods = [<HookImpl plugin_name='fixtures', plugin=<module '_pytest.fixtures' from '/usr/lib/pypy3.10/site-packages/_pytest/fixtures.py'>>, > <HookImpl plugin_name='setupplan', plugin=<module '_pytest.setupplan' from '/usr/lib/pypy3.10/site-packages/_pytest/setupplan.py'>>, > <HookImpl plugin_name='setuponly', plugin=<module '_pytest.setuponly' from '/usr/lib/pypy3.10/site-packages/_pytest/setuponly.py'>>] > self = <_pytest.config.PytestPluginManager object at 0x000075a91577cb80> >/usr/lib/pypy3.10/site-packages/_pytest/setuponly.py:36: in pytest_fixture_setup > return (yield) > fixturedef = <FixtureDef argname='hg' scope='function' baseid='tests/pdm/backend/hooks/version/test_scm.py'> > request = <SubRequest 'hg' for <Function test__get_version_from_scm__tag_regex[hg]>> >/usr/lib/pypy3.10/site-packages/_pytest/fixtures.py:1122: in pytest_fixture_setup > result = call_fixture_func(fixturefunc, request, kwargs) > argname = 'scm_dir' > fixturedef = <FixtureDef argname='hg' scope='function' baseid='tests/pdm/backend/hooks/version/test_scm.py'> > fixturefunc = <function hg at 0x000075a9152ed1a0> > kwargs = {'scm_dir': PosixPath('/var/tmp/portage/dev-python/pdm-backend-2.3.0/temp/tmpz2qwr6mb')} > my_cache_key = None > request = <SubRequest 'hg' for <Function test__get_version_from_scm__tag_regex[hg]>> >/usr/lib/pypy3.10/site-packages/_pytest/fixtures.py:884: in call_fixture_func > fixture_result = fixturefunc(**kwargs) > fixturefunc = <function hg at 0x000075a9152ed1a0> > kwargs = {'scm_dir': PosixPath('/var/tmp/portage/dev-python/pdm-backend-2.3.0/temp/tmpz2qwr6mb')} > request = <SubRequest 'hg' for <Function test__get_version_from_scm__tag_regex[hg]>> >_ _ _ _ _ _ _ _ _ _ _ _ _ _ _ _ _ _ _ _ _ _ _ _ _ _ _ _ _ _ _ _ _ _ _ _ _ _ _ _ > >scm_dir = PosixPath('/var/tmp/portage/dev-python/pdm-backend-2.3.0/temp/tmpz2qwr6mb') > > @pytest.fixture > def hg(scm_dir: Path) -> HgScm: > hg = shutil.which("hg") >> assert hg is not None, "Cannot find hg in path" >E AssertionError: Cannot find hg in path >E assert None is not None > >hg = None >scm_dir = PosixPath('/var/tmp/portage/dev-python/pdm-backend-2.3.0/temp/tmpz2qwr6mb') > >tests/pdm/backend/hooks/version/test_scm.py:158: AssertionError >_ ERROR at setup of test__get_version_from_scm__selects_by_tag_filter_on_same_commit[hg-0] _ > >request = <SubRequest 'scm' for <Function test__get_version_from_scm__selects_by_tag_filter_on_same_commit[hg-0]>> >scm_dir = PosixPath('/var/tmp/portage/dev-python/pdm-backend-2.3.0/temp/tmp51u78eno') > > @pytest.fixture(params=["git", "hg"]) > def scm(request: pytest.FixtureRequest, scm_dir: Path) -> Scm: >> scm = cast(Scm, request.getfixturevalue(request.param)) > >request = <SubRequest 'scm' for <Function test__get_version_from_scm__selects_by_tag_filter_on_same_commit[hg-0]>> >scm_dir = PosixPath('/var/tmp/portage/dev-python/pdm-backend-2.3.0/temp/tmp51u78eno') > >tests/pdm/backend/hooks/version/test_scm.py:167: >_ _ _ _ _ _ _ _ _ _ _ _ _ _ _ _ _ _ _ _ _ _ _ _ _ _ _ _ _ _ _ _ _ _ _ _ _ _ _ _ >/usr/lib/pypy3.10/site-packages/_pytest/fixtures.py:518: in getfixturevalue > fixturedef = self._get_active_fixturedef(argname) > argname = 'hg' > self = <SubRequest 'scm' for <Function test__get_version_from_scm__selects_by_tag_filter_on_same_commit[hg-0]>> >/usr/lib/pypy3.10/site-packages/_pytest/fixtures.py:603: in _get_active_fixturedef > fixturedef.execute(request=subrequest) > argname = 'hg' > callspec = CallSpec2(params={'index': 0, 'scm': 'hg'}, > indices={'index': 0, 'scm': 1}, > _arg2scope={'index': <Scope.Function: 'function'>, > 'scm': <Scope.Function: 'function'>}, > _idlist=['hg', '0'], > marks=[]) > fixturedef = <FixtureDef argname='hg' scope='function' baseid='tests/pdm/backend/hooks/version/test_scm.py'> > fixturedefs = (<FixtureDef argname='hg' scope='function' baseid='tests/pdm/backend/hooks/version/test_scm.py'>,) > index = -1 > param = <NotSetType.token: 0> > param_index = 0 > request = <SubRequest 'scm' for <Function test__get_version_from_scm__selects_by_tag_filter_on_same_commit[hg-0]>> > scope = <Scope.Function: 'function'> > self = <SubRequest 'scm' for <Function test__get_version_from_scm__selects_by_tag_filter_on_same_commit[hg-0]>> > subrequest = <SubRequest 'hg' for <Function test__get_version_from_scm__selects_by_tag_filter_on_same_commit[hg-0]>> >/usr/lib/pypy3.10/site-packages/_pytest/fixtures.py:1073: in execute > result = ihook.pytest_fixture_setup(fixturedef=self, request=request) > argname = 'scm_dir' > finalizer = functools.partial(<bound method FixtureDef.finish of <FixtureDef argname='hg' scope='function' baseid='tests/pdm/backend/hooks/version/test_scm.py'>>, request=<SubRequest 'hg' for <Function test__get_version_from_scm__selects_by_tag_filter_on_same_commit[hg-0]>>) > fixturedef = <FixtureDef argname='scm_dir' scope='function' baseid='tests/pdm/backend/hooks/version/test_scm.py'> > ihook = <_pytest.config.compat.PathAwareHookProxy object at 0x000075a91577d130> > my_cache_key = None > parent_fixture = <FixtureDef argname='scm_dir' scope='function' baseid='tests/pdm/backend/hooks/version/test_scm.py'> > request = <SubRequest 'hg' for <Function test__get_version_from_scm__selects_by_tag_filter_on_same_commit[hg-0]>> > requested_fixtures_that_should_finalize_us = [<FixtureDef argname='scm_dir' scope='function' baseid='tests/pdm/backend/hooks/version/test_scm.py'>] > self = <FixtureDef argname='hg' scope='function' baseid='tests/pdm/backend/hooks/version/test_scm.py'> >/usr/lib/pypy3.10/site-packages/pluggy/_hooks.py:513: in __call__ > return self._hookexec(self.name, self._hookimpls.copy(), kwargs, firstresult) > firstresult = True > kwargs = {'fixturedef': <FixtureDef argname='hg' scope='function' baseid='tests/pdm/backend/hooks/version/test_scm.py'>, > 'request': <SubRequest 'hg' for <Function test__get_version_from_scm__selects_by_tag_filter_on_same_commit[hg-0]>>} > self = <HookCaller 'pytest_fixture_setup'> >/usr/lib/pypy3.10/site-packages/pluggy/_manager.py:120: in _hookexec > return self._inner_hookexec(hook_name, methods, kwargs, firstresult) > firstresult = True > hook_name = 'pytest_fixture_setup' > kwargs = {'fixturedef': <FixtureDef argname='hg' scope='function' baseid='tests/pdm/backend/hooks/version/test_scm.py'>, > 'request': <SubRequest 'hg' for <Function test__get_version_from_scm__selects_by_tag_filter_on_same_commit[hg-0]>>} > methods = [<HookImpl plugin_name='fixtures', plugin=<module '_pytest.fixtures' from '/usr/lib/pypy3.10/site-packages/_pytest/fixtures.py'>>, > <HookImpl plugin_name='setupplan', plugin=<module '_pytest.setupplan' from '/usr/lib/pypy3.10/site-packages/_pytest/setupplan.py'>>, > <HookImpl plugin_name='setuponly', plugin=<module '_pytest.setuponly' from '/usr/lib/pypy3.10/site-packages/_pytest/setuponly.py'>>] > self = <_pytest.config.PytestPluginManager object at 0x000075a91577cb80> >/usr/lib/pypy3.10/site-packages/_pytest/setuponly.py:36: in pytest_fixture_setup > return (yield) > fixturedef = <FixtureDef argname='hg' scope='function' baseid='tests/pdm/backend/hooks/version/test_scm.py'> > request = <SubRequest 'hg' for <Function test__get_version_from_scm__selects_by_tag_filter_on_same_commit[hg-0]>> >/usr/lib/pypy3.10/site-packages/_pytest/fixtures.py:1122: in pytest_fixture_setup > result = call_fixture_func(fixturefunc, request, kwargs) > argname = 'scm_dir' > fixturedef = <FixtureDef argname='hg' scope='function' baseid='tests/pdm/backend/hooks/version/test_scm.py'> > fixturefunc = <function hg at 0x000075a9152ed1a0> > kwargs = {'scm_dir': PosixPath('/var/tmp/portage/dev-python/pdm-backend-2.3.0/temp/tmp51u78eno')} > my_cache_key = None > request = <SubRequest 'hg' for <Function test__get_version_from_scm__selects_by_tag_filter_on_same_commit[hg-0]>> >/usr/lib/pypy3.10/site-packages/_pytest/fixtures.py:884: in call_fixture_func > fixture_result = fixturefunc(**kwargs) > fixturefunc = <function hg at 0x000075a9152ed1a0> > kwargs = {'scm_dir': PosixPath('/var/tmp/portage/dev-python/pdm-backend-2.3.0/temp/tmp51u78eno')} > request = <SubRequest 'hg' for <Function test__get_version_from_scm__selects_by_tag_filter_on_same_commit[hg-0]>> >_ _ _ _ _ _ _ _ _ _ _ _ _ _ _ _ _ _ _ _ _ _ _ _ _ _ _ _ _ _ _ _ _ _ _ _ _ _ _ _ > >scm_dir = PosixPath('/var/tmp/portage/dev-python/pdm-backend-2.3.0/temp/tmp51u78eno') > > @pytest.fixture > def hg(scm_dir: Path) -> HgScm: > hg = shutil.which("hg") >> assert hg is not None, "Cannot find hg in path" >E AssertionError: Cannot find hg in path >E assert None is not None > >hg = None >scm_dir = PosixPath('/var/tmp/portage/dev-python/pdm-backend-2.3.0/temp/tmp51u78eno') > >tests/pdm/backend/hooks/version/test_scm.py:158: AssertionError >_ ERROR at setup of test__get_version_from_scm__selects_by_tag_filter_on_same_commit[hg-1] _ > >request = <SubRequest 'scm' for <Function test__get_version_from_scm__selects_by_tag_filter_on_same_commit[hg-1]>> >scm_dir = PosixPath('/var/tmp/portage/dev-python/pdm-backend-2.3.0/temp/tmpngalt4bg') > > @pytest.fixture(params=["git", "hg"]) > def scm(request: pytest.FixtureRequest, scm_dir: Path) -> Scm: >> scm = cast(Scm, request.getfixturevalue(request.param)) > >request = <SubRequest 'scm' for <Function test__get_version_from_scm__selects_by_tag_filter_on_same_commit[hg-1]>> >scm_dir = PosixPath('/var/tmp/portage/dev-python/pdm-backend-2.3.0/temp/tmpngalt4bg') > >tests/pdm/backend/hooks/version/test_scm.py:167: >_ _ _ _ _ _ _ _ _ _ _ _ _ _ _ _ _ _ _ _ _ _ _ _ _ _ _ _ _ _ _ _ _ _ _ _ _ _ _ _ >/usr/lib/pypy3.10/site-packages/_pytest/fixtures.py:518: in getfixturevalue > fixturedef = self._get_active_fixturedef(argname) > argname = 'hg' > self = <SubRequest 'scm' for <Function test__get_version_from_scm__selects_by_tag_filter_on_same_commit[hg-1]>> >/usr/lib/pypy3.10/site-packages/_pytest/fixtures.py:603: in _get_active_fixturedef > fixturedef.execute(request=subrequest) > argname = 'hg' > callspec = CallSpec2(params={'index': 1, 'scm': 'hg'}, > indices={'index': 1, 'scm': 1}, > _arg2scope={'index': <Scope.Function: 'function'>, > 'scm': <Scope.Function: 'function'>}, > _idlist=['hg', '1'], > marks=[]) > fixturedef = <FixtureDef argname='hg' scope='function' baseid='tests/pdm/backend/hooks/version/test_scm.py'> > fixturedefs = (<FixtureDef argname='hg' scope='function' baseid='tests/pdm/backend/hooks/version/test_scm.py'>,) > index = -1 > param = <NotSetType.token: 0> > param_index = 0 > request = <SubRequest 'scm' for <Function test__get_version_from_scm__selects_by_tag_filter_on_same_commit[hg-1]>> > scope = <Scope.Function: 'function'> > self = <SubRequest 'scm' for <Function test__get_version_from_scm__selects_by_tag_filter_on_same_commit[hg-1]>> > subrequest = <SubRequest 'hg' for <Function test__get_version_from_scm__selects_by_tag_filter_on_same_commit[hg-1]>> >/usr/lib/pypy3.10/site-packages/_pytest/fixtures.py:1073: in execute > result = ihook.pytest_fixture_setup(fixturedef=self, request=request) > argname = 'scm_dir' > finalizer = functools.partial(<bound method FixtureDef.finish of <FixtureDef argname='hg' scope='function' baseid='tests/pdm/backend/hooks/version/test_scm.py'>>, request=<SubRequest 'hg' for <Function test__get_version_from_scm__selects_by_tag_filter_on_same_commit[hg-1]>>) > fixturedef = <FixtureDef argname='scm_dir' scope='function' baseid='tests/pdm/backend/hooks/version/test_scm.py'> > ihook = <_pytest.config.compat.PathAwareHookProxy object at 0x000075a91577d130> > my_cache_key = None > parent_fixture = <FixtureDef argname='scm_dir' scope='function' baseid='tests/pdm/backend/hooks/version/test_scm.py'> > request = <SubRequest 'hg' for <Function test__get_version_from_scm__selects_by_tag_filter_on_same_commit[hg-1]>> > requested_fixtures_that_should_finalize_us = [<FixtureDef argname='scm_dir' scope='function' baseid='tests/pdm/backend/hooks/version/test_scm.py'>] > self = <FixtureDef argname='hg' scope='function' baseid='tests/pdm/backend/hooks/version/test_scm.py'> >/usr/lib/pypy3.10/site-packages/pluggy/_hooks.py:513: in __call__ > return self._hookexec(self.name, self._hookimpls.copy(), kwargs, firstresult) > firstresult = True > kwargs = {'fixturedef': <FixtureDef argname='hg' scope='function' baseid='tests/pdm/backend/hooks/version/test_scm.py'>, > 'request': <SubRequest 'hg' for <Function test__get_version_from_scm__selects_by_tag_filter_on_same_commit[hg-1]>>} > self = <HookCaller 'pytest_fixture_setup'> >/usr/lib/pypy3.10/site-packages/pluggy/_manager.py:120: in _hookexec > return self._inner_hookexec(hook_name, methods, kwargs, firstresult) > firstresult = True > hook_name = 'pytest_fixture_setup' > kwargs = {'fixturedef': <FixtureDef argname='hg' scope='function' baseid='tests/pdm/backend/hooks/version/test_scm.py'>, > 'request': <SubRequest 'hg' for <Function test__get_version_from_scm__selects_by_tag_filter_on_same_commit[hg-1]>>} > methods = [<HookImpl plugin_name='fixtures', plugin=<module '_pytest.fixtures' from '/usr/lib/pypy3.10/site-packages/_pytest/fixtures.py'>>, > <HookImpl plugin_name='setupplan', plugin=<module '_pytest.setupplan' from '/usr/lib/pypy3.10/site-packages/_pytest/setupplan.py'>>, > <HookImpl plugin_name='setuponly', plugin=<module '_pytest.setuponly' from '/usr/lib/pypy3.10/site-packages/_pytest/setuponly.py'>>] > self = <_pytest.config.PytestPluginManager object at 0x000075a91577cb80> >/usr/lib/pypy3.10/site-packages/_pytest/setuponly.py:36: in pytest_fixture_setup > return (yield) > fixturedef = <FixtureDef argname='hg' scope='function' baseid='tests/pdm/backend/hooks/version/test_scm.py'> > request = <SubRequest 'hg' for <Function test__get_version_from_scm__selects_by_tag_filter_on_same_commit[hg-1]>> >/usr/lib/pypy3.10/site-packages/_pytest/fixtures.py:1122: in pytest_fixture_setup > result = call_fixture_func(fixturefunc, request, kwargs) > argname = 'scm_dir' > fixturedef = <FixtureDef argname='hg' scope='function' baseid='tests/pdm/backend/hooks/version/test_scm.py'> > fixturefunc = <function hg at 0x000075a9152ed1a0> > kwargs = {'scm_dir': PosixPath('/var/tmp/portage/dev-python/pdm-backend-2.3.0/temp/tmpngalt4bg')} > my_cache_key = None > request = <SubRequest 'hg' for <Function test__get_version_from_scm__selects_by_tag_filter_on_same_commit[hg-1]>> >/usr/lib/pypy3.10/site-packages/_pytest/fixtures.py:884: in call_fixture_func > fixture_result = fixturefunc(**kwargs) > fixturefunc = <function hg at 0x000075a9152ed1a0> > kwargs = {'scm_dir': PosixPath('/var/tmp/portage/dev-python/pdm-backend-2.3.0/temp/tmpngalt4bg')} > request = <SubRequest 'hg' for <Function test__get_version_from_scm__selects_by_tag_filter_on_same_commit[hg-1]>> >_ _ _ _ _ _ _ _ _ _ _ _ _ _ _ _ _ _ _ _ _ _ _ _ _ _ _ _ _ _ _ _ _ _ _ _ _ _ _ _ > >scm_dir = PosixPath('/var/tmp/portage/dev-python/pdm-backend-2.3.0/temp/tmpngalt4bg') > > @pytest.fixture > def hg(scm_dir: Path) -> HgScm: > hg = shutil.which("hg") >> assert hg is not None, "Cannot find hg in path" >E AssertionError: Cannot find hg in path >E assert None is not None > >hg = None >scm_dir = PosixPath('/var/tmp/portage/dev-python/pdm-backend-2.3.0/temp/tmpngalt4bg') > >tests/pdm/backend/hooks/version/test_scm.py:158: AssertionError >_ ERROR at setup of test__get_version_from_scm__selects_by_tag_filter_on_different_commits[hg-0] _ > >request = <SubRequest 'scm' for <Function test__get_version_from_scm__selects_by_tag_filter_on_different_commits[hg-0]>> >scm_dir = PosixPath('/var/tmp/portage/dev-python/pdm-backend-2.3.0/temp/tmp_a5dmkj2') > > @pytest.fixture(params=["git", "hg"]) > def scm(request: pytest.FixtureRequest, scm_dir: Path) -> Scm: >> scm = cast(Scm, request.getfixturevalue(request.param)) > >request = <SubRequest 'scm' for <Function test__get_version_from_scm__selects_by_tag_filter_on_different_commits[hg-0]>> >scm_dir = PosixPath('/var/tmp/portage/dev-python/pdm-backend-2.3.0/temp/tmp_a5dmkj2') > >tests/pdm/backend/hooks/version/test_scm.py:167: >_ _ _ _ _ _ _ _ _ _ _ _ _ _ _ _ _ _ _ _ _ _ _ _ _ _ _ _ _ _ _ _ _ _ _ _ _ _ _ _ >/usr/lib/pypy3.10/site-packages/_pytest/fixtures.py:518: in getfixturevalue > fixturedef = self._get_active_fixturedef(argname) > argname = 'hg' > self = <SubRequest 'scm' for <Function test__get_version_from_scm__selects_by_tag_filter_on_different_commits[hg-0]>> >/usr/lib/pypy3.10/site-packages/_pytest/fixtures.py:603: in _get_active_fixturedef > fixturedef.execute(request=subrequest) > argname = 'hg' > callspec = CallSpec2(params={'index': 0, 'scm': 'hg'}, > indices={'index': 0, 'scm': 1}, > _arg2scope={'index': <Scope.Function: 'function'>, > 'scm': <Scope.Function: 'function'>}, > _idlist=['hg', '0'], > marks=[]) > fixturedef = <FixtureDef argname='hg' scope='function' baseid='tests/pdm/backend/hooks/version/test_scm.py'> > fixturedefs = (<FixtureDef argname='hg' scope='function' baseid='tests/pdm/backend/hooks/version/test_scm.py'>,) > index = -1 > param = <NotSetType.token: 0> > param_index = 0 > request = <SubRequest 'scm' for <Function test__get_version_from_scm__selects_by_tag_filter_on_different_commits[hg-0]>> > scope = <Scope.Function: 'function'> > self = <SubRequest 'scm' for <Function test__get_version_from_scm__selects_by_tag_filter_on_different_commits[hg-0]>> > subrequest = <SubRequest 'hg' for <Function test__get_version_from_scm__selects_by_tag_filter_on_different_commits[hg-0]>> >/usr/lib/pypy3.10/site-packages/_pytest/fixtures.py:1073: in execute > result = ihook.pytest_fixture_setup(fixturedef=self, request=request) > argname = 'scm_dir' > finalizer = functools.partial(<bound method FixtureDef.finish of <FixtureDef argname='hg' scope='function' baseid='tests/pdm/backend/hooks/version/test_scm.py'>>, request=<SubRequest 'hg' for <Function test__get_version_from_scm__selects_by_tag_filter_on_different_commits[hg-0]>>) > fixturedef = <FixtureDef argname='scm_dir' scope='function' baseid='tests/pdm/backend/hooks/version/test_scm.py'> > ihook = <_pytest.config.compat.PathAwareHookProxy object at 0x000075a91577d130> > my_cache_key = None > parent_fixture = <FixtureDef argname='scm_dir' scope='function' baseid='tests/pdm/backend/hooks/version/test_scm.py'> > request = <SubRequest 'hg' for <Function test__get_version_from_scm__selects_by_tag_filter_on_different_commits[hg-0]>> > requested_fixtures_that_should_finalize_us = [<FixtureDef argname='scm_dir' scope='function' baseid='tests/pdm/backend/hooks/version/test_scm.py'>] > self = <FixtureDef argname='hg' scope='function' baseid='tests/pdm/backend/hooks/version/test_scm.py'> >/usr/lib/pypy3.10/site-packages/pluggy/_hooks.py:513: in __call__ > return self._hookexec(self.name, self._hookimpls.copy(), kwargs, firstresult) > firstresult = True > kwargs = {'fixturedef': <FixtureDef argname='hg' scope='function' baseid='tests/pdm/backend/hooks/version/test_scm.py'>, > 'request': <SubRequest 'hg' for <Function test__get_version_from_scm__selects_by_tag_filter_on_different_commits[hg-0]>>} > self = <HookCaller 'pytest_fixture_setup'> >/usr/lib/pypy3.10/site-packages/pluggy/_manager.py:120: in _hookexec > return self._inner_hookexec(hook_name, methods, kwargs, firstresult) > firstresult = True > hook_name = 'pytest_fixture_setup' > kwargs = {'fixturedef': <FixtureDef argname='hg' scope='function' baseid='tests/pdm/backend/hooks/version/test_scm.py'>, > 'request': <SubRequest 'hg' for <Function test__get_version_from_scm__selects_by_tag_filter_on_different_commits[hg-0]>>} > methods = [<HookImpl plugin_name='fixtures', plugin=<module '_pytest.fixtures' from '/usr/lib/pypy3.10/site-packages/_pytest/fixtures.py'>>, > <HookImpl plugin_name='setupplan', plugin=<module '_pytest.setupplan' from '/usr/lib/pypy3.10/site-packages/_pytest/setupplan.py'>>, > <HookImpl plugin_name='setuponly', plugin=<module '_pytest.setuponly' from '/usr/lib/pypy3.10/site-packages/_pytest/setuponly.py'>>] > self = <_pytest.config.PytestPluginManager object at 0x000075a91577cb80> >/usr/lib/pypy3.10/site-packages/_pytest/setuponly.py:36: in pytest_fixture_setup > return (yield) > fixturedef = <FixtureDef argname='hg' scope='function' baseid='tests/pdm/backend/hooks/version/test_scm.py'> > request = <SubRequest 'hg' for <Function test__get_version_from_scm__selects_by_tag_filter_on_different_commits[hg-0]>> >/usr/lib/pypy3.10/site-packages/_pytest/fixtures.py:1122: in pytest_fixture_setup > result = call_fixture_func(fixturefunc, request, kwargs) > argname = 'scm_dir' > fixturedef = <FixtureDef argname='hg' scope='function' baseid='tests/pdm/backend/hooks/version/test_scm.py'> > fixturefunc = <function hg at 0x000075a9152ed1a0> > kwargs = {'scm_dir': PosixPath('/var/tmp/portage/dev-python/pdm-backend-2.3.0/temp/tmp_a5dmkj2')} > my_cache_key = None > request = <SubRequest 'hg' for <Function test__get_version_from_scm__selects_by_tag_filter_on_different_commits[hg-0]>> >/usr/lib/pypy3.10/site-packages/_pytest/fixtures.py:884: in call_fixture_func > fixture_result = fixturefunc(**kwargs) > fixturefunc = <function hg at 0x000075a9152ed1a0> > kwargs = {'scm_dir': PosixPath('/var/tmp/portage/dev-python/pdm-backend-2.3.0/temp/tmp_a5dmkj2')} > request = <SubRequest 'hg' for <Function test__get_version_from_scm__selects_by_tag_filter_on_different_commits[hg-0]>> >_ _ _ _ _ _ _ _ _ _ _ _ _ _ _ _ _ _ _ _ _ _ _ _ _ _ _ _ _ _ _ _ _ _ _ _ _ _ _ _ > >scm_dir = PosixPath('/var/tmp/portage/dev-python/pdm-backend-2.3.0/temp/tmp_a5dmkj2') > > @pytest.fixture > def hg(scm_dir: Path) -> HgScm: > hg = shutil.which("hg") >> assert hg is not None, "Cannot find hg in path" >E AssertionError: Cannot find hg in path >E assert None is not None > >hg = None >scm_dir = PosixPath('/var/tmp/portage/dev-python/pdm-backend-2.3.0/temp/tmp_a5dmkj2') > >tests/pdm/backend/hooks/version/test_scm.py:158: AssertionError >_ ERROR at setup of test__get_version_from_scm__selects_by_tag_filter_on_different_commits[hg-1] _ > >request = <SubRequest 'scm' for <Function test__get_version_from_scm__selects_by_tag_filter_on_different_commits[hg-1]>> >scm_dir = PosixPath('/var/tmp/portage/dev-python/pdm-backend-2.3.0/temp/tmpjpuwl07j') > > @pytest.fixture(params=["git", "hg"]) > def scm(request: pytest.FixtureRequest, scm_dir: Path) -> Scm: >> scm = cast(Scm, request.getfixturevalue(request.param)) > >request = <SubRequest 'scm' for <Function test__get_version_from_scm__selects_by_tag_filter_on_different_commits[hg-1]>> >scm_dir = PosixPath('/var/tmp/portage/dev-python/pdm-backend-2.3.0/temp/tmpjpuwl07j') > >tests/pdm/backend/hooks/version/test_scm.py:167: >_ _ _ _ _ _ _ _ _ _ _ _ _ _ _ _ _ _ _ _ _ _ _ _ _ _ _ _ _ _ _ _ _ _ _ _ _ _ _ _ >/usr/lib/pypy3.10/site-packages/_pytest/fixtures.py:518: in getfixturevalue > fixturedef = self._get_active_fixturedef(argname) > argname = 'hg' > self = <SubRequest 'scm' for <Function test__get_version_from_scm__selects_by_tag_filter_on_different_commits[hg-1]>> >/usr/lib/pypy3.10/site-packages/_pytest/fixtures.py:603: in _get_active_fixturedef > fixturedef.execute(request=subrequest) > argname = 'hg' > callspec = CallSpec2(params={'index': 1, 'scm': 'hg'}, > indices={'index': 1, 'scm': 1}, > _arg2scope={'index': <Scope.Function: 'function'>, > 'scm': <Scope.Function: 'function'>}, > _idlist=['hg', '1'], > marks=[]) > fixturedef = <FixtureDef argname='hg' scope='function' baseid='tests/pdm/backend/hooks/version/test_scm.py'> > fixturedefs = (<FixtureDef argname='hg' scope='function' baseid='tests/pdm/backend/hooks/version/test_scm.py'>,) > index = -1 > param = <NotSetType.token: 0> > param_index = 0 > request = <SubRequest 'scm' for <Function test__get_version_from_scm__selects_by_tag_filter_on_different_commits[hg-1]>> > scope = <Scope.Function: 'function'> > self = <SubRequest 'scm' for <Function test__get_version_from_scm__selects_by_tag_filter_on_different_commits[hg-1]>> > subrequest = <SubRequest 'hg' for <Function test__get_version_from_scm__selects_by_tag_filter_on_different_commits[hg-1]>> >/usr/lib/pypy3.10/site-packages/_pytest/fixtures.py:1073: in execute > result = ihook.pytest_fixture_setup(fixturedef=self, request=request) > argname = 'scm_dir' > finalizer = functools.partial(<bound method FixtureDef.finish of <FixtureDef argname='hg' scope='function' baseid='tests/pdm/backend/hooks/version/test_scm.py'>>, request=<SubRequest 'hg' for <Function test__get_version_from_scm__selects_by_tag_filter_on_different_commits[hg-1]>>) > fixturedef = <FixtureDef argname='scm_dir' scope='function' baseid='tests/pdm/backend/hooks/version/test_scm.py'> > ihook = <_pytest.config.compat.PathAwareHookProxy object at 0x000075a91577d130> > my_cache_key = None > parent_fixture = <FixtureDef argname='scm_dir' scope='function' baseid='tests/pdm/backend/hooks/version/test_scm.py'> > request = <SubRequest 'hg' for <Function test__get_version_from_scm__selects_by_tag_filter_on_different_commits[hg-1]>> > requested_fixtures_that_should_finalize_us = [<FixtureDef argname='scm_dir' scope='function' baseid='tests/pdm/backend/hooks/version/test_scm.py'>] > self = <FixtureDef argname='hg' scope='function' baseid='tests/pdm/backend/hooks/version/test_scm.py'> >/usr/lib/pypy3.10/site-packages/pluggy/_hooks.py:513: in __call__ > return self._hookexec(self.name, self._hookimpls.copy(), kwargs, firstresult) > firstresult = True > kwargs = {'fixturedef': <FixtureDef argname='hg' scope='function' baseid='tests/pdm/backend/hooks/version/test_scm.py'>, > 'request': <SubRequest 'hg' for <Function test__get_version_from_scm__selects_by_tag_filter_on_different_commits[hg-1]>>} > self = <HookCaller 'pytest_fixture_setup'> >/usr/lib/pypy3.10/site-packages/pluggy/_manager.py:120: in _hookexec > return self._inner_hookexec(hook_name, methods, kwargs, firstresult) > firstresult = True > hook_name = 'pytest_fixture_setup' > kwargs = {'fixturedef': <FixtureDef argname='hg' scope='function' baseid='tests/pdm/backend/hooks/version/test_scm.py'>, > 'request': <SubRequest 'hg' for <Function test__get_version_from_scm__selects_by_tag_filter_on_different_commits[hg-1]>>} > methods = [<HookImpl plugin_name='fixtures', plugin=<module '_pytest.fixtures' from '/usr/lib/pypy3.10/site-packages/_pytest/fixtures.py'>>, > <HookImpl plugin_name='setupplan', plugin=<module '_pytest.setupplan' from '/usr/lib/pypy3.10/site-packages/_pytest/setupplan.py'>>, > <HookImpl plugin_name='setuponly', plugin=<module '_pytest.setuponly' from '/usr/lib/pypy3.10/site-packages/_pytest/setuponly.py'>>] > self = <_pytest.config.PytestPluginManager object at 0x000075a91577cb80> >/usr/lib/pypy3.10/site-packages/_pytest/setuponly.py:36: in pytest_fixture_setup > return (yield) > fixturedef = <FixtureDef argname='hg' scope='function' baseid='tests/pdm/backend/hooks/version/test_scm.py'> > request = <SubRequest 'hg' for <Function test__get_version_from_scm__selects_by_tag_filter_on_different_commits[hg-1]>> >/usr/lib/pypy3.10/site-packages/_pytest/fixtures.py:1122: in pytest_fixture_setup > result = call_fixture_func(fixturefunc, request, kwargs) > argname = 'scm_dir' > fixturedef = <FixtureDef argname='hg' scope='function' baseid='tests/pdm/backend/hooks/version/test_scm.py'> > fixturefunc = <function hg at 0x000075a9152ed1a0> > kwargs = {'scm_dir': PosixPath('/var/tmp/portage/dev-python/pdm-backend-2.3.0/temp/tmpjpuwl07j')} > my_cache_key = None > request = <SubRequest 'hg' for <Function test__get_version_from_scm__selects_by_tag_filter_on_different_commits[hg-1]>> >/usr/lib/pypy3.10/site-packages/_pytest/fixtures.py:884: in call_fixture_func > fixture_result = fixturefunc(**kwargs) > fixturefunc = <function hg at 0x000075a9152ed1a0> > kwargs = {'scm_dir': PosixPath('/var/tmp/portage/dev-python/pdm-backend-2.3.0/temp/tmpjpuwl07j')} > request = <SubRequest 'hg' for <Function test__get_version_from_scm__selects_by_tag_filter_on_different_commits[hg-1]>> >_ _ _ _ _ _ _ _ _ _ _ _ _ _ _ _ _ _ _ _ _ _ _ _ _ _ _ _ _ _ _ _ _ _ _ _ _ _ _ _ > >scm_dir = PosixPath('/var/tmp/portage/dev-python/pdm-backend-2.3.0/temp/tmpjpuwl07j') > > @pytest.fixture > def hg(scm_dir: Path) -> HgScm: > hg = shutil.which("hg") >> assert hg is not None, "Cannot find hg in path" >E AssertionError: Cannot find hg in path >E assert None is not None > >hg = None >scm_dir = PosixPath('/var/tmp/portage/dev-python/pdm-backend-2.3.0/temp/tmpjpuwl07j') > >tests/pdm/backend/hooks/version/test_scm.py:158: AssertionError >=========================== short test summary info ============================ >SKIPPED [1] tests/test_utils.py:20: Windows path >SKIPPED [2] tests/test_wheel.py:10: invalid on PyPy3 >ERROR tests/pdm/backend/hooks/version/test_scm.py::test__get_version_from_scm__returns_tag_if_method_unspecified[hg] - AssertionError: Cannot find hg in path >assert None is not None >ERROR tests/pdm/backend/hooks/version/test_scm.py::test__get_version_from_scm__adds_details_if_project_is_dirty[hg] - AssertionError: Cannot find hg in path >assert None is not None >ERROR tests/pdm/backend/hooks/version/test_scm.py::test__get_version_from_scm__returns_version_if_tag_has_v[hg] - AssertionError: Cannot find hg in path >assert None is not None >ERROR tests/pdm/backend/hooks/version/test_scm.py::test__get_version_from_scm__returns_default_if_tag_cannot_be_parsed[hg] - AssertionError: Cannot find hg in path >assert None is not None >ERROR tests/pdm/backend/hooks/version/test_scm.py::test__get_version_from_scm__tag_regex[hg] - AssertionError: Cannot find hg in path >assert None is not None >ERROR tests/pdm/backend/hooks/version/test_scm.py::test__get_version_from_scm__selects_by_tag_filter_on_same_commit[hg-0] - AssertionError: Cannot find hg in path >assert None is not None >ERROR tests/pdm/backend/hooks/version/test_scm.py::test__get_version_from_scm__selects_by_tag_filter_on_same_commit[hg-1] - AssertionError: Cannot find hg in path >assert None is not None >ERROR tests/pdm/backend/hooks/version/test_scm.py::test__get_version_from_scm__selects_by_tag_filter_on_different_commits[hg-0] - AssertionError: Cannot find hg in path >assert None is not None >ERROR tests/pdm/backend/hooks/version/test_scm.py::test__get_version_from_scm__selects_by_tag_filter_on_different_commits[hg-1] - AssertionError: Cannot find hg in path >assert None is not None >=================== 75 passed, 3 skipped, 9 errors in 12.68s =================== > * ERROR: dev-python/pdm-backend-2.3.0::gentoo failed (test phase): > * pytest failed with pypy3 > * > * Call stack: > * ebuild.sh, line 136: Called src_test > * environment, line 4023: Called distutils-r1_src_test > * environment, line 1918: Called _distutils-r1_run_foreach_impl 'python_test' > * environment, line 743: Called python_foreach_impl 'distutils-r1_run_phase' 'python_test' > * environment, line 3623: Called multibuild_foreach_variant '_python_multibuild_wrapper' 'distutils-r1_run_phase' 'python_test' > * environment, line 3074: Called _multibuild_run '_python_multibuild_wrapper' 'distutils-r1_run_phase' 'python_test' > * environment, line 3072: Called _python_multibuild_wrapper 'distutils-r1_run_phase' 'python_test' > * environment, line 1175: Called distutils-r1_run_phase 'python_test' > * environment, line 1841: Called python_test > * environment, line 3905: Called distutils-r1_python_test > * environment, line 1779: Called epytest > * environment, line 2496: Called die > * The specific snippet of code: > * "${@}" || die -n "pytest failed with ${EPYTHON}"; > * > * If you need support, post the output of `emerge --info '=dev-python/pdm-backend-2.3.0::gentoo'`, > * the complete build log and the output of `emerge -pqv '=dev-python/pdm-backend-2.3.0::gentoo'`. > * The complete build log is located at '/var/log/emerge-log/build/dev-python/pdm-backend-2.3.0:20240501-061954.log'. > * For convenience, a symlink to the build log is located at '/var/tmp/portage/dev-python/pdm-backend-2.3.0/temp/build.log'. > * The ebuild environment file is located at '/var/tmp/portage/dev-python/pdm-backend-2.3.0/temp/environment'. > * Working directory: '/var/tmp/portage/dev-python/pdm-backend-2.3.0/work/pdm-backend-2.3.0' > * S: '/var/tmp/portage/dev-python/pdm-backend-2.3.0/work/pdm-backend-2.3.0' >
You cannot view the attachment while viewing its details because your browser does not support IFRAMEs.
View the attachment on a separate page
.
View Attachment As Raw
Actions:
View
Attachments on
bug 931017
: 892074