Go to:
Gentoo Home
Documentation
Forums
Lists
Bugs
Planet
Store
Wiki
Get Gentoo!
Gentoo's Bugzilla – Attachment 887144 Details for
Bug 926553
app-arch/bzip2-1.0.8-r5 fails test - ./bzip2: error while loading shared libraries: libbz2.so.1: cannot open shared object file: No such file or direc
Home
|
New
–
[Ex]
|
Browse
|
Search
|
Privacy Policy
|
[?]
|
Reports
|
Requests
|
Help
|
New Account
|
Log In
[x]
|
Forgot Password
Login:
[x]
app-arch:bzip2-1.0.8-r5:20240309-005738.log
app-arch:bzip2-1.0.8-r5:20240309-005738.log (text/plain), 14.95 KB, created by
Toralf Förster
on 2024-03-09 09:40:39 UTC
(
hide
)
Description:
app-arch:bzip2-1.0.8-r5:20240309-005738.log
Filename:
MIME Type:
Creator:
Toralf Förster
Created:
2024-03-09 09:40:39 UTC
Size:
14.95 KB
patch
obsolete
> * Package: app-arch/bzip2-1.0.8-r5:0/1 > * Repository: gentoo > * Maintainer: base-system@gentoo.org > * USE: abi_x86_32 abi_x86_64 amd64 elibc_glibc kernel_linux > * FEATURES: network-sandbox preserve-libs sandbox test userpriv usersandbox > >>>> Unpacking source... >>>> Unpacking bzip2-1.0.8.tar.gz to /var/tmp/portage/app-arch/bzip2-1.0.8-r5/work >>>> Source unpacked in /var/tmp/portage/app-arch/bzip2-1.0.8-r5/work >>>> Preparing source in /var/tmp/portage/app-arch/bzip2-1.0.8-r5/work/bzip2-1.0.8 ... > * Applying bzip2-1.0.4-makefile-CFLAGS.patch ... > [ ok ] > * Applying bzip2-1.0.8-saneso.patch ... > [ ok ] > * Applying bzip2-1.0.4-man-links.patch ... >patching file Makefile >Hunk #1 succeeded at 85 with fuzz 2. > [ ok ] > * Applying bzip2-1.0.6-progress.patch ... >patching file bzip2.1 >patching file bzip2.c >Hunk #1 succeeded at 53 (offset -92 lines). >Hunk #2 succeeded at 210 with fuzz 2 (offset -92 lines). >Hunk #3 succeeded at 336 (offset -91 lines). >Hunk #4 succeeded at 349 (offset -91 lines). >Hunk #5 succeeded at 372 (offset -91 lines). >Hunk #6 succeeded at 472 with fuzz 2 (offset -87 lines). >Hunk #7 succeeded at 481 (offset -87 lines). >Hunk #8 succeeded at 509 (offset -87 lines). >Hunk #9 succeeded at 1858 (offset -69 lines). >Hunk #10 succeeded at 1936 (offset -69 lines). >Hunk #11 succeeded at 1973 (offset -69 lines). > [ ok ] > * Applying bzip2-1.0.3-no-test.patch ... > [ ok ] > * Applying bzip2-1.0.8-mingw.patch ... > [ ok ] > * Applying bzip2-1.0.8-out-of-tree-build.patch ... > [ ok ] >>>> Source prepared. >>>> Configuring source in /var/tmp/portage/app-arch/bzip2-1.0.8-r5/work/bzip2-1.0.8 ... > * abi_x86_32.x86: running multilib-minimal_abi_src_configure > * abi_x86_64.amd64: running multilib-minimal_abi_src_configure >>>> Source configured. >>>> Compiling source in /var/tmp/portage/app-arch/bzip2-1.0.8-r5/work/bzip2-1.0.8 ... > * abi_x86_32.x86: running multilib-minimal_abi_src_compile >make -j4 VPATH=/var/tmp/portage/app-arch/bzip2-1.0.8-r5/work/bzip2-1.0.8 'CC=x86_64-pc-linux-gnu-gcc -m32 -mfpmath=sse' AR=x86_64-pc-linux-gnu-ar RANLIB=x86_64-pc-linux-gnu-ranlib -f /var/tmp/portage/app-arch/bzip2-1.0.8-r5/work/bzip2-1.0.8/Makefile-libbz2_so all >x86_64-pc-linux-gnu-gcc -m32 -mfpmath=sse -fpermissive -O2 -pipe -march=native -fno-diagnostics-color -fpic -fPIC -Wall -Winline -D_FILE_OFFSET_BITS=64 -c /var/tmp/portage/app-arch/bzip2-1.0.8-r5/work/bzip2-1.0.8/blocksort.c >x86_64-pc-linux-gnu-gcc -m32 -mfpmath=sse -fpermissive -O2 -pipe -march=native -fno-diagnostics-color -fpic -fPIC -Wall -Winline -D_FILE_OFFSET_BITS=64 -c /var/tmp/portage/app-arch/bzip2-1.0.8-r5/work/bzip2-1.0.8/huffman.c >x86_64-pc-linux-gnu-gcc -m32 -mfpmath=sse -fpermissive -O2 -pipe -march=native -fno-diagnostics-color -fpic -fPIC -Wall -Winline -D_FILE_OFFSET_BITS=64 -c /var/tmp/portage/app-arch/bzip2-1.0.8-r5/work/bzip2-1.0.8/crctable.c >x86_64-pc-linux-gnu-gcc -m32 -mfpmath=sse -fpermissive -O2 -pipe -march=native -fno-diagnostics-color -fpic -fPIC -Wall -Winline -D_FILE_OFFSET_BITS=64 -c /var/tmp/portage/app-arch/bzip2-1.0.8-r5/work/bzip2-1.0.8/randtable.c >x86_64-pc-linux-gnu-gcc -m32 -mfpmath=sse -fpermissive -O2 -pipe -march=native -fno-diagnostics-color -fpic -fPIC -Wall -Winline -D_FILE_OFFSET_BITS=64 -c /var/tmp/portage/app-arch/bzip2-1.0.8-r5/work/bzip2-1.0.8/compress.c >x86_64-pc-linux-gnu-gcc -m32 -mfpmath=sse -fpermissive -O2 -pipe -march=native -fno-diagnostics-color -fpic -fPIC -Wall -Winline -D_FILE_OFFSET_BITS=64 -c /var/tmp/portage/app-arch/bzip2-1.0.8-r5/work/bzip2-1.0.8/decompress.c >x86_64-pc-linux-gnu-gcc -m32 -mfpmath=sse -fpermissive -O2 -pipe -march=native -fno-diagnostics-color -fpic -fPIC -Wall -Winline -D_FILE_OFFSET_BITS=64 -c /var/tmp/portage/app-arch/bzip2-1.0.8-r5/work/bzip2-1.0.8/bzlib.c >In function âmainSimpleSortâ, > inlined from âmainQSort3â at /var/tmp/portage/app-arch/bzip2-1.0.8-r5/work/bzip2-1.0.8/blocksort.c:651:10, > inlined from âmainSortâ at /var/tmp/portage/app-arch/bzip2-1.0.8-r5/work/bzip2-1.0.8/blocksort.c:897:19: >/var/tmp/portage/app-arch/bzip2-1.0.8-r5/work/bzip2-1.0.8/blocksort.c:347:6: warning: inlining failed in call to âmainGtUâ: --param max-inline-insns-single limit reached [-Winline] > 347 | Bool mainGtU ( UInt32 i1, > | ^~~~~~~ >/var/tmp/portage/app-arch/bzip2-1.0.8-r5/work/bzip2-1.0.8/blocksort.c:514:18: note: called from here > 514 | while ( mainGtU ( > | ^~~~~~~~~ > 515 | ptr[j-h]+d, v+d, block, quadrant, nblock, budget > | ~~~~~~~~~~~~~~~~~~~~~~~~~~~~~~~~~~~~~~~~~~~~~~~~ > 516 | ) ) { > | ~ >/var/tmp/portage/app-arch/bzip2-1.0.8-r5/work/bzip2-1.0.8/blocksort.c:347:6: warning: inlining failed in call to âmainGtUâ: --param max-inline-insns-single limit reached [-Winline] > 347 | Bool mainGtU ( UInt32 i1, > | ^~~~~~~ >/var/tmp/portage/app-arch/bzip2-1.0.8-r5/work/bzip2-1.0.8/blocksort.c:528:18: note: called from here > 528 | while ( mainGtU ( > | ^~~~~~~~~ > 529 | ptr[j-h]+d, v+d, block, quadrant, nblock, budget > | ~~~~~~~~~~~~~~~~~~~~~~~~~~~~~~~~~~~~~~~~~~~~~~~~ > 530 | ) ) { > | ~ >/var/tmp/portage/app-arch/bzip2-1.0.8-r5/work/bzip2-1.0.8/blocksort.c:347:6: warning: inlining failed in call to âmainGtUâ: --param max-inline-insns-single limit reached [-Winline] > 347 | Bool mainGtU ( UInt32 i1, > | ^~~~~~~ >/var/tmp/portage/app-arch/bzip2-1.0.8-r5/work/bzip2-1.0.8/blocksort.c:542:18: note: called from here > 542 | while ( mainGtU ( > | ^~~~~~~~~ > 543 | ptr[j-h]+d, v+d, block, quadrant, nblock, budget > | ~~~~~~~~~~~~~~~~~~~~~~~~~~~~~~~~~~~~~~~~~~~~~~~~ > 544 | ) ) { > | ~ >x86_64-pc-linux-gnu-gcc -m32 -mfpmath=sse -Wl,-O1 -Wl,--as-needed -Wl,--defsym=__gentoo_check_ldflags__=0 -shared -Wl,-soname -Wl,libbz2.so.1 -o libbz2.so.1.0.8 blocksort.o huffman.o crctable.o randtable.o compress.o decompress.o bzlib.o >ln -sf libbz2.so.1.0.8 libbz2.so.1.0 >make -j4 VPATH=/var/tmp/portage/app-arch/bzip2-1.0.8-r5/work/bzip2-1.0.8 'CC=x86_64-pc-linux-gnu-gcc -m32 -mfpmath=sse' AR=x86_64-pc-linux-gnu-ar RANLIB=x86_64-pc-linux-gnu-ranlib -f /var/tmp/portage/app-arch/bzip2-1.0.8-r5/work/bzip2-1.0.8/Makefile all 'LDFLAGS=-Wl,-O1 -Wl,--as-needed -Wl,--defsym=__gentoo_check_ldflags__=0 ' >rm -f libbz2.a >x86_64-pc-linux-gnu-gcc -m32 -mfpmath=sse -fpermissive -O2 -pipe -march=native -fno-diagnostics-color -Wall -Winline -D_FILE_OFFSET_BITS=64 -c /var/tmp/portage/app-arch/bzip2-1.0.8-r5/work/bzip2-1.0.8/bzip2.c >x86_64-pc-linux-gnu-gcc -m32 -mfpmath=sse -fpermissive -O2 -pipe -march=native -fno-diagnostics-color -Wall -Winline -D_FILE_OFFSET_BITS=64 -c /var/tmp/portage/app-arch/bzip2-1.0.8-r5/work/bzip2-1.0.8/bzip2recover.c >x86_64-pc-linux-gnu-ar cq libbz2.a blocksort.o huffman.o crctable.o randtable.o compress.o decompress.o bzlib.o >x86_64-pc-linux-gnu-ranlib libbz2.a >/var/tmp/portage/app-arch/bzip2-1.0.8-r5/work/bzip2-1.0.8/bzip2.c: In function âapplySavedFileAttrToOutputFileâ: >/var/tmp/portage/app-arch/bzip2-1.0.8-r5/work/bzip2-1.0.8/bzip2.c:1128:11: warning: ignoring return value of âfchownâ declared with attribute âwarn_unused_resultâ [-Wunused-result] > 1128 | (void) fchown ( fd, fileMetaInfo.st_uid, fileMetaInfo.st_gid ); > | ^~~~~~~~~~~~~~~~~~~~~~~~~~~~~~~~~~~~~~~~~~~~~~~~~~~~~~~ >x86_64-pc-linux-gnu-gcc -m32 -mfpmath=sse -fpermissive -O2 -pipe -march=native -fno-diagnostics-color -Wall -Winline -D_FILE_OFFSET_BITS=64 -Wl,-O1 -Wl,--as-needed -Wl,--defsym=__gentoo_check_ldflags__=0 -o bzip2recover bzip2recover.o >x86_64-pc-linux-gnu-gcc -m32 -mfpmath=sse -fpermissive -O2 -pipe -march=native -fno-diagnostics-color -Wall -Winline -D_FILE_OFFSET_BITS=64 -Wl,-O1 -Wl,--as-needed -Wl,--defsym=__gentoo_check_ldflags__=0 -o bzip2 bzip2.o -L. -lbz2 > * abi_x86_64.amd64: running multilib-minimal_abi_src_compile >make -j4 VPATH=/var/tmp/portage/app-arch/bzip2-1.0.8-r5/work/bzip2-1.0.8 CC=x86_64-pc-linux-gnu-gcc AR=x86_64-pc-linux-gnu-ar RANLIB=x86_64-pc-linux-gnu-ranlib -f /var/tmp/portage/app-arch/bzip2-1.0.8-r5/work/bzip2-1.0.8/Makefile-libbz2_so all >x86_64-pc-linux-gnu-gcc -fpermissive -O2 -pipe -march=native -fno-diagnostics-color -fpic -fPIC -Wall -Winline -D_FILE_OFFSET_BITS=64 -c /var/tmp/portage/app-arch/bzip2-1.0.8-r5/work/bzip2-1.0.8/blocksort.c >x86_64-pc-linux-gnu-gcc -fpermissive -O2 -pipe -march=native -fno-diagnostics-color -fpic -fPIC -Wall -Winline -D_FILE_OFFSET_BITS=64 -c /var/tmp/portage/app-arch/bzip2-1.0.8-r5/work/bzip2-1.0.8/huffman.c >x86_64-pc-linux-gnu-gcc -fpermissive -O2 -pipe -march=native -fno-diagnostics-color -fpic -fPIC -Wall -Winline -D_FILE_OFFSET_BITS=64 -c /var/tmp/portage/app-arch/bzip2-1.0.8-r5/work/bzip2-1.0.8/crctable.c >x86_64-pc-linux-gnu-gcc -fpermissive -O2 -pipe -march=native -fno-diagnostics-color -fpic -fPIC -Wall -Winline -D_FILE_OFFSET_BITS=64 -c /var/tmp/portage/app-arch/bzip2-1.0.8-r5/work/bzip2-1.0.8/randtable.c >x86_64-pc-linux-gnu-gcc -fpermissive -O2 -pipe -march=native -fno-diagnostics-color -fpic -fPIC -Wall -Winline -D_FILE_OFFSET_BITS=64 -c /var/tmp/portage/app-arch/bzip2-1.0.8-r5/work/bzip2-1.0.8/compress.c >x86_64-pc-linux-gnu-gcc -fpermissive -O2 -pipe -march=native -fno-diagnostics-color -fpic -fPIC -Wall -Winline -D_FILE_OFFSET_BITS=64 -c /var/tmp/portage/app-arch/bzip2-1.0.8-r5/work/bzip2-1.0.8/decompress.c >x86_64-pc-linux-gnu-gcc -fpermissive -O2 -pipe -march=native -fno-diagnostics-color -fpic -fPIC -Wall -Winline -D_FILE_OFFSET_BITS=64 -c /var/tmp/portage/app-arch/bzip2-1.0.8-r5/work/bzip2-1.0.8/bzlib.c >In function âmainSimpleSortâ, > inlined from âmainQSort3â at /var/tmp/portage/app-arch/bzip2-1.0.8-r5/work/bzip2-1.0.8/blocksort.c:651:10, > inlined from âmainSortâ at /var/tmp/portage/app-arch/bzip2-1.0.8-r5/work/bzip2-1.0.8/blocksort.c:897:19: >/var/tmp/portage/app-arch/bzip2-1.0.8-r5/work/bzip2-1.0.8/blocksort.c:347:6: warning: inlining failed in call to âmainGtUâ: --param max-inline-insns-single limit reached [-Winline] > 347 | Bool mainGtU ( UInt32 i1, > | ^~~~~~~ >/var/tmp/portage/app-arch/bzip2-1.0.8-r5/work/bzip2-1.0.8/blocksort.c:514:18: note: called from here > 514 | while ( mainGtU ( > | ^~~~~~~~~ > 515 | ptr[j-h]+d, v+d, block, quadrant, nblock, budget > | ~~~~~~~~~~~~~~~~~~~~~~~~~~~~~~~~~~~~~~~~~~~~~~~~ > 516 | ) ) { > | ~ >/var/tmp/portage/app-arch/bzip2-1.0.8-r5/work/bzip2-1.0.8/blocksort.c:347:6: warning: inlining failed in call to âmainGtUâ: --param max-inline-insns-single limit reached [-Winline] > 347 | Bool mainGtU ( UInt32 i1, > | ^~~~~~~ >/var/tmp/portage/app-arch/bzip2-1.0.8-r5/work/bzip2-1.0.8/blocksort.c:528:18: note: called from here > 528 | while ( mainGtU ( > | ^~~~~~~~~ > 529 | ptr[j-h]+d, v+d, block, quadrant, nblock, budget > | ~~~~~~~~~~~~~~~~~~~~~~~~~~~~~~~~~~~~~~~~~~~~~~~~ > 530 | ) ) { > | ~ >/var/tmp/portage/app-arch/bzip2-1.0.8-r5/work/bzip2-1.0.8/blocksort.c:347:6: warning: inlining failed in call to âmainGtUâ: --param max-inline-insns-single limit reached [-Winline] > 347 | Bool mainGtU ( UInt32 i1, > | ^~~~~~~ >/var/tmp/portage/app-arch/bzip2-1.0.8-r5/work/bzip2-1.0.8/blocksort.c:542:18: note: called from here > 542 | while ( mainGtU ( > | ^~~~~~~~~ > 543 | ptr[j-h]+d, v+d, block, quadrant, nblock, budget > | ~~~~~~~~~~~~~~~~~~~~~~~~~~~~~~~~~~~~~~~~~~~~~~~~ > 544 | ) ) { > | ~ >x86_64-pc-linux-gnu-gcc -Wl,-O1 -Wl,--as-needed -Wl,--defsym=__gentoo_check_ldflags__=0 -shared -Wl,-soname -Wl,libbz2.so.1 -o libbz2.so.1.0.8 blocksort.o huffman.o crctable.o randtable.o compress.o decompress.o bzlib.o >ln -sf libbz2.so.1.0.8 libbz2.so.1.0 >make -j4 VPATH=/var/tmp/portage/app-arch/bzip2-1.0.8-r5/work/bzip2-1.0.8 CC=x86_64-pc-linux-gnu-gcc AR=x86_64-pc-linux-gnu-ar RANLIB=x86_64-pc-linux-gnu-ranlib -f /var/tmp/portage/app-arch/bzip2-1.0.8-r5/work/bzip2-1.0.8/Makefile all 'LDFLAGS=-Wl,-O1 -Wl,--as-needed -Wl,--defsym=__gentoo_check_ldflags__=0 ' >rm -f libbz2.a >x86_64-pc-linux-gnu-gcc -fpermissive -O2 -pipe -march=native -fno-diagnostics-color -Wall -Winline -D_FILE_OFFSET_BITS=64 -c /var/tmp/portage/app-arch/bzip2-1.0.8-r5/work/bzip2-1.0.8/bzip2.c >x86_64-pc-linux-gnu-ar cq libbz2.a blocksort.o huffman.o crctable.o randtable.o compress.o decompress.o bzlib.o >x86_64-pc-linux-gnu-gcc -fpermissive -O2 -pipe -march=native -fno-diagnostics-color -Wall -Winline -D_FILE_OFFSET_BITS=64 -c /var/tmp/portage/app-arch/bzip2-1.0.8-r5/work/bzip2-1.0.8/bzip2recover.c >x86_64-pc-linux-gnu-ranlib libbz2.a >/var/tmp/portage/app-arch/bzip2-1.0.8-r5/work/bzip2-1.0.8/bzip2.c: In function âapplySavedFileAttrToOutputFileâ: >/var/tmp/portage/app-arch/bzip2-1.0.8-r5/work/bzip2-1.0.8/bzip2.c:1128:11: warning: ignoring return value of âfchownâ declared with attribute âwarn_unused_resultâ [-Wunused-result] > 1128 | (void) fchown ( fd, fileMetaInfo.st_uid, fileMetaInfo.st_gid ); > | ^~~~~~~~~~~~~~~~~~~~~~~~~~~~~~~~~~~~~~~~~~~~~~~~~~~~~~~ >x86_64-pc-linux-gnu-gcc -fpermissive -O2 -pipe -march=native -fno-diagnostics-color -Wall -Winline -D_FILE_OFFSET_BITS=64 -Wl,-O1 -Wl,--as-needed -Wl,--defsym=__gentoo_check_ldflags__=0 -o bzip2recover bzip2recover.o >x86_64-pc-linux-gnu-gcc -fpermissive -O2 -pipe -march=native -fno-diagnostics-color -Wall -Winline -D_FILE_OFFSET_BITS=64 -Wl,-O1 -Wl,--as-needed -Wl,--defsym=__gentoo_check_ldflags__=0 -o bzip2 bzip2.o -L. -lbz2 >>>> Source compiled. >>>> Test phase: app-arch/bzip2-1.0.8-r5 > * abi_x86_32.x86: running multilib-minimal_abi_src_test >make -j4 VPATH=/var/tmp/portage/app-arch/bzip2-1.0.8-r5/work/bzip2-1.0.8 'CC=x86_64-pc-linux-gnu-gcc -m32 -mfpmath=sse' AR=x86_64-pc-linux-gnu-ar RANLIB=x86_64-pc-linux-gnu-ranlib -f /var/tmp/portage/app-arch/bzip2-1.0.8-r5/work/bzip2-1.0.8/Makefile check >./bzip2 -1 < sample1.ref > sample1.rb2 >./bzip2: error while loading shared libraries: libbz2.so.1: cannot open shared object file: No such file or directory >make: *** [/var/tmp/portage/app-arch/bzip2-1.0.8-r5/work/bzip2-1.0.8/Makefile:56: test] Error 127 > * ERROR: app-arch/bzip2-1.0.8-r5::gentoo failed (test phase): > * emake failed > * > * If you need support, post the output of `emerge --info '=app-arch/bzip2-1.0.8-r5::gentoo'`, > * the complete build log and the output of `emerge -pqv '=app-arch/bzip2-1.0.8-r5::gentoo'`. > * The complete build log is located at '/var/log/portage/app-arch:bzip2-1.0.8-r5:20240309-005738.log'. > * For convenience, a symlink to the build log is located at '/var/tmp/portage/app-arch/bzip2-1.0.8-r5/temp/build.log'. > * The ebuild environment file is located at '/var/tmp/portage/app-arch/bzip2-1.0.8-r5/temp/environment'. > * Working directory: '/var/tmp/portage/app-arch/bzip2-1.0.8-r5/work/bzip2-1.0.8-abi_x86_32.x86' > * S: '/var/tmp/portage/app-arch/bzip2-1.0.8-r5/work/bzip2-1.0.8' >
You cannot view the attachment while viewing its details because your browser does not support IFRAMEs.
View the attachment on a separate page
.
View Attachment As Raw
Actions:
View
Attachments on
bug 926553
:
887143
| 887144 |
887145
|
887146
|
887147
|
887148
|
887149
|
887150