Go to:
Gentoo Home
Documentation
Forums
Lists
Bugs
Planet
Store
Wiki
Get Gentoo!
Gentoo's Bugzilla – Attachment 865403 Details for
Bug 910245
[guru] net-p2p/dogecoin-qt-1.14.6 calls cc directly
Home
|
New
–
[Ex]
|
Browse
|
Search
|
Privacy Policy
|
[?]
|
Reports
|
Requests
|
Help
|
New Account
|
Log In
[x]
|
Forgot Password
Login:
[x]
3-config.log
3-config.log (text/plain), 29.71 KB, created by
Agostino Sarubbo
on 2023-07-12 09:45:45 UTC
(
hide
)
Description:
3-config.log
Filename:
MIME Type:
Creator:
Agostino Sarubbo
Created:
2023-07-12 09:45:45 UTC
Size:
29.71 KB
patch
obsolete
>This file contains any messages produced by compilers while >running configure, to aid debugging if configure makes a mistake. > >It was created by libsecp256k1 configure 0.1, which was >generated by GNU Autoconf 2.71. Invocation command line was > > $ ./configure --disable-option-checking --prefix=/usr --build=x86_64-pc-linux-gnu --host=x86_64-pc-linux-gnu --mandir=/usr/share/man --infodir=/usr/share/info --datadir=/usr/share --sysconfdir=/etc --localstatedir=/var/lib --datarootdir=/usr/share --disable-dependency-tracking --disable-silent-rules --disable-static --docdir=/usr/share/doc/dogecoin-qt-1.14.6 --htmldir=/usr/share/doc/dogecoin-qt-1.14.6/html --with-sysroot=/ --libdir=/usr/lib64 --enable-cxx --with-incompatible-bdb --bindir=/opt/dogecoin-qt/bin BDB_CFLAGS=-I/usr/include/db5.3 'BDB_LIBS=-L/usr/lib64 -ldb_cxx-5.3' --with-gui=qt5 --with-qt-incdir=/usr/include/qt5 --disable-zmq --enable-wallet --disable-tests --disable-bench build_alias=x86_64-pc-linux-gnu host_alias=x86_64-pc-linux-gnu CXX=x86_64-pc-linux-gnu-g++ 'CXXFLAGS=-O2 -march=x86-64 -pipe -pipe -frecord-gcc-switches -fno-diagnostics-color -fmessage-length=0' 'LDFLAGS=-Wl,-O1 -Wl,--as-needed -Wl,--defsym=__gentoo_check_ldflags__=0' CC=x86_64-pc-linux-gnu-gcc 'CFLAGS=-O2 -march=x86-64 -pipe -pipe -frecord-gcc-switches -fno-diagnostics-color -fmessage-length=0' 'CPP=x86_64-pc-linux-gnu-gcc -E' --disable-shared --with-pic --with-bignum=no --enable-module-recovery --cache-file=/dev/null --srcdir=. > >## --------- ## >## Platform. ## >## --------- ## > >hostname = localhost >uname -m = x86_64 >uname -r = 6.1.38-gentoo-dist >uname -s = Linux >uname -v = #1 SMP PREEMPT_DYNAMIC Thu Jul 6 11:45:23 -00 2023 > >/usr/bin/uname -p = AMD EPYC 7513 32-Core Processor >/bin/uname -X = unknown > >/bin/arch = unknown >/usr/bin/arch -k = unknown >/usr/convex/getsysinfo = unknown >/usr/bin/hostinfo = unknown >/bin/machine = unknown >/usr/bin/oslevel = unknown >/bin/universe = unknown > >PATH: /usr/lib/portage/python3.11/ebuild-helpers/xattr/ >PATH: /usr/lib/portage/python3.11/ebuild-helpers/ >PATH: /usr/local/sbin/ >PATH: /usr/local/bin/ >PATH: /usr/sbin/ >PATH: /usr/bin/ >PATH: /sbin/ >PATH: /bin/ >PATH: /opt/bin/ > > >## ----------- ## >## Core tests. ## >## ----------- ## > >configure:2590: looking for aux files: compile ltmain.sh missing install-sh config.guess config.sub >configure:2603: trying ./build-aux/ >configure:2632: ./build-aux/compile found >configure:2632: ./build-aux/ltmain.sh found >configure:2632: ./build-aux/missing found >configure:2614: ./build-aux/install-sh found >configure:2632: ./build-aux/config.guess found >configure:2632: ./build-aux/config.sub found >configure:2752: checking build system type >configure:2767: result: x86_64-pc-linux-gnu >configure:2787: checking host system type >configure:2801: result: x86_64-pc-linux-gnu >configure:2841: checking for a BSD-compatible install >configure:2914: result: /usr/lib/portage/python3.11/ebuild-helpers/xattr/install -c >configure:2925: checking whether build environment is sane >configure:2980: result: yes >configure:3139: checking for a race-free mkdir -p >configure:3183: result: /bin/mkdir -p >configure:3190: checking for gawk >configure:3211: found /usr/bin/gawk >configure:3222: result: gawk >configure:3233: checking whether make sets $(MAKE) >configure:3256: result: yes >configure:3286: checking whether make supports nested variables >configure:3304: result: yes >configure:3487: checking how to print strings >configure:3514: result: printf >configure:3548: checking whether make supports the include directive >configure:3563: make -f confmf.GNU && cat confinc.out >this is the am__doit target >configure:3566: $? = 0 >configure:3585: result: yes (GNU style) >configure:3616: checking for x86_64-pc-linux-gnu-gcc >configure:3648: result: x86_64-pc-linux-gnu-gcc >configure:4046: checking for C compiler version >configure:4055: x86_64-pc-linux-gnu-gcc --version >&5 >x86_64-pc-linux-gnu-gcc (Gentoo 13.1.1_p20230527 p3) 13.1.1 20230527 >Copyright (C) 2023 Free Software Foundation, Inc. >This is free software; see the source for copying conditions. There is NO >warranty; not even for MERCHANTABILITY or FITNESS FOR A PARTICULAR PURPOSE. > >configure:4066: $? = 0 >configure:4055: x86_64-pc-linux-gnu-gcc -v >&5 >Using built-in specs. >COLLECT_GCC=x86_64-pc-linux-gnu-gcc >COLLECT_LTO_WRAPPER=/usr/libexec/gcc/x86_64-pc-linux-gnu/13/lto-wrapper >Target: x86_64-pc-linux-gnu >Configured with: /var/tmp/portage/sys-devel/gcc-13.1.1_p20230527/work/gcc-13-20230527/configure --host=x86_64-pc-linux-gnu --build=x86_64-pc-linux-gnu --prefix=/usr --bindir=/usr/x86_64-pc-linux-gnu/gcc-bin/13 --includedir=/usr/lib/gcc/x86_64-pc-linux-gnu/13/include --datadir=/usr/share/gcc-data/x86_64-pc-linux-gnu/13 --mandir=/usr/share/gcc-data/x86_64-pc-linux-gnu/13/man --infodir=/usr/share/gcc-data/x86_64-pc-linux-gnu/13/info --with-gxx-include-dir=/usr/lib/gcc/x86_64-pc-linux-gnu/13/include/g++-v13 --with-python-dir=/share/gcc-data/x86_64-pc-linux-gnu/13/python --enable-languages=c,c++,fortran --enable-obsolete --enable-secureplt --disable-werror --with-system-zlib --enable-nls --without-included-gettext --disable-libunwind-exceptions --enable-checking=release --with-bugurl=https://bugs.gentoo.org/ --with-pkgversion='Gentoo 13.1.1_p20230527 p3' --with-gcc-major-version-only --disable-esp --enable-libstdcxx-time --enable-lto --disable-libstdcxx-pch --enable-shared --enable-threads=posix --enable-__cxa_atexit --enable-clocale=gnu --enable-multilib --with-multilib-list=m32,m64 --disable-fixed-point --enable-targets=all --enable-libgomp --disable-libssp --disable-libada --disable-cet --disable-systemtap --disable-valgrind-annotations --disable-vtable-verify --disable-libvtv --without-zstd --with-isl --disable-isl-version-check --enable-default-pie --disable-default-ssp --with-build-config=bootstrap-lto >Thread model: posix >Supported LTO compression algorithms: zlib >gcc version 13.1.1 20230527 (Gentoo 13.1.1_p20230527 p3) >configure:4066: $? = 0 >configure:4055: x86_64-pc-linux-gnu-gcc -V >&5 >x86_64-pc-linux-gnu-gcc: error: unrecognized command-line option '-V' >x86_64-pc-linux-gnu-gcc: fatal error: no input files >compilation terminated. >configure:4066: $? = 1 >configure:4055: x86_64-pc-linux-gnu-gcc -qversion >&5 >x86_64-pc-linux-gnu-gcc: error: unrecognized command-line option '-qversion'; did you mean '--version'? >x86_64-pc-linux-gnu-gcc: fatal error: no input files >compilation terminated. >configure:4066: $? = 1 >configure:4055: x86_64-pc-linux-gnu-gcc -version >&5 >x86_64-pc-linux-gnu-gcc: error: unrecognized command-line option '-version' >x86_64-pc-linux-gnu-gcc: fatal error: no input files >compilation terminated. >configure:4066: $? = 1 >configure:4086: checking whether the C compiler works >configure:4108: x86_64-pc-linux-gnu-gcc -O2 -march=x86-64 -pipe -pipe -frecord-gcc-switches -fno-diagnostics-color -fmessage-length=0 -Wl,-O1 -Wl,--as-needed -Wl,--defsym=__gentoo_check_ldflags__=0 conftest.c >&5 >configure:4112: $? = 0 >configure:4162: result: yes >configure:4165: checking for C compiler default output file name >configure:4167: result: a.out >configure:4173: checking for suffix of executables >configure:4180: x86_64-pc-linux-gnu-gcc -o conftest -O2 -march=x86-64 -pipe -pipe -frecord-gcc-switches -fno-diagnostics-color -fmessage-length=0 -Wl,-O1 -Wl,--as-needed -Wl,--defsym=__gentoo_check_ldflags__=0 conftest.c >&5 >configure:4184: $? = 0 >configure:4207: result: >configure:4229: checking whether we are cross compiling >configure:4237: x86_64-pc-linux-gnu-gcc -o conftest -O2 -march=x86-64 -pipe -pipe -frecord-gcc-switches -fno-diagnostics-color -fmessage-length=0 -Wl,-O1 -Wl,--as-needed -Wl,--defsym=__gentoo_check_ldflags__=0 conftest.c >&5 >configure:4241: $? = 0 >configure:4248: ./conftest >configure:4252: $? = 0 >configure:4267: result: no >configure:4272: checking for suffix of object files >configure:4295: x86_64-pc-linux-gnu-gcc -c -O2 -march=x86-64 -pipe -pipe -frecord-gcc-switches -fno-diagnostics-color -fmessage-length=0 conftest.c >&5 >configure:4299: $? = 0 >configure:4321: result: o >configure:4325: checking whether the compiler supports GNU C >configure:4345: x86_64-pc-linux-gnu-gcc -c -O2 -march=x86-64 -pipe -pipe -frecord-gcc-switches -fno-diagnostics-color -fmessage-length=0 conftest.c >&5 >configure:4345: $? = 0 >configure:4355: result: yes >configure:4366: checking whether x86_64-pc-linux-gnu-gcc accepts -g >configure:4387: x86_64-pc-linux-gnu-gcc -c -g conftest.c >&5 >configure:4387: $? = 0 >configure:4431: result: yes >configure:4451: checking for x86_64-pc-linux-gnu-gcc option to enable C11 features >configure:4466: x86_64-pc-linux-gnu-gcc -c -O2 -march=x86-64 -pipe -pipe -frecord-gcc-switches -fno-diagnostics-color -fmessage-length=0 conftest.c >&5 >configure:4466: $? = 0 >configure:4484: result: none needed >configure:4600: checking whether x86_64-pc-linux-gnu-gcc understands -c and -o together >configure:4623: x86_64-pc-linux-gnu-gcc -c conftest.c -o conftest2.o >configure:4626: $? = 0 >configure:4623: x86_64-pc-linux-gnu-gcc -c conftest.c -o conftest2.o >configure:4626: $? = 0 >configure:4638: result: yes >configure:4657: checking dependency style of x86_64-pc-linux-gnu-gcc >configure:4769: result: none >configure:4784: checking for a sed that does not truncate output >configure:4854: result: /bin/sed >configure:4872: checking for grep that handles long lines and -e >configure:4936: result: /bin/grep >configure:4941: checking for egrep >configure:5009: result: /bin/grep -E >configure:5014: checking for fgrep >configure:5082: result: /bin/grep -F >configure:5118: checking for ld used by x86_64-pc-linux-gnu-gcc >configure:5186: result: x86_64-pc-linux-gnu-ld -m elf_x86_64 >configure:5193: checking if the linker (x86_64-pc-linux-gnu-ld -m elf_x86_64) is GNU ld >configure:5209: result: yes >configure:5221: checking for BSD- or MS-compatible name lister (nm) >configure:5276: result: x86_64-pc-linux-gnu-nm >configure:5416: checking the name lister (x86_64-pc-linux-gnu-nm) interface >configure:5424: x86_64-pc-linux-gnu-gcc -c -O2 -march=x86-64 -pipe -pipe -frecord-gcc-switches -fno-diagnostics-color -fmessage-length=0 conftest.c >&5 >configure:5427: x86_64-pc-linux-gnu-nm "conftest.o" >configure:5430: output >0000000000000000 B some_variable >configure:5437: result: BSD nm >configure:5440: checking whether ln -s works >configure:5444: result: yes >configure:5452: checking the maximum length of command line arguments >configure:5589: result: 1572864 >configure:5637: checking how to convert x86_64-pc-linux-gnu file names to x86_64-pc-linux-gnu format >configure:5678: result: func_convert_file_noop >configure:5685: checking how to convert x86_64-pc-linux-gnu file names to toolchain format >configure:5706: result: func_convert_file_noop >configure:5713: checking for x86_64-pc-linux-gnu-ld -m elf_x86_64 option to reload object files >configure:5721: result: -r >configure:5755: checking for x86_64-pc-linux-gnu-file >configure:5790: result: no >configure:5800: checking for file >configure:5821: found /usr/bin/file >configure:5832: result: file >configure:5863: checking for x86_64-pc-linux-gnu-objdump >configure:5895: result: x86_64-pc-linux-gnu-objdump >configure:5972: checking how to recognize dependent libraries >configure:6173: result: pass_all >configure:6218: checking for x86_64-pc-linux-gnu-dlltool >configure:6253: result: no >configure:6263: checking for dlltool >configure:6298: result: no >configure:6328: checking how to associate runtime and link libraries >configure:6356: result: printf %s\n >configure:6373: checking for x86_64-pc-linux-gnu-ar >configure:6405: result: /usr/bin/x86_64-pc-linux-gnu-ar >configure:6507: checking for archiver @FILE support >configure:6525: x86_64-pc-linux-gnu-gcc -c -O2 -march=x86-64 -pipe -pipe -frecord-gcc-switches -fno-diagnostics-color -fmessage-length=0 conftest.c >&5 >configure:6525: $? = 0 >configure:6529: /usr/bin/x86_64-pc-linux-gnu-ar cr libconftest.a @conftest.lst >&5 >configure:6532: $? = 0 >configure:6537: /usr/bin/x86_64-pc-linux-gnu-ar cr libconftest.a @conftest.lst >&5 >/usr/bin/x86_64-pc-linux-gnu-ar: conftest.o: No such file or directory >configure:6540: $? = 1 >configure:6552: result: @ >configure:6570: checking for x86_64-pc-linux-gnu-strip >configure:6602: result: /usr/bin/x86_64-pc-linux-gnu-strip >configure:6679: checking for x86_64-pc-linux-gnu-ranlib >configure:6711: result: /usr/bin/x86_64-pc-linux-gnu-ranlib >configure:6858: checking command to parse x86_64-pc-linux-gnu-nm output from x86_64-pc-linux-gnu-gcc object >configure:7012: x86_64-pc-linux-gnu-gcc -c -O2 -march=x86-64 -pipe -pipe -frecord-gcc-switches -fno-diagnostics-color -fmessage-length=0 conftest.c >&5 >configure:7015: $? = 0 >configure:7019: x86_64-pc-linux-gnu-nm conftest.o \| /bin/sed -n -e 's/^.*[ ]\([ABCDGIRSTW][ABCDGIRSTW]*\)[ ][ ]*\([_A-Za-z][_A-Za-z0-9]*\)$/\1 \2 \2/p' | /bin/sed '/ __gnu_lto/d' \> conftest.nm >configure:7022: $? = 0 >configure:7088: x86_64-pc-linux-gnu-gcc -o conftest -O2 -march=x86-64 -pipe -pipe -frecord-gcc-switches -fno-diagnostics-color -fmessage-length=0 -Wl,-O1 -Wl,--as-needed -Wl,--defsym=__gentoo_check_ldflags__=0 conftest.c conftstm.o >&5 >configure:7091: $? = 0 >configure:7129: result: ok >configure:7176: checking for sysroot >configure:7207: result: / >configure:7214: checking for a working dd >configure:7258: result: /bin/dd >configure:7262: checking how to truncate binary pipes >configure:7278: result: /bin/dd bs=4096 count=1 >configure:7415: x86_64-pc-linux-gnu-gcc -c -O2 -march=x86-64 -pipe -pipe -frecord-gcc-switches -fno-diagnostics-color -fmessage-length=0 conftest.c >&5 >configure:7418: $? = 0 >configure:7570: checking for x86_64-pc-linux-gnu-mt >configure:7605: result: no >configure:7615: checking for mt >configure:7650: result: no >configure:7670: checking if : is a manifest tool >configure:7677: : '-?' >configure:7685: result: no >configure:8410: checking for stdio.h >configure:8410: x86_64-pc-linux-gnu-gcc -c -O2 -march=x86-64 -pipe -pipe -frecord-gcc-switches -fno-diagnostics-color -fmessage-length=0 conftest.c >&5 >configure:8410: $? = 0 >configure:8410: result: yes >configure:8410: checking for stdlib.h >configure:8410: x86_64-pc-linux-gnu-gcc -c -O2 -march=x86-64 -pipe -pipe -frecord-gcc-switches -fno-diagnostics-color -fmessage-length=0 conftest.c >&5 >configure:8410: $? = 0 >configure:8410: result: yes >configure:8410: checking for string.h >configure:8410: x86_64-pc-linux-gnu-gcc -c -O2 -march=x86-64 -pipe -pipe -frecord-gcc-switches -fno-diagnostics-color -fmessage-length=0 conftest.c >&5 >configure:8410: $? = 0 >configure:8410: result: yes >configure:8410: checking for inttypes.h >configure:8410: x86_64-pc-linux-gnu-gcc -c -O2 -march=x86-64 -pipe -pipe -frecord-gcc-switches -fno-diagnostics-color -fmessage-length=0 conftest.c >&5 >configure:8410: $? = 0 >configure:8410: result: yes >configure:8410: checking for stdint.h >configure:8410: x86_64-pc-linux-gnu-gcc -c -O2 -march=x86-64 -pipe -pipe -frecord-gcc-switches -fno-diagnostics-color -fmessage-length=0 conftest.c >&5 >configure:8410: $? = 0 >configure:8410: result: yes >configure:8410: checking for strings.h >configure:8410: x86_64-pc-linux-gnu-gcc -c -O2 -march=x86-64 -pipe -pipe -frecord-gcc-switches -fno-diagnostics-color -fmessage-length=0 conftest.c >&5 >configure:8410: $? = 0 >configure:8410: result: yes >configure:8410: checking for sys/stat.h >configure:8410: x86_64-pc-linux-gnu-gcc -c -O2 -march=x86-64 -pipe -pipe -frecord-gcc-switches -fno-diagnostics-color -fmessage-length=0 conftest.c >&5 >configure:8410: $? = 0 >configure:8410: result: yes >configure:8410: checking for sys/types.h >configure:8410: x86_64-pc-linux-gnu-gcc -c -O2 -march=x86-64 -pipe -pipe -frecord-gcc-switches -fno-diagnostics-color -fmessage-length=0 conftest.c >&5 >configure:8410: $? = 0 >configure:8410: result: yes >configure:8410: checking for unistd.h >configure:8410: x86_64-pc-linux-gnu-gcc -c -O2 -march=x86-64 -pipe -pipe -frecord-gcc-switches -fno-diagnostics-color -fmessage-length=0 conftest.c >&5 >configure:8410: $? = 0 >configure:8410: result: yes >configure:8435: checking for dlfcn.h >configure:8435: x86_64-pc-linux-gnu-gcc -c -O2 -march=x86-64 -pipe -pipe -frecord-gcc-switches -fno-diagnostics-color -fmessage-length=0 conftest.c >&5 >configure:8435: $? = 0 >configure:8435: result: yes >configure:8694: checking for objdir >configure:8710: result: .libs >configure:8974: checking if x86_64-pc-linux-gnu-gcc supports -fno-rtti -fno-exceptions >configure:8993: x86_64-pc-linux-gnu-gcc -c -O2 -march=x86-64 -pipe -pipe -frecord-gcc-switches -fno-diagnostics-color -fmessage-length=0 -fno-rtti -fno-exceptions conftest.c >&5 >cc1: warning: command-line option '-fno-rtti' is valid for C++/D/ObjC++ but not for C >configure:8997: $? = 0 >configure:9010: result: no >configure:9368: checking for x86_64-pc-linux-gnu-gcc option to produce PIC >configure:9376: result: -fPIC -DPIC >configure:9384: checking if x86_64-pc-linux-gnu-gcc PIC flag -fPIC -DPIC works >configure:9403: x86_64-pc-linux-gnu-gcc -c -O2 -march=x86-64 -pipe -pipe -frecord-gcc-switches -fno-diagnostics-color -fmessage-length=0 -fPIC -DPIC -DPIC conftest.c >&5 >configure:9407: $? = 0 >configure:9420: result: yes >configure:9449: checking if x86_64-pc-linux-gnu-gcc static flag -static works >configure:9478: result: yes >configure:9493: checking if x86_64-pc-linux-gnu-gcc supports -c -o file.o >configure:9515: x86_64-pc-linux-gnu-gcc -c -O2 -march=x86-64 -pipe -pipe -frecord-gcc-switches -fno-diagnostics-color -fmessage-length=0 -o out/conftest2.o conftest.c >&5 >configure:9519: $? = 0 >configure:9541: result: yes >configure:9549: checking if x86_64-pc-linux-gnu-gcc supports -c -o file.o >configure:9597: result: yes >configure:9630: checking whether the x86_64-pc-linux-gnu-gcc linker (x86_64-pc-linux-gnu-ld -m elf_x86_64 -m elf_x86_64) supports shared libraries >configure:10898: result: yes >configure:11139: checking dynamic linker characteristics >configure:11734: x86_64-pc-linux-gnu-gcc -o conftest -O2 -march=x86-64 -pipe -pipe -frecord-gcc-switches -fno-diagnostics-color -fmessage-length=0 -Wl,-O1 -Wl,--as-needed -Wl,--defsym=__gentoo_check_ldflags__=0 -Wl,-rpath -Wl,/foo conftest.c >&5 >configure:11734: $? = 0 >configure:11973: result: GNU/Linux ld.so >configure:12095: checking how to hardcode library paths into programs >configure:12120: result: immediate >configure:12702: checking whether stripping libraries is possible >configure:12711: result: yes >configure:12753: checking if libtool supports shared libraries >configure:12755: result: yes >configure:12758: checking whether to build shared libraries >configure:12783: result: no >configure:12786: checking whether to build static libraries >configure:12790: result: yes >configure:12840: checking whether make supports nested variables >configure:12858: result: yes >configure:12881: checking for x86_64-pc-linux-gnu-pkg-config >configure:12904: found /usr/bin/x86_64-pc-linux-gnu-pkg-config >configure:12916: result: /usr/bin/x86_64-pc-linux-gnu-pkg-config >configure:12989: checking pkg-config is at least version 0.9.0 >configure:12992: result: yes >configure:13004: checking for x86_64-pc-linux-gnu-ar >configure:13039: result: /usr/bin/x86_64-pc-linux-gnu-ar >configure:13112: checking for x86_64-pc-linux-gnu-ranlib >configure:13147: result: /usr/bin/x86_64-pc-linux-gnu-ranlib >configure:13220: checking for x86_64-pc-linux-gnu-strip >configure:13255: result: /usr/bin/x86_64-pc-linux-gnu-strip >configure:13330: checking how to run the C preprocessor >configure:13398: result: x86_64-pc-linux-gnu-gcc -E >configure:13412: x86_64-pc-linux-gnu-gcc -E conftest.c >configure:13412: $? = 0 >configure:13427: x86_64-pc-linux-gnu-gcc -E conftest.c >conftest.c:23:10: fatal error: ac_nonexistent.h: No such file or directory > 23 | #include <ac_nonexistent.h> > | ^~~~~~~~~~~~~~~~~~ >compilation terminated. >configure:13427: $? = 1 >configure: failed program was: >| /* confdefs.h */ >| #define PACKAGE_NAME "libsecp256k1" >| #define PACKAGE_TARNAME "libsecp256k1" >| #define PACKAGE_VERSION "0.1" >| #define PACKAGE_STRING "libsecp256k1 0.1" >| #define PACKAGE_BUGREPORT "" >| #define PACKAGE_URL "" >| #define PACKAGE "libsecp256k1" >| #define VERSION "0.1" >| #define HAVE_STDIO_H 1 >| #define HAVE_STDLIB_H 1 >| #define HAVE_STRING_H 1 >| #define HAVE_INTTYPES_H 1 >| #define HAVE_STDINT_H 1 >| #define HAVE_STRINGS_H 1 >| #define HAVE_SYS_STAT_H 1 >| #define HAVE_SYS_TYPES_H 1 >| #define HAVE_UNISTD_H 1 >| #define STDC_HEADERS 1 >| #define HAVE_DLFCN_H 1 >| #define LT_OBJDIR ".libs/" >| /* end confdefs.h. */ >| #include <ac_nonexistent.h> >configure:13518: checking for gcc >configure:13553: result: no >configure:13621: checking for cc >configure:13673: result: no >configure:13734: checking for cl.exe >configure:13769: result: no >configure:13840: checking for clang >configure:13875: result: no >configure:13897: error: in `/var/tmp/portage/net-p2p/dogecoin-qt-1.14.6/work/dogecoin-1.14.6/src/secp256k1': >configure:13899: error: no acceptable C compiler found in $PATH >See `config.log' for more details > >## ---------------- ## >## Cache variables. ## >## ---------------- ## > >ac_cv_build=x86_64-pc-linux-gnu >ac_cv_c_compiler_gnu=yes >ac_cv_c_undeclared_builtin_options='none needed' >ac_cv_env_CCASFLAGS_set= >ac_cv_env_CCASFLAGS_value= >ac_cv_env_CCAS_set= >ac_cv_env_CCAS_value= >ac_cv_env_CC_set=set >ac_cv_env_CC_value=x86_64-pc-linux-gnu-gcc >ac_cv_env_CFLAGS_set=set >ac_cv_env_CFLAGS_value='-O2 -march=x86-64 -pipe -pipe -frecord-gcc-switches -fno-diagnostics-color -fmessage-length=0' >ac_cv_env_CPPFLAGS_set= >ac_cv_env_CPPFLAGS_value= >ac_cv_env_CPP_set=set >ac_cv_env_CPP_value='x86_64-pc-linux-gnu-gcc -E' >ac_cv_env_CRYPTO_CFLAGS_set= >ac_cv_env_CRYPTO_CFLAGS_value= >ac_cv_env_CRYPTO_LIBS_set= >ac_cv_env_CRYPTO_LIBS_value= >ac_cv_env_LDFLAGS_set=set >ac_cv_env_LDFLAGS_value='-Wl,-O1 -Wl,--as-needed -Wl,--defsym=__gentoo_check_ldflags__=0' >ac_cv_env_LIBS_set= >ac_cv_env_LIBS_value= >ac_cv_env_LT_SYS_LIBRARY_PATH_set= >ac_cv_env_LT_SYS_LIBRARY_PATH_value= >ac_cv_env_PKG_CONFIG_LIBDIR_set= >ac_cv_env_PKG_CONFIG_LIBDIR_value= >ac_cv_env_PKG_CONFIG_PATH_set= >ac_cv_env_PKG_CONFIG_PATH_value= >ac_cv_env_PKG_CONFIG_set= >ac_cv_env_PKG_CONFIG_value= >ac_cv_env_build_alias_set=set >ac_cv_env_build_alias_value=x86_64-pc-linux-gnu >ac_cv_env_host_alias_set=set >ac_cv_env_host_alias_value=x86_64-pc-linux-gnu >ac_cv_env_target_alias_set= >ac_cv_env_target_alias_value= >ac_cv_header_dlfcn_h=yes >ac_cv_header_inttypes_h=yes >ac_cv_header_stdint_h=yes >ac_cv_header_stdio_h=yes >ac_cv_header_stdlib_h=yes >ac_cv_header_string_h=yes >ac_cv_header_strings_h=yes >ac_cv_header_sys_stat_h=yes >ac_cv_header_sys_types_h=yes >ac_cv_header_unistd_h=yes >ac_cv_host=x86_64-pc-linux-gnu >ac_cv_objext=o >ac_cv_path_AR=/usr/bin/x86_64-pc-linux-gnu-ar >ac_cv_path_EGREP='/bin/grep -E' >ac_cv_path_FGREP='/bin/grep -F' >ac_cv_path_GREP=/bin/grep >ac_cv_path_PKG_CONFIG=/usr/bin/x86_64-pc-linux-gnu-pkg-config >ac_cv_path_RANLIB=/usr/bin/x86_64-pc-linux-gnu-ranlib >ac_cv_path_SED=/bin/sed >ac_cv_path_STRIP=/usr/bin/x86_64-pc-linux-gnu-strip >ac_cv_path_install='/usr/lib/portage/python3.11/ebuild-helpers/xattr/install -c' >ac_cv_path_lt_DD=/bin/dd >ac_cv_path_mkdir=/bin/mkdir >ac_cv_prog_AR=/usr/bin/x86_64-pc-linux-gnu-ar >ac_cv_prog_AWK=gawk >ac_cv_prog_CC=x86_64-pc-linux-gnu-gcc >ac_cv_prog_CPP='x86_64-pc-linux-gnu-gcc -E' >ac_cv_prog_OBJDUMP=x86_64-pc-linux-gnu-objdump >ac_cv_prog_RANLIB=/usr/bin/x86_64-pc-linux-gnu-ranlib >ac_cv_prog_STRIP=/usr/bin/x86_64-pc-linux-gnu-strip >ac_cv_prog_ac_ct_FILECMD=file >ac_cv_prog_cc_c11= >ac_cv_prog_cc_g=yes >ac_cv_prog_cc_stdc= >ac_cv_prog_make_make_set=yes >am_cv_CC_dependencies_compiler_type=none >am_cv_make_support_nested_variables=yes >am_cv_prog_cc_c_o=yes >gl_cv_compiler_check_decl_option=-Werror=implicit-function-declaration >lt_cv_ar_at_file=@ >lt_cv_deplibs_check_method=pass_all >lt_cv_file_magic_cmd='$MAGIC_CMD' >lt_cv_file_magic_test_file= >lt_cv_ld_reload_flag=-r >lt_cv_nm_interface='BSD nm' >lt_cv_objdir=.libs >lt_cv_path_LD='x86_64-pc-linux-gnu-ld -m elf_x86_64' >lt_cv_path_NM=x86_64-pc-linux-gnu-nm >lt_cv_path_mainfest_tool=no >lt_cv_prog_compiler_c_o=yes >lt_cv_prog_compiler_pic='-fPIC -DPIC' >lt_cv_prog_compiler_pic_works=yes >lt_cv_prog_compiler_rtti_exceptions=no >lt_cv_prog_compiler_static_works=yes >lt_cv_prog_gnu_ld=yes >lt_cv_sharedlib_from_linklib_cmd='printf %s\n' >lt_cv_shlibpath_overrides_runpath=yes >lt_cv_sys_global_symbol_pipe='/bin/sed -n -e '\''s/^.*[ ]\([ABCDGIRSTW][ABCDGIRSTW]*\)[ ][ ]*\([_A-Za-z][_A-Za-z0-9]*\)$/\1 \2 \2/p'\'' | /bin/sed '\''/ __gnu_lto/d'\''' >lt_cv_sys_global_symbol_to_c_name_address='/bin/sed -n -e '\''s/^: \(.*\) .*$/ {"\1", (void *) 0},/p'\'' -e '\''s/^[ABCDGIRSTW][ABCDGIRSTW]* .* \(.*\)$/ {"\1", (void *) \&\1},/p'\''' >lt_cv_sys_global_symbol_to_c_name_address_lib_prefix='/bin/sed -n -e '\''s/^: \(.*\) .*$/ {"\1", (void *) 0},/p'\'' -e '\''s/^[ABCDGIRSTW][ABCDGIRSTW]* .* \(lib.*\)$/ {"\1", (void *) \&\1},/p'\'' -e '\''s/^[ABCDGIRSTW][ABCDGIRSTW]* .* \(.*\)$/ {"lib\1", (void *) \&\1},/p'\''' >lt_cv_sys_global_symbol_to_cdecl='/bin/sed -n -e '\''s/^T .* \(.*\)$/extern int \1();/p'\'' -e '\''s/^[ABCDGIRSTW][ABCDGIRSTW]* .* \(.*\)$/extern char \1;/p'\''' >lt_cv_sys_global_symbol_to_import= >lt_cv_sys_max_cmd_len=1572864 >lt_cv_to_host_file_cmd=func_convert_file_noop >lt_cv_to_tool_file_cmd=func_convert_file_noop >lt_cv_truncate_bin='/bin/dd bs=4096 count=1' > >## ----------------- ## >## Output variables. ## >## ----------------- ## > >ACLOCAL='${SHELL} '\''/var/tmp/portage/net-p2p/dogecoin-qt-1.14.6/work/dogecoin-1.14.6/src/secp256k1/build-aux/missing'\'' aclocal-1.16' >AMDEPBACKSLASH='' >AMDEP_FALSE='' >AMDEP_TRUE='#' >AMTAR='$${TAR-tar}' >AM_BACKSLASH='\' >AM_DEFAULT_V='$(AM_DEFAULT_VERBOSITY)' >AM_DEFAULT_VERBOSITY='1' >AM_V='$(V)' >AR='/usr/bin/x86_64-pc-linux-gnu-ar' >AUTOCONF='${SHELL} '\''/var/tmp/portage/net-p2p/dogecoin-qt-1.14.6/work/dogecoin-1.14.6/src/secp256k1/build-aux/missing'\'' autoconf' >AUTOHEADER='${SHELL} '\''/var/tmp/portage/net-p2p/dogecoin-qt-1.14.6/work/dogecoin-1.14.6/src/secp256k1/build-aux/missing'\'' autoheader' >AUTOMAKE='${SHELL} '\''/var/tmp/portage/net-p2p/dogecoin-qt-1.14.6/work/dogecoin-1.14.6/src/secp256k1/build-aux/missing'\'' automake-1.16' >AWK='gawk' >BREW='' >BUILD_EXEEXT='' >BUILD_OBJEXT='' >CC='x86_64-pc-linux-gnu-gcc' >CCAS='' >CCASDEPMODE='' >CCASFLAGS='' >CCDEPMODE='depmode=none' >CC_FOR_BUILD='' >CFLAGS='-O2 -march=x86-64 -pipe -pipe -frecord-gcc-switches -fno-diagnostics-color -fmessage-length=0' >CFLAGS_FOR_BUILD='' >CPP='x86_64-pc-linux-gnu-gcc -E' >CPPFLAGS='' >CPPFLAGS_FOR_BUILD='' >CPP_FOR_BUILD='' >CRYPTO_CFLAGS='' >CRYPTO_LIBS='' >CSCOPE='cscope' >CTAGS='ctags' >CYGPATH_W='echo' >DEFS='' >DEPDIR='.deps' >DLLTOOL='false' >DSYMUTIL='' >DUMPBIN='' >ECHO_C='' >ECHO_N='-n' >ECHO_T='' >EGREP='/bin/grep -E' >ENABLE_MODULE_ECDH_FALSE='' >ENABLE_MODULE_ECDH_TRUE='' >ENABLE_MODULE_RECOVERY_FALSE='' >ENABLE_MODULE_RECOVERY_TRUE='' >ETAGS='etags' >EXEEXT='' >FGREP='/bin/grep -F' >FILECMD='file' >GREP='/bin/grep' >INSTALL_DATA='${INSTALL} -m 644' >INSTALL_PROGRAM='${INSTALL}' >INSTALL_SCRIPT='${INSTALL}' >INSTALL_STRIP_PROGRAM='$(install_sh) -c -s' >JNI_INCLUDES='' >LD='x86_64-pc-linux-gnu-ld -m elf_x86_64 -m elf_x86_64' >LDFLAGS='-Wl,-O1 -Wl,--as-needed -Wl,--defsym=__gentoo_check_ldflags__=0' >LDFLAGS_FOR_BUILD='' >LIBOBJS='' >LIBS='' >LIBTOOL='$(SHELL) $(top_builddir)/libtool' >LIPO='' >LN_S='ln -s' >LTLIBOBJS='' >LT_SYS_LIBRARY_PATH='' >MAKEINFO='${SHELL} '\''/var/tmp/portage/net-p2p/dogecoin-qt-1.14.6/work/dogecoin-1.14.6/src/secp256k1/build-aux/missing'\'' makeinfo' >MANIFEST_TOOL=':' >MKDIR_P='/bin/mkdir -p' >NM='x86_64-pc-linux-gnu-nm' >NMEDIT='' >OBJDUMP='x86_64-pc-linux-gnu-objdump' >OBJEXT='o' >OTOOL64='' >OTOOL='' >PACKAGE='libsecp256k1' >PACKAGE_BUGREPORT='' >PACKAGE_NAME='libsecp256k1' >PACKAGE_STRING='libsecp256k1 0.1' >PACKAGE_TARNAME='libsecp256k1' >PACKAGE_URL='' >PACKAGE_VERSION='0.1' >PATH_SEPARATOR=':' >PKG_CONFIG='/usr/bin/x86_64-pc-linux-gnu-pkg-config' >PKG_CONFIG_LIBDIR='' >PKG_CONFIG_PATH='' >PORT='' >RANLIB='/usr/bin/x86_64-pc-linux-gnu-ranlib' >SECP_INCLUDES='' >SECP_LIBS='' >SECP_TEST_INCLUDES='' >SECP_TEST_LIBS='' >SED='/bin/sed' >SET_MAKE='' >SHELL='/bin/sh' >STRIP='/usr/bin/x86_64-pc-linux-gnu-strip' >USE_ASM_ARM_FALSE='' >USE_ASM_ARM_TRUE='' >USE_BENCHMARK_FALSE='' >USE_BENCHMARK_TRUE='' >USE_ECMULT_STATIC_PRECOMPUTATION_FALSE='' >USE_ECMULT_STATIC_PRECOMPUTATION_TRUE='' >USE_EXHAUSTIVE_TESTS_FALSE='' >USE_EXHAUSTIVE_TESTS_TRUE='' >USE_EXTERNAL_ASM_FALSE='' >USE_EXTERNAL_ASM_TRUE='' >USE_JNI_FALSE='' >USE_JNI_TRUE='' >USE_TESTS_FALSE='' >USE_TESTS_TRUE='' >VERSION='0.1' >_ACJNI_JAVAC='' >ac_ct_AR='' >ac_ct_CC='' >ac_ct_CC_FOR_BUILD='' >ac_ct_DUMPBIN='' >am__EXEEXT_FALSE='' >am__EXEEXT_TRUE='' >am__fastdepCCAS_FALSE='' >am__fastdepCCAS_TRUE='' >am__fastdepCC_FALSE='' >am__fastdepCC_TRUE='#' >am__include='include' >am__isrc='' >am__leading_dot='.' >am__nodep='' >am__quote='' >am__tar='$${TAR-tar} chof - "$$tardir"' >am__untar='$${TAR-tar} xf -' >bindir='/opt/dogecoin-qt/bin' >build='x86_64-pc-linux-gnu' >build_alias='x86_64-pc-linux-gnu' >build_cpu='x86_64' >build_os='linux-gnu' >build_vendor='pc' >datadir='/usr/share' >datarootdir='/usr/share' >docdir='/usr/share/doc/dogecoin-qt-1.14.6' >dvidir='${docdir}' >exec_prefix='NONE' >host='x86_64-pc-linux-gnu' >host_alias='x86_64-pc-linux-gnu' >host_cpu='x86_64' >host_os='linux-gnu' >host_vendor='pc' >htmldir='/usr/share/doc/dogecoin-qt-1.14.6/html' >includedir='${prefix}/include' >infodir='/usr/share/info' >install_sh='${SHELL} /var/tmp/portage/net-p2p/dogecoin-qt-1.14.6/work/dogecoin-1.14.6/src/secp256k1/build-aux/install-sh' >libdir='/usr/lib64' >libexecdir='${exec_prefix}/libexec' >localedir='${datarootdir}/locale' >localstatedir='/var/lib' >mandir='/usr/share/man' >mkdir_p='$(MKDIR_P)' >oldincludedir='/usr/include' >pdfdir='${docdir}' >prefix='/usr' >program_transform_name='s,x,x,' >psdir='${docdir}' >runstatedir='${localstatedir}/run' >sbindir='${exec_prefix}/sbin' >sharedstatedir='${prefix}/com' >sysconfdir='/etc' >target_alias='' > >## ----------- ## >## confdefs.h. ## >## ----------- ## > >/* confdefs.h */ >#define PACKAGE_NAME "libsecp256k1" >#define PACKAGE_TARNAME "libsecp256k1" >#define PACKAGE_VERSION "0.1" >#define PACKAGE_STRING "libsecp256k1 0.1" >#define PACKAGE_BUGREPORT "" >#define PACKAGE_URL "" >#define PACKAGE "libsecp256k1" >#define VERSION "0.1" >#define HAVE_STDIO_H 1 >#define HAVE_STDLIB_H 1 >#define HAVE_STRING_H 1 >#define HAVE_INTTYPES_H 1 >#define HAVE_STDINT_H 1 >#define HAVE_STRINGS_H 1 >#define HAVE_SYS_STAT_H 1 >#define HAVE_SYS_TYPES_H 1 >#define HAVE_UNISTD_H 1 >#define STDC_HEADERS 1 >#define HAVE_DLFCN_H 1 >#define LT_OBJDIR ".libs/" > >configure: exit 1
You cannot view the attachment while viewing its details because your browser does not support IFRAMEs.
View the attachment on a separate page
.
View Attachment As Raw
Actions:
View
Attachments on
bug 910245
:
865400
|
865401
|
865402
| 865403