Go to:
Gentoo Home
Documentation
Forums
Lists
Bugs
Planet
Store
Wiki
Get Gentoo!
Gentoo's Bugzilla – Attachment 861236 Details for
Bug 905832
[guru] app-office/lotus123r3-1.0.0_rc4 calls objdump directly
Home
|
New
–
[Ex]
|
Browse
|
Search
|
Privacy Policy
|
[?]
|
Reports
|
Requests
|
Help
|
New Account
|
Log In
[x]
|
Forgot Password
Login:
[x]
build.log
build.log (text/plain), 58.22 KB, created by
Agostino Sarubbo
on 2023-05-06 15:34:40 UTC
(
hide
)
Description:
build.log
Filename:
MIME Type:
Creator:
Agostino Sarubbo
Created:
2023-05-06 15:34:40 UTC
Size:
58.22 KB
patch
obsolete
> * Package: app-office/lotus123r3-1.0.0_rc4:0 > * Repository: guru > * Maintainer: joe@wt.gd > * USE: abi_x86_32 abi_x86_64 amd64 elibc_glibc kernel_linux userland_GNU > * FEATURES: network-sandbox preserve-libs sandbox userpriv usersandbox > > >@@@@@ PLEASE PAY ATTENTION HERE!!! @@@@@ >This information may help you to understand if this is a duplicate or if this bug exists after you pushed a fix; >This ebuild was merged at the following commit: >https://github.com/gentoo/gentoo/commit/c568143c1a092d02834122fffaa60d3479e9bd08 (Sat May 6 12:20:05 UTC 2023) >@@@@@ END @@@@@ > > > >@@@@@ PLEASE PAY ATTENTION HERE!!! @@@@@ >This information may help you to understand if this is a duplicate or if this bug exists after you pushed a fix; >This ebuild was merged at the following commit: >https://gitweb.gentoo.org/repo/proj/guru.git/commit/?id=ff7867f7673dd948c7eb3f54ef22c47b4d8cfbe9 (Sat May 6 06:38:40 UTC 2023) >@@@@@ END @@@@@ > > > >@@@@@ PLEASE PAY ATTENTION HERE!!! @@@@@ >This ebuild was merged (directly or as a dependency) because of the following commit: >https://gitweb.gentoo.org/repo/proj/guru.git/commit/?id=8299bf78271b8e7d57eb1143f505b1e0a3d9cf03 >@@@@@ END @@@@@ > > > >################## ># emerge --info: # >################## >Portage 3.0.47 (python 3.11.3-final-0, default/linux/amd64/17.1, gcc-13, glibc-2.37-r2, 5.15.85-gentoo-dist x86_64) >================================================================= >System uname: Linux-5.15.85-gentoo-dist-x86_64-AMD_EPYC_7513_32-Core_Processor-with-glibc2.37 >KiB Mem: 263532996 total, 132857492 free >KiB Swap: 0 total, 0 free >sh bash 5.2_p15-r2 >ld GNU ld (Gentoo 2.40 p5) 2.40.0 >app-misc/pax-utils: 1.3.7::gentoo >app-shells/bash: 5.2_p15-r2::gentoo >dev-lang/perl: 5.36.1-r1::gentoo >dev-lang/python: 3.10.11::gentoo, 3.11.3::gentoo >dev-util/cmake: 3.26.3::gentoo >dev-util/meson: 1.1.0::gentoo >sys-apps/baselayout: 2.13-r1::gentoo >sys-apps/openrc: 0.47.1::gentoo >sys-apps/sandbox: 2.30-r1::gentoo >sys-devel/autoconf: 2.71-r6::gentoo >sys-devel/automake: 1.16.5-r1::gentoo >sys-devel/binutils: 2.40-r5::gentoo >sys-devel/binutils-config: 5.5::gentoo >sys-devel/gcc: 13.1.0-r1::gentoo >sys-devel/gcc-config: 2.10::gentoo >sys-devel/libtool: 2.4.7-r1::gentoo >sys-devel/make: 4.4.1::gentoo >sys-kernel/linux-headers: 6.3::gentoo (virtual/os-headers) >sys-libs/glibc: 2.37-r2::gentoo >Repositories: > >gentoo > location: /usr/portage > sync-type: rsync > sync-uri: rsync://rsync.gentoo.org/gentoo-portage > priority: -1000 > volatile: True > sync-rsync-verify-max-age: 24 > sync-rsync-verify-metamanifest: yes > sync-rsync-verify-jobs: 1 > sync-rsync-extra-opts: > >guru > location: /opt/guru > masters: gentoo > priority: 0 > volatile: True > >ACCEPT_KEYWORDS="amd64 ~amd64" >ACCEPT_LICENSE="* all-rights-reserved" >AR="x86_64-pc-linux-gnu-ar" >AS="x86_64-pc-linux-gnu-as" >CBUILD="x86_64-pc-linux-gnu" >CC="x86_64-pc-linux-gnu-gcc" >CFLAGS="-O2 -march=x86-64 -pipe -pipe -frecord-gcc-switches -fno-diagnostics-color -fmessage-length=0" >CHOST="x86_64-pc-linux-gnu" >CONFIG_PROTECT="/etc /usr/share/gnupg/qualified.txt" >CONFIG_PROTECT_MASK="/etc/ca-certificates.conf /etc/env.d /etc/fonts/fonts.conf /etc/gconf /etc/gentoo-release /etc/revdep-rebuild /etc/sandbox.d /etc/terminfo" >CPP="x86_64-pc-linux-gnu-gcc -E" >CXX="x86_64-pc-linux-gnu-g++" >CXXFLAGS="-O2 -march=x86-64 -pipe -pipe -frecord-gcc-switches -fno-diagnostics-color -fmessage-length=0" >DISTDIR="/var/tmp/portage/app-office/lotus123r3-1.0.0_rc4/distdir" >EMERGE_DEFAULT_OPTS="--with-bdeps=y -1 -k -b" >ENV_UNSET="CARGO_HOME DBUS_SESSION_BUS_ADDRESS DISPLAY GDK_PIXBUF_MODULE_FILE GOBIN GOPATH PERL5LIB PERL5OPT PERLPREFIX PERL_CORE PERL_MB_OPT PERL_MM_OPT XAUTHORITY XDG_CACHE_HOME XDG_CONFIG_HOME XDG_DATA_HOME XDG_RUNTIME_DIR XDG_STATE_HOME" >FCFLAGS="-O2 -march=x86-64 -pipe -pipe -frecord-gcc-switches -fno-diagnostics-color -fmessage-length=0" >FEATURES="assume-digests binpkg-docompress binpkg-dostrip binpkg-logs binpkg-multi-instance buildpkg buildpkg-live config-protect-if-modified distlocks ebuild-locks fixlafiles ipc-sandbox merge-sync multilib-strict network-sandbox news parallel-fetch pid-sandbox preserve-libs protect-owned qa-unresolved-soname-deps sandbox sfperms sign split-log strict unknown-features-warn unmerge-logs unmerge-orphans userfetch userpriv usersandbox usersync xattr" >FFLAGS="-O2 -march=x86-64 -pipe -pipe -frecord-gcc-switches -fno-diagnostics-color -fmessage-length=0" >GCOV="x86_64-pc-linux-gnu-gcov" >GENTOO_MIRRORS="http://mirror.leaseweb.com/gentoo/ http://ftp.snt.utwente.nl/pub/os/linux/gentoo/ http://ftp.belnet.be/pub/rsync.gentoo.org/gentoo/ http://distfiles.gentoo.org" >LANG="C.UTF8" >LD="x86_64-pc-linux-gnu-ld" >LDFLAGS="-Wl,-O1 -Wl,--as-needed -Wl,--defsym=__gentoo_check_ldflags__=0" >LEX="flex" >MAKEOPTS="-j28" >NM="x86_64-pc-linux-gnu-nm" >OBJCOPY="x86_64-pc-linux-gnu-objcopy" >OBJDUMP="x86_64-pc-linux-gnu-objdump" >PKGDIR="/root/tbci/binpkg" >PORTAGE_CONFIGROOT="/" >PORTAGE_RSYNC_OPTS="--recursive --links --safe-links --perms --times --omit-dir-times --compress --force --whole-file --delete --stats --human-readable --timeout=180 --exclude=/distfiles --exclude=/local --exclude=/packages --exclude=/.git" >PORTAGE_TMPDIR="/var/tmp" >RANLIB="x86_64-pc-linux-gnu-ranlib" >READELF="x86_64-pc-linux-gnu-readelf" >SHELL="/bin/bash" >STRIP="x86_64-pc-linux-gnu-strip" >USE="acl amd64 bzip2 cli crypt debug dri elogind fortran gdbm iconv ipv6 jumbo-build libglvnd libtirpc multilib native-symlinks ncurses nls nptl openmp pam pcre readline seccomp split-usr ssl test-rust unicode xattr zlib" ABI_X86="64 32" ELIBC="glibc" KERNEL="linux" USERLAND="GNU" >Unset: ADDR2LINE, ARFLAGS, ASFLAGS, CCLD, CONFIG_SHELL, CPPFLAGS, CTARGET, CXXFILT, ELFEDIT, EXTRA_ECONF, F77FLAGS, FC, GPROF, INSTALL_MASK, LC_ALL, LFLAGS, LIBTOOL, LINGUAS, MAKE, MAKEFLAGS, PORTAGE_BINHOST, PORTAGE_BUNZIP2_COMMAND, PORTAGE_COMPRESS, PORTAGE_COMPRESS_FLAGS, PORTAGE_RSYNC_EXTRA_OPTS, RUSTFLAGS, SIZE, STRINGS, YACC, YFLAGS > > > > > >############################## ># emerge history (qlop -mv): # >############################## >2023-05-06T16:33:38 >>> sys-libs/ncurses-compat-6.2 >2023-05-06T16:33:41 >>> sys-devel/binutils-2.40-r5 >2023-05-06T16:35:44 >>> dev-lang/python-exec-2.4.10 >2023-05-06T16:35:47 >>> sys-devel/gcc-config-2.10 >2023-05-06T16:35:51 >>> sys-devel/binutils-config-5.5 > > > > >####################################### ># installed packages (qlist -ICvUSS): # >####################################### >acct-group/audio-0-r1:0 >acct-group/cdrom-0-r1:0 >acct-group/dialout-0-r1:0 >acct-group/disk-0-r1:0 >acct-group/floppy-0:0 >acct-group/input-0-r1:0 >acct-group/kmem-0-r1:0 >acct-group/kvm-0-r1:0 >acct-group/lp-0-r1:0 >acct-group/man-0-r1:0 >acct-group/messagebus-0-r1:0 >acct-group/polkitd-0-r1:0 >acct-group/portage-0:0 >acct-group/render-0-r1:0 >acct-group/root-0:0 >acct-group/sgx-0:0 >acct-group/sshd-0-r1:0 >acct-group/tape-0-r1:0 >acct-group/tty-0-r1:0 >acct-group/usb-0-r1:0 >acct-group/video-0-r1:0 >acct-user/man-1-r1:0 >acct-user/messagebus-0-r1:0 >acct-user/polkitd-0-r1:0 >acct-user/portage-0:0 >acct-user/sshd-0-r1:0 >app-admin/eselect-1.4.22:0 -doc -emacs -vim-syntax >app-admin/perl-cleaner-2.30-r1:0 -pkgcore >app-alternatives/awk-4:0 -busybox gawk -mawk -nawk split-usr >app-alternatives/bc-0:0 -gh gnu >app-alternatives/bzip2-1:0 -lbzip2 -pbzip2 reference split-usr >app-alternatives/cpio-0:0 gnu -libarchive split-usr >app-alternatives/gzip-0:0 -pigz reference split-usr >app-alternatives/lex-0-r1:0 flex -reflex >app-alternatives/sh-0:0 bash -busybox -dash -ksh -lksh -mksh >app-alternatives/tar-0:0 gnu -libarchive split-usr >app-alternatives/yacc-1-r2:0 bison -byacc -reference >app-arch/bzip2-1.0.8-r4:0/1 -abi_mips_n32 -abi_mips_n64 -abi_mips_o32 -abi_s390_32 -abi_s390_64 -abi_x86_32 abi_x86_64 -abi_x86_x32 split-usr -static -static-libs -verify-sig >app-arch/cpio-2.14:0 nls >app-arch/gzip-1.12-r4:0 -pic -static -verify-sig >app-arch/libarchive-3.6.2-r1:0/13 -abi_mips_n32 -abi_mips_n64 -abi_mips_o32 -abi_s390_32 -abi_s390_64 -abi_x86_32 abi_x86_64 -abi_x86_x32 acl -blake2 bzip2 e2fsprogs -expat iconv -lz4 lzma -lzo -nettle -static-libs -verify-sig xattr -zstd >app-arch/tar-1.34-r3:0 acl -minimal nls -selinux -verify-sig xattr >app-arch/unzip-6.0_p27-r1:0 bzip2 -natspec unicode >app-arch/xz-utils-5.4.3:0 -abi_mips_n32 -abi_mips_n64 -abi_mips_o32 -abi_s390_32 -abi_s390_64 -abi_x86_32 abi_x86_64 -abi_x86_x32 -doc extra-filters nls split-usr -static-libs -verify-sig >app-arch/zstd-1.5.5:0/1 -abi_mips_n32 -abi_mips_n64 -abi_mips_o32 -abi_s390_32 -abi_s390_64 -abi_x86_32 abi_x86_64 -abi_x86_x32 -lz4 lzma split-usr -static-libs -test zlib >app-crypt/gnupg-2.4.0:0 bzip2 -doc -ldap nls readline -selinux smartcard ssl -test tofu -tools -tpm -usb -user-socket -verify-sig -wks-server >app-crypt/gpgme-1.20.0:1/11.6.15.2 -common-lisp cxx debug -python python_targets_python3_10 python_targets_python3_11 -qt5 -static-libs -test -verify-sig >app-crypt/libb2-0.98.1-r3:0 -abi_mips_n32 -abi_mips_n64 -abi_mips_o32 -abi_s390_32 -abi_s390_64 -abi_x86_32 abi_x86_64 -abi_x86_x32 -native-cflags openmp -static-libs >app-crypt/pinentry-1.2.1-r1:0 -caps -efl -emacs -gnome-keyring -gtk ncurses -qt5 -verify-sig >app-crypt/rhash-1.4.3:0 -abi_mips_n32 -abi_mips_n64 -abi_mips_o32 -abi_s390_32 -abi_s390_64 -abi_x86_32 abi_x86_64 -abi_x86_x32 debug nls ssl -static-libs >app-editors/nano-7.2:0 -debug -justify -magic -minimal ncurses nls spell -static unicode >app-eselect/eselect-fontconfig-20220403:0 >app-eselect/eselect-iptables-20220320:0 >app-eselect/eselect-lib-bin-symlink-0.1.1-r1:0 >app-eselect/eselect-pinentry-0.7.2-r1:0 >app-i18n/man-pages-ja-20180315-r1:0 >app-i18n/man-pages-l10n-4.18.1-r1:0 l10n_cs l10n_da l10n_de l10n_el l10n_es l10n_fi l10n_fr l10n_hu l10n_id l10n_it l10n_mk l10n_nb l10n_nl l10n_pl l10n_pt-BR l10n_ro l10n_ru l10n_sr l10n_sv l10n_uk l10n_vi >app-i18n/man-pages-zh_CN-1.6.4.0:0 >app-misc/ca-certificates-20230311.3.89.1:0 -cacert >app-misc/editor-wrapper-4-r1:0 >app-misc/mime-types-2.1.53:0 -nginx >app-misc/pax-utils-1.3.7:0 -caps -man -python -python_single_target_python3_10 python_single_target_python3_11 -seccomp -test >app-misc/tmux-3.3a-r1:0 debug -selinux -systemd -utempter -vim-syntax >app-portage/eix-0.36.6:0 debug -doc nls -sqlite >app-portage/elt-patches-20221210:0 >app-portage/gemato-20.2:0 gpg -pretty-log python_targets_pypy3 python_targets_python3_10 python_targets_python3_11 -test -tools >app-portage/gentoolkit-0.6.1-r3:0 python_targets_pypy3 python_targets_python3_10 python_targets_python3_11 -test >app-portage/portage-utils-0.95:0 openmp qmanifest qtegrity -static >app-shells/bash-5.2_p15-r2:0 -afs -bashlogger -examples -mem-scramble net nls -pgo -plugins readline -verify-sig >app-shells/bash-completion-2.11:0 eselect -test >app-shells/gentoo-bashcomp-20230313:0 >app-shells/push-3.4:0 >app-shells/quoter-4.2:0 >app-text/ansifilter-2.18:0 -qt5 >app-text/asciidoc-10.2.0:0 -python_single_target_pypy3 -python_single_target_python3_10 python_single_target_python3_11 >app-text/build-docbook-catalog-2.4:0 >app-text/docbook-xml-dtd-4.5-r2:4.5 >app-text/docbook-xml-dtd-4.4-r3:4.4 >app-text/docbook-xml-dtd-4.2-r3:4.2 >app-text/docbook-xml-dtd-4.1.2-r7:4.1.2 >app-text/docbook-xsl-ns-stylesheets-1.79.1:0 -ruby >app-text/docbook-xsl-stylesheets-1.79.1-r4:0 -ruby >app-text/manpager-1:0 >app-text/opensp-1.5.2-r10:0 -doc nls -static-libs -test >app-text/po4a-0.69:0 -test -test >app-text/sgml-common-0.6.3-r7:0 >app-text/xmlto-0.0.28-r10:0 -latex text >dev-db/sqlite-3.41.2-r1:3 -abi_mips_n32 -abi_mips_n64 -abi_mips_o32 -abi_s390_32 -abi_s390_64 -abi_x86_32 abi_x86_64 -abi_x86_x32 debug -doc -icu readline -secure-delete -static-libs -tcl -test -tools >dev-lang/duktape-2.7.0-r3:0/2.7.0 >dev-lang/perl-5.36.1-r1:0/5.36 -berkdb debug -doc gdbm ithreads -minimal -quadmath >dev-lang/python-3.11.3:3.11 -bluetooth -build ensurepip -examples gdbm -hardened -libedit -lto ncurses -pgo readline sqlite ssl -test -tk -valgrind -verify-sig >dev-lang/python-3.10.11:3.10 -bluetooth -build ensurepip -examples gdbm -hardened -libedit -lto ncurses -pgo readline sqlite ssl -test -tk -valgrind -verify-sig xml >dev-lang/python-exec-2.4.10:2 -native-symlinks python_targets_pypy3 python_targets_python3_10 python_targets_python3_11 -test >dev-lang/python-exec-conf-2.4.6:2 python_targets_pypy3 python_targets_python3_10 python_targets_python3_11 >dev-lang/tcl-8.6.13-r1:0/8.6 -abi_mips_n32 -abi_mips_n64 -abi_mips_o32 -abi_s390_32 -abi_s390_64 -abi_x86_32 abi_x86_64 -abi_x86_x32 debug threads >dev-libs/boehm-gc-8.2.2-r1:0 -abi_mips_n32 -abi_mips_n64 -abi_mips_o32 -abi_s390_32 -abi_s390_64 -abi_x86_32 abi_x86_64 -abi_x86_x32 -cxx large -static-libs threads >dev-libs/elfutils-0.189-r1:0 -abi_mips_n32 -abi_mips_n64 -abi_mips_o32 -abi_s390_32 -abi_s390_64 -abi_x86_32 abi_x86_64 -abi_x86_x32 bzip2 -lzma nls -static-libs -test utils -valgrind -verify-sig -zstd >dev-libs/expat-2.5.0:0 -abi_mips_n32 -abi_mips_n64 -abi_mips_o32 -abi_s390_32 -abi_s390_64 -abi_x86_32 abi_x86_64 -abi_x86_x32 -examples -static-libs unicode >dev-libs/glib-2.76.2:2 -abi_mips_n32 -abi_mips_n64 -abi_mips_o32 -abi_s390_32 -abi_s390_64 -abi_x86_32 abi_x86_64 -abi_x86_x32 -dbus debug elf -gtk-doc mime -selinux -static-libs -sysprof -systemtap -test -utils xattr >dev-libs/gmp-6.2.1-r5:0/10.4 -abi_mips_n32 -abi_mips_n64 -abi_mips_o32 -abi_s390_32 -abi_s390_64 -abi_x86_32 abi_x86_64 -abi_x86_x32 asm cpudetection cxx -doc -pic -static-libs >dev-libs/gobject-introspection-1.76.1:0 -doctool -gtk-doc -python_single_target_python3_10 python_single_target_python3_11 -test >dev-libs/gobject-introspection-common-1.76.1:0 >dev-libs/isl-0.26:0/23 -abi_mips_n32 -abi_mips_n64 -abi_mips_o32 -abi_s390_32 -abi_s390_64 -abi_x86_32 abi_x86_64 -abi_x86_x32 -static-libs >dev-libs/jsoncpp-1.9.5:0/25 -doc -test >dev-libs/libassuan-2.5.5:0 >dev-libs/libatomic_ops-7.8.0:0 -abi_mips_n32 -abi_mips_n64 -abi_mips_o32 -abi_s390_32 -abi_s390_64 -abi_x86_32 abi_x86_64 -abi_x86_x32 >dev-libs/libevent-2.1.12-r1:0/2.1-7 -abi_mips_n32 -abi_mips_n64 -abi_mips_o32 -abi_s390_32 -abi_s390_64 -abi_x86_32 abi_x86_64 -abi_x86_x32 clock-gettime debug -malloc-replacement ssl -static-libs -test -verbose-debug >dev-libs/libffi-3.4.4-r1:0/8 -abi_mips_n32 -abi_mips_n64 -abi_mips_o32 -abi_s390_32 -abi_s390_64 -abi_x86_32 abi_x86_64 -abi_x86_x32 debug -exec-static-trampoline -pax-kernel -static-libs -test >dev-libs/libgcrypt-1.10.2:0/20 -abi_mips_n32 -abi_mips_n64 -abi_mips_o32 -abi_s390_32 -abi_s390_64 -abi_x86_32 abi_x86_64 -abi_x86_x32 asm -cpu_flags_arm_aes -cpu_flags_arm_neon -cpu_flags_arm_sha1 -cpu_flags_arm_sha2 -cpu_flags_ppc_altivec -cpu_flags_ppc_vsx2 -cpu_flags_ppc_vsx3 cpu_flags_x86_aes cpu_flags_x86_avx cpu_flags_x86_avx2 -cpu_flags_x86_padlock -cpu_flags_x86_sha cpu_flags_x86_sse4_1 -doc getentropy -static-libs -verify-sig >dev-libs/libgpg-error-1.47:0 -abi_mips_n32 -abi_mips_n64 -abi_mips_o32 -abi_s390_32 -abi_s390_64 -abi_x86_32 abi_x86_64 -abi_x86_x32 -common-lisp nls -static-libs -test -verify-sig >dev-libs/libksba-1.6.3:0 -static-libs -verify-sig >dev-libs/libltdl-2.4.7-r1:0 -abi_mips_n32 -abi_mips_n64 -abi_mips_o32 -abi_s390_32 -abi_s390_64 -abi_x86_32 abi_x86_64 -abi_x86_x32 -static-libs >dev-libs/libpcre2-10.42-r1:0/3 -abi_mips_n32 -abi_mips_n64 -abi_mips_o32 -abi_s390_32 -abi_s390_64 -abi_x86_32 abi_x86_64 -abi_x86_x32 bzip2 jit -libedit pcre16 pcre32 readline split-usr -static-libs unicode -verify-sig zlib >dev-libs/libpipeline-1.5.7:0 -test >dev-libs/libtasn1-4.19.0:0/6 -abi_mips_n32 -abi_mips_n64 -abi_mips_o32 -abi_s390_32 -abi_s390_64 -abi_x86_32 abi_x86_64 -abi_x86_x32 -static-libs -test -valgrind -verify-sig >dev-libs/libunistring-1.1-r1:0/5 -abi_mips_n32 -abi_mips_n64 -abi_mips_o32 -abi_s390_32 -abi_s390_64 -abi_x86_32 abi_x86_64 -abi_x86_x32 -doc -static-libs >dev-libs/libuv-1.44.2-r1:0/1 >dev-libs/libxml2-2.10.4:2 -abi_mips_n32 -abi_mips_n64 -abi_mips_o32 -abi_s390_32 -abi_s390_64 -abi_x86_32 abi_x86_64 -abi_x86_x32 -debug -examples ftp -icu -lzma python python_targets_python3_10 python_targets_python3_11 readline -static-libs -test >dev-libs/libxslt-1.1.37-r1:0 -abi_mips_n32 -abi_mips_n64 -abi_mips_o32 -abi_s390_32 -abi_s390_64 -abi_x86_32 abi_x86_64 -abi_x86_x32 crypt debug -examples -python python_targets_python3_10 python_targets_python3_11 -static-libs >dev-libs/lzo-2.10:2 -abi_mips_n32 -abi_mips_n64 -abi_mips_o32 -abi_s390_32 -abi_s390_64 -abi_x86_32 abi_x86_64 -abi_x86_x32 -examples split-usr -static-libs >dev-libs/mpc-1.3.1:0/3 -abi_mips_n32 -abi_mips_n64 -abi_mips_o32 -abi_s390_32 -abi_s390_64 -abi_x86_32 abi_x86_64 -abi_x86_x32 -static-libs >dev-libs/mpfr-4.2.0_p4:0/6 -abi_mips_n32 -abi_mips_n64 -abi_mips_o32 -abi_s390_32 -abi_s390_64 -abi_x86_32 abi_x86_64 -abi_x86_x32 -static-libs -verify-sig >dev-libs/nettle-3.8.1:0/8-6 -abi_mips_n32 -abi_mips_n64 -abi_mips_o32 -abi_s390_32 -abi_s390_64 -abi_x86_32 abi_x86_64 -abi_x86_x32 asm -cpu_flags_arm_aes -cpu_flags_arm_neon -cpu_flags_arm_sha1 -cpu_flags_arm_sha2 -cpu_flags_ppc_altivec cpu_flags_x86_aes cpu_flags_x86_pclmul -cpu_flags_x86_sha -doc gmp -static-libs -verify-sig >dev-libs/npth-1.6-r1:0 -test >dev-libs/openssl-3.0.8-r4:0/3 -abi_mips_n32 -abi_mips_n64 -abi_mips_o32 -abi_s390_32 -abi_s390_64 -abi_x86_32 abi_x86_64 -abi_x86_x32 asm cpu_flags_x86_sse2 -fips -ktls -rfc3779 -sctp -static-libs -test -tls-compression -vanilla -verify-sig -verify-sig -weak-ssl-ciphers >dev-libs/popt-1.19:0 -abi_mips_n32 -abi_mips_n64 -abi_mips_o32 -abi_s390_32 -abi_s390_64 -abi_x86_32 abi_x86_64 -abi_x86_x32 nls -static-libs >dev-perl/Encode-EUCJPASCII-0.30.0-r1:0 -test >dev-perl/Encode-HanExtra-0.230.0-r3:0 >dev-perl/Encode-Locale-1.50.0-r1:0 -test >dev-perl/ExtUtils-CChecker-0.110.0:0 -test >dev-perl/File-BaseDir-0.90.0:0 -test >dev-perl/File-DesktopEntry-0.220.0-r1:0 -test >dev-perl/File-MimeInfo-0.300.0:0 -test >dev-perl/IO-Socket-SSL-2.81.0:0 -examples -idn -test >dev-perl/IPC-System-Simple-1.300.0:0 -test >dev-perl/Locale-gettext-1.70.0-r1:0 -test >dev-perl/MIME-Charset-1.13.1:0 l10n_ja l10n_zh -test >dev-perl/Module-Build-0.423.100:0 -test >dev-perl/Mozilla-CA-20999999-r1:0 -test >dev-perl/Net-SSLeay-1.920.0-r1:0 -examples -examples -minimal -test >dev-perl/Pod-Parser-1.630.0-r1:0 -test >dev-perl/SGMLSpm-1.1-r2:0 -test >dev-perl/Syntax-Keyword-Try-0.270.0:0 -test >dev-perl/TermReadKey-2.380.0-r1:0 -examples -test >dev-perl/Text-CharWidth-0.40.0-r2:0 -test >dev-perl/Text-WrapI18N-0.60.0-r2:0 -test >dev-perl/Unicode-LineBreak-2019.1.0:0 >dev-perl/URI-5.110.0:0 -test >dev-perl/XS-Parse-Keyword-0.250.0:0 -test >dev-perl/YAML-Tiny-1.730.0-r1:0 -minimal -test >dev-python/autocommand-2.2.2:0 python_targets_pypy3 python_targets_python3_10 python_targets_python3_11 -test >dev-python/calver-2022.06.26:0 python_targets_pypy3 python_targets_python3_10 python_targets_python3_11 -test >dev-python/certifi-3021.3.16-r3:0 python_targets_pypy3 python_targets_python3_10 python_targets_python3_11 -test >dev-python/charset_normalizer-3.1.0:0 python_targets_pypy3 python_targets_python3_10 python_targets_python3_11 -test >dev-python/cython-0.29.34:0 debug -doc -emacs python_targets_pypy3 python_targets_python3_10 python_targets_python3_11 -test >dev-python/editables-0.3:0 python_targets_pypy3 python_targets_python3_10 python_targets_python3_11 -test >dev-python/ensurepip-pip-23.1.2:0 >dev-python/ensurepip-setuptools-67.7.2:0 >dev-python/ensurepip-wheels-100:0 >dev-python/flit_core-3.8.0:0 python_targets_pypy3 python_targets_python3_10 python_targets_python3_11 -test >dev-python/gentoo-common-1:0 >dev-python/gpep517-13:0 python_targets_pypy3 python_targets_python3_10 python_targets_python3_11 -test >dev-python/hatchling-1.14.1:0 python_targets_pypy3 python_targets_python3_10 python_targets_python3_11 -test >dev-python/idna-3.4:0 python_targets_pypy3 python_targets_python3_10 python_targets_python3_11 -test >dev-python/importlib-metadata-6.6.0:0 python_targets_pypy3 python_targets_python3_10 python_targets_python3_11 -test >dev-python/inflect-6.0.4:0 python_targets_pypy3 python_targets_python3_10 python_targets_python3_11 -test >dev-python/installer-0.7.0:0 python_targets_pypy3 python_targets_python3_10 python_targets_python3_11 -test >dev-python/jaraco-context-4.3.0:0 python_targets_pypy3 python_targets_python3_10 python_targets_python3_11 -test >dev-python/jaraco-functools-3.6.0:0 python_targets_pypy3 python_targets_python3_10 python_targets_python3_11 -test >dev-python/jaraco-text-3.11.1:0 python_targets_pypy3 python_targets_python3_10 python_targets_python3_11 -test >dev-python/jinja-3.1.2:0 -doc -examples python_targets_pypy3 python_targets_python3_10 python_targets_python3_11 -test >dev-python/markupsafe-2.1.2:0 python_targets_pypy3 python_targets_python3_10 python_targets_python3_11 -test >dev-python/more-itertools-9.1.0:0 -doc python_targets_pypy3 python_targets_python3_10 python_targets_python3_11 -test >dev-python/nspektr-0.4.0:0 python_targets_pypy3 python_targets_python3_10 python_targets_python3_11 -test >dev-python/ordered-set-4.1.0:0 python_targets_pypy3 python_targets_python3_10 python_targets_python3_11 -test >dev-python/packaging-23.1:0 python_targets_pypy3 python_targets_python3_10 python_targets_python3_11 -test >dev-python/pathspec-0.11.1:0 python_targets_pypy3 python_targets_python3_10 python_targets_python3_11 -test >dev-python/platformdirs-3.5.0:0 python_targets_pypy3 python_targets_python3_10 python_targets_python3_11 -test >dev-python/pluggy-1.0.0-r2:0 python_targets_pypy3 python_targets_python3_10 python_targets_python3_11 -test >dev-python/pydantic-1.10.7:0 debug native-extensions python_targets_pypy3 python_targets_python3_10 python_targets_python3_11 -test >dev-python/pyparsing-3.0.9:0 -examples python_targets_pypy3 python_targets_python3_10 python_targets_python3_11 -test >dev-python/pypy-7.3.11:0/73 bzip2 -full-stdlib gdbm jit ncurses -sqlite -tk >dev-python/pypy-exe-bin-7.3.11:7.3.11 >dev-python/pypy3-7.3.11_p1:0/pypy39-pp73-336 ensurepip gdbm jit ncurses sqlite -tk >dev-python/pypy3-exe-7.3.11:3.9-7.3.11 -cpu_flags_x86_sse2 jit -low-memory ncurses >dev-python/PySocks-1.7.1-r2:0 python_targets_pypy3 python_targets_python3_10 python_targets_python3_11 >dev-python/requests-2.30.0:0 python_targets_pypy3 python_targets_python3_10 python_targets_python3_11 -socks5 -test test-rust >dev-python/setuptools-67.7.2:0 python_targets_pypy3 python_targets_python3_10 python_targets_python3_11 -test >dev-python/setuptools-scm-7.1.0:0 python_targets_pypy3 python_targets_python3_10 python_targets_python3_11 -test >dev-python/six-1.16.0-r1:0 -doc python_targets_pypy3 python_targets_python3_10 python_targets_python3_11 -test >dev-python/tomli-2.0.1-r1:0 python_targets_pypy3 python_targets_python3_10 python_targets_python3_11 -test >dev-python/trove-classifiers-2023.5.2:0 python_targets_pypy3 python_targets_python3_10 python_targets_python3_11 -test >dev-python/typing-extensions-4.5.0:0 python_targets_pypy3 python_targets_python3_10 python_targets_python3_11 -test >dev-python/urllib3-2.0.2:0 -brotli python_targets_pypy3 python_targets_python3_10 python_targets_python3_11 -test -zstd >dev-python/wheel-0.40.0:0 python_targets_pypy3 python_targets_python3_10 python_targets_python3_11 -test >dev-python/zipp-3.15.0:0 python_targets_pypy3 python_targets_python3_10 python_targets_python3_11 -test >dev-util/checkbashisms-2.22.2:0 >dev-util/cmake-3.26.3:0 -doc -emacs ncurses -qt5 -test -test -verify-sig >dev-util/desktop-file-utils-0.26-r2:0 -emacs >dev-util/glib-utils-2.76.2:0 -python_single_target_python3_10 python_single_target_python3_11 >dev-util/gperf-3.1-r1:0 >dev-util/gtk-doc-am-1.33.2:0 >dev-util/meson-1.1.0:0 python_targets_python3_10 python_targets_python3_11 -test >dev-util/meson-format-array-0:0 python_targets_python3_10 python_targets_python3_11 >dev-util/ninja-1.11.1-r2:0 -doc -emacs -test >dev-util/pkgconf-1.8.1:0/3 -abi_mips_n32 -abi_mips_n64 -abi_mips_o32 -abi_s390_32 -abi_s390_64 -abi_x86_32 abi_x86_64 -abi_x86_x32 -test >dev-util/re2c-2.2:0 debug -test >dev-vcs/git-2.40.1:0 blksha1 -cgi curl -cvs -doc -gnome-keyring gpg -highlight iconv -mediawiki nls pcre -perforce -perl -python_single_target_python3_10 python_single_target_python3_11 safe-directory -selinux -subversion -test -tk webdav -xinetd >media-fonts/liberation-fonts-2.1.5:0 -X -X -fontforge >media-gfx/graphite2-1.3.14_p20210810-r3:0 -abi_mips_n32 -abi_mips_n64 -abi_mips_o32 -abi_s390_32 -abi_s390_64 -abi_x86_32 abi_x86_64 -abi_x86_x32 -perl -test >media-libs/fontconfig-2.14.2-r2:1.0 -abi_mips_n32 -abi_mips_n64 -abi_mips_o32 -abi_s390_32 -abi_s390_64 -abi_x86_32 abi_x86_64 -abi_x86_x32 -doc nls -test >media-libs/freetype-2.13.0:2 -X -abi_mips_n32 -abi_mips_n64 -abi_mips_o32 -abi_s390_32 -abi_s390_64 -abi_x86_32 abi_x86_64 -abi_x86_x32 adobe-cff -brotli bzip2 cleartype-hinting debug -doc -fontforge harfbuzz -infinality png -static-libs -svg -utils >media-libs/harfbuzz-7.2.0:0/6.0.0 -abi_mips_n32 -abi_mips_n64 -abi_mips_o32 -abi_s390_32 -abi_s390_64 -abi_x86_32 abi_x86_64 -abi_x86_x32 cairo debug -doc -experimental glib graphite -icu introspection -test truetype >media-libs/libpng-1.6.39:0/16 -abi_mips_n32 -abi_mips_n64 -abi_mips_o32 -abi_s390_32 -abi_s390_64 -abi_x86_32 abi_x86_64 -abi_x86_x32 -apng -cpu_flags_arm_neon cpu_flags_x86_sse -static-libs >net-dns/c-ares-1.19.0:0/2 -abi_mips_n32 -abi_mips_n64 -abi_mips_o32 -abi_s390_32 -abi_s390_64 -abi_x86_32 abi_x86_64 -abi_x86_x32 -static-libs -test -verify-sig >net-dns/libidn2-2.3.4:0/2 -abi_mips_n32 -abi_mips_n64 -abi_mips_o32 -abi_s390_32 -abi_s390_64 -abi_x86_32 abi_x86_64 -abi_x86_x32 nls -static-libs -verify-sig >net-firewall/iptables-1.8.9:0/1.8.3 -conntrack -netlink -nftables -pcap split-usr -static-libs >net-libs/gnutls-3.8.0:0/30.30 -abi_mips_n32 -abi_mips_n64 -abi_mips_o32 -abi_s390_32 -abi_s390_64 -abi_x86_32 abi_x86_64 -abi_x86_x32 -brotli cxx -dane -doc -examples idn nls openssl -pkcs11 seccomp -sslv2 -sslv3 -static-libs -test -test-full tls-heartbeat -tools -valgrind -verify-sig zlib -zstd >net-libs/libmnl-1.0.5:0/0.2.0 -examples -verify-sig >net-libs/libnsl-2.0.0-r1:0/3 -abi_mips_n32 -abi_mips_n64 -abi_mips_o32 -abi_s390_32 -abi_s390_64 -abi_x86_32 abi_x86_64 -abi_x86_x32 -static-libs >net-libs/libtirpc-1.3.3:0/3 -abi_mips_n32 -abi_mips_n64 -abi_mips_o32 -abi_s390_32 -abi_s390_64 -abi_x86_32 abi_x86_64 -abi_x86_x32 -kerberos split-usr -static-libs >net-libs/nghttp2-1.52.0:0/1.14 -abi_mips_n32 -abi_mips_n64 -abi_mips_o32 -abi_s390_32 -abi_s390_64 -abi_x86_32 abi_x86_64 -abi_x86_x32 debug -hpack-tools -jemalloc -static-libs -systemd -test -utils -xml >net-misc/curl-8.0.1:0 -abi_mips_n32 -abi_mips_n64 -abi_mips_o32 -abi_s390_32 -abi_s390_64 -abi_x86_32 abi_x86_64 -abi_x86_x32 adns -alt-svc -brotli -curl_ssl_gnutls -curl_ssl_mbedtls -curl_ssl_nss curl_ssl_openssl -curl_ssl_rustls ftp -gnutls -gopher -hsts http2 -idn imap -kerberos -ldap -mbedtls -nghttp3 -nss openssl pop3 progress-meter -rtmp -rustls -samba smtp -ssh ssl -sslv3 -static-libs -telnet -test tftp -verify-sig -websockets -zstd >net-misc/dhcpcd-10.0.1:0 debug embedded ipv6 -privsep udev >net-misc/iputils-20221126-r1:0 arping -caps -clockdiff -doc filecaps -idn nls -test -tracepath >net-misc/netifrc-0.7.4:0 dhcp >net-misc/openssh-9.3_p1:0 -X -X509 -abi_mips_n32 -audit -debug -hpn -kerberos -ldns -libedit -livecd pam -pie -sctp -security-key -selinux ssl -static -test -verify-sig -xmss >net-misc/rsync-3.2.7-r2:0 acl -examples iconv -lz4 -python_single_target_python3_10 python_single_target_python3_11 -rrsync ssl -stunnel -system-zlib -verify-sig xattr -xxhash -zstd >net-misc/wget-1.21.3-r1:0 -cookie-check debug -gnutls -idn ipv6 -metalink nls -ntlm pcre ssl -static -test -uuid -verify-sig zlib >perl-core/File-Temp-0.231.100:0 >sec-keys/openpgp-keys-gentoo-release-20230329:0 -test >sys-apps/acl-2.3.1-r1:0 -abi_mips_n32 -abi_mips_n64 -abi_mips_o32 -abi_s390_32 -abi_s390_64 -abi_x86_32 abi_x86_64 -abi_x86_x32 nls split-usr -static-libs >sys-apps/attr-2.5.1-r2:0 -abi_mips_n32 -abi_mips_n64 -abi_mips_o32 -abi_s390_32 -abi_s390_64 -abi_x86_32 abi_x86_64 -abi_x86_x32 debug nls split-usr -static-libs >sys-apps/baselayout-2.13-r1:0 -build split-usr >sys-apps/coreutils-9.3-r1:0 acl -caps -gmp -hostname -kill -multicall nls openssl -selinux split-usr -static -test -vanilla -verify-sig xattr >sys-apps/dbus-1.15.4-r1:0 -X -abi_mips_n32 -abi_mips_n64 -abi_mips_o32 -abi_s390_32 -abi_s390_64 -abi_x86_32 abi_x86_64 -abi_x86_x32 debug -doc elogind -selinux -static-libs -systemd -test -test >sys-apps/debianutils-5.7:0 installkernel -static >sys-apps/diffutils-3.9-r1:0 nls -verify-sig >sys-apps/file-5.44-r3:0 -abi_mips_n32 -abi_mips_n64 -abi_mips_o32 -abi_s390_32 -abi_s390_64 -abi_x86_32 abi_x86_64 -abi_x86_x32 bzip2 -lzip -lzma -python python_targets_python3_10 python_targets_python3_11 -seccomp -static-libs -verify-sig zlib -zstd >sys-apps/findutils-4.9.0-r2:0 nls -selinux -static -test -verify-sig >sys-apps/gawk-5.2.1:0 -mpfr nls -pma readline -verify-sig >sys-apps/gentoo-functions-0.19:0 >sys-apps/grep-3.10:0 egrep-fgrep nls pcre -static -verify-sig >sys-apps/groff-1.22.4:0 -X -examples -uchardet >sys-apps/help2man-1.49.3:0 nls >sys-apps/install-xattr-0.8-r1:0 >sys-apps/iproute2-6.3.0:0 -atm -berkdb -bpf -caps -elf iptables -libbsd -minimal -nfs -selinux split-usr >sys-apps/kbd-2.5.1:0 nls pam -test >sys-apps/kmod-30-r1:0 debug -doc lzma -pkcs7 -python python_targets_python3_10 python_targets_python3_11 -static-libs tools zlib zstd >sys-apps/less-633:0 pcre >sys-apps/man-db-2.11.2:0 manpager nls seccomp -selinux -static-libs zlib >sys-apps/man-pages-6.04:0 l10n_cs l10n_da l10n_de l10n_el l10n_es l10n_fi l10n_fr l10n_hu l10n_id l10n_it l10n_ja l10n_mk l10n_nb l10n_nl l10n_pl l10n_pt-BR l10n_ro l10n_ru l10n_sr l10n_sv l10n_uk l10n_vi l10n_zh-CN >sys-apps/miscfiles-1.5-r4:0 -minimal >sys-apps/net-tools-2.10:0 arp hostname ipv6 -nis nls -plipconfig -selinux -slattach -static >sys-apps/openrc-0.47.1:0 -audit -bash debug ncurses netifrc -newnet pam -selinux -sysv-utils unicode >sys-apps/portage-3.0.47:0 -apidoc -build debug -doc -gentoo-dev ipc native-extensions python_targets_pypy3 python_targets_python3_10 python_targets_python3_11 rsync-verify -selinux -test xattr >sys-apps/sandbox-2.30-r1:0 -abi_mips_n32 -abi_mips_n64 -abi_mips_o32 -abi_s390_32 -abi_s390_64 abi_x86_32 abi_x86_64 -abi_x86_x32 nnp >sys-apps/sed-4.9:0 acl nls -selinux -static -verify-sig >sys-apps/shadow-4.13-r3:0/4 acl -audit -bcrypt -cracklib nls pam -selinux -skey split-usr -su -verify-sig xattr >sys-apps/systemd-utils-252.10:0 -abi_mips_n32 -abi_mips_n64 -abi_mips_o32 -abi_s390_32 -abi_s390_64 -abi_x86_32 abi_x86_64 -abi_x86_x32 acl -boot kmod -selinux split-usr -split-usr -sysusers -test tmpfiles udev >sys-apps/sysvinit-3.07:0 -ibm nls -selinux -static -verify-sig >sys-apps/texinfo-7.0.3:0 nls standalone -static >sys-apps/util-linux-2.38.1-r2:0 -abi_mips_n32 -abi_mips_n64 -abi_mips_o32 -abi_s390_32 -abi_s390_64 -abi_x86_32 abi_x86_64 -abi_x86_x32 -audit -build -caps cramfs -cryptsetup -fdformat hardlink -kill logger -magic ncurses nls pam -python python_targets_python3_10 python_targets_python3_11 readline -rtas -selinux -slang split-usr -static-libs su suid -systemd -test -tty-helpers -udev unicode -verify-sig >sys-apps/which-2.21:0 >sys-auth/elogind-246.10-r3:0 acl -audit cgroup-hybrid debug -doc pam policykit -selinux -test >sys-auth/pambase-20220214:0 -caps -debug elogind -gnome-keyring -homed -minimal -mktemp nullok -pam_krb5 -pam_ssh passwdqc -pwhistory -pwquality -securetty -selinux sha512 -systemd -yescrypt >sys-auth/passwdqc-2.0.2-r1:0 >sys-auth/polkit-122-r1:0 daemon duktape -examples -gtk introspection -kde pam -selinux -systemd -test >sys-devel/autoconf-2.71-r6:2.71 -emacs >sys-devel/autoconf-archive-2023.02.20:0 >sys-devel/autoconf-wrapper-20221207-r1:0 >sys-devel/automake-1.16.5-r1:1.16 -test >sys-devel/automake-wrapper-20221207:0 >sys-devel/bc-1.07.1-r6:0 -libedit readline -static >sys-devel/binutils-2.40-r5:2.40 -cet -doc -gold -gprofng multitarget nls -pgo plugins -static-libs -test -vanilla -zstd >sys-devel/binutils-config-5.5:0 -native-symlinks >sys-devel/bison-3.8.2-r2:0 -examples nls -static -test -verify-sig >sys-devel/flex-2.6.4-r6:0 -abi_mips_n32 -abi_mips_n64 -abi_mips_o32 -abi_s390_32 -abi_s390_64 -abi_x86_32 abi_x86_64 -abi_x86_x32 nls -static -test >sys-devel/gcc-13.1.0-r1:13 -ada -cet -custom-cflags cxx -d -debug -default-stack-clash-protection -default-znow -doc -fixed-point fortran -go graphite -hardened -ieee-long-double -jit -libssp lto -modula2 multilib nls nptl -objc -objc++ -objc-gc openmp -pch -pgo pie sanitize -ssp -systemtap -test -valgrind -vanilla -vtv -zstd >sys-devel/gcc-config-2.10:0 cc-wrappers -native-symlinks >sys-devel/gettext-0.21.1:0 -abi_mips_n32 -abi_mips_n64 -abi_mips_o32 -abi_s390_32 -abi_s390_64 -abi_x86_32 abi_x86_64 -abi_x86_x32 acl cxx -doc -emacs -git -java -java ncurses nls openmp -static-libs -verify-sig >sys-devel/gnuconfig-20230121:0 >sys-devel/libtool-2.4.7-r1:2 -vanilla >sys-devel/m4-1.4.19-r1:0 -examples nls -verify-sig >sys-devel/make-4.4.1:0 -guile nls -static -verify-sig >sys-devel/patch-2.7.6-r5:0 -static -test -verify-sig xattr >sys-fs/e2fsprogs-1.47.0-r1:0 -abi_mips_n32 -abi_mips_n64 -abi_mips_o32 -abi_s390_32 -abi_s390_64 -abi_x86_32 abi_x86_64 -abi_x86_x32 -cron -fuse nls split-usr -static-libs -test tools >sys-fs/udev-init-scripts-35:0 >sys-kernel/dracut-059:0 -selinux -test >sys-kernel/gentoo-kernel-bin-6.2.14:6.2.14 initramfs -test >sys-kernel/installkernel-gentoo-7:0 -grub >sys-kernel/linux-headers-6.3:0 -headers-only >sys-libs/gdbm-1.23:0/6 -abi_mips_n32 -abi_mips_n64 -abi_mips_o32 -abi_s390_32 -abi_s390_64 -abi_x86_32 abi_x86_64 -abi_x86_x32 berkdb nls readline -static-libs -test -verify-sig >sys-libs/glibc-2.37-r2:2.2 -audit -caps -cet -compile-locales -crypt -custom-cflags -doc -gd -hash-sysv-compat -headers-only multiarch multilib -multilib-bootstrap -nscd -perl -profile -selinux -ssp stack-realign static-libs -suid -systemd -systemtap -test -vanilla >sys-libs/libcap-2.68:0 -abi_mips_n32 -abi_mips_n64 -abi_mips_o32 -abi_s390_32 -abi_s390_64 -abi_x86_32 abi_x86_64 -abi_x86_x32 pam split-usr -static-libs -tools >sys-libs/libseccomp-2.5.4:0 -abi_mips_n32 -abi_mips_n64 -abi_mips_o32 -abi_s390_32 -abi_s390_64 -abi_x86_32 abi_x86_64 -abi_x86_x32 -experimental-loong -python python_targets_python3_10 python_targets_python3_11 -static-libs -test >sys-libs/libxcrypt-4.4.33:0/1 -abi_mips_n32 -abi_mips_n64 -abi_mips_o32 -abi_s390_32 -abi_s390_64 abi_x86_32 abi_x86_64 -abi_x86_x32 compat -headers-only split-usr -static-libs system -test >sys-libs/ncurses-6.4_p20230401:0/6 -abi_mips_n32 -abi_mips_n64 -abi_mips_o32 -abi_s390_32 -abi_s390_64 -abi_x86_32 abi_x86_64 -abi_x86_x32 -ada cxx debug -doc -gpm -minimal -profile split-usr -split-usr stack-realign -static-libs -test tinfo -trace -verify-sig >sys-libs/ncurses-compat-6.2:5/5 -abi_mips_n32 -abi_mips_n64 -abi_mips_o32 -abi_s390_32 -abi_s390_64 -abi_x86_32 abi_x86_64 -abi_x86_x32 -gpm split-usr tinfo unicode >sys-libs/pam-1.5.2-r3:0 -abi_mips_n32 -abi_mips_n64 -abi_mips_o32 -abi_s390_32 -abi_s390_64 -abi_x86_32 abi_x86_64 -abi_x86_x32 -audit -berkdb -debug filecaps -nis -selinux split-usr >sys-libs/readline-8.2_p1:0/8 -abi_mips_n32 -abi_mips_n64 -abi_mips_o32 -abi_s390_32 -abi_s390_64 -abi_x86_32 abi_x86_64 -abi_x86_x32 split-usr -static-libs unicode -utils -verify-sig >sys-libs/timezone-data-2023c:0 -leaps-timezone nls -zic-slim >sys-libs/zlib-1.2.13-r1:0/1 -abi_mips_n32 -abi_mips_n64 -abi_mips_o32 -abi_s390_32 -abi_s390_64 -abi_x86_32 abi_x86_64 -abi_x86_x32 minizip split-usr -static-libs -verify-sig >sys-process/procps-3.3.17-r1:0/8 -abi_mips_n32 -abi_mips_n64 -abi_mips_o32 -abi_s390_32 -abi_s390_64 -abi_x86_32 abi_x86_64 -abi_x86_x32 elogind kill -modern-top ncurses nls -selinux split-usr -static-libs -systemd -test unicode >sys-process/psmisc-23.6:0 -X -apparmor nls -selinux -test >virtual/acl-0-r2:0 -abi_mips_n32 -abi_mips_n64 -abi_mips_o32 -abi_s390_32 -abi_s390_64 -abi_x86_32 abi_x86_64 -abi_x86_x32 -static-libs >virtual/dev-manager-0-r2:0 >virtual/dist-kernel-6.2.14:0/6.2.14 >virtual/editor-0-r5:0 >virtual/libc-1-r1:0 >virtual/libcrypt-2-r1:0/2 -abi_mips_n32 -abi_mips_n64 -abi_mips_o32 -abi_s390_32 -abi_s390_64 abi_x86_32 abi_x86_64 -abi_x86_x32 -static-libs >virtual/libelf-3-r1:0/1 -abi_mips_n32 -abi_mips_n64 -abi_mips_o32 -abi_s390_32 -abi_s390_64 -abi_x86_32 abi_x86_64 -abi_x86_x32 >virtual/libiconv-0-r2:0 -abi_mips_n32 -abi_mips_n64 -abi_mips_o32 -abi_s390_32 -abi_s390_64 -abi_x86_32 abi_x86_64 -abi_x86_x32 >virtual/libintl-0-r2:0 -abi_mips_n32 -abi_mips_n64 -abi_mips_o32 -abi_s390_32 -abi_s390_64 -abi_x86_32 abi_x86_64 -abi_x86_x32 >virtual/libudev-232-r7:0/1 -abi_mips_n32 -abi_mips_n64 -abi_mips_o32 -abi_s390_32 -abi_s390_64 -abi_x86_32 abi_x86_64 -abi_x86_x32 -systemd >virtual/man-0-r4:0 >virtual/os-headers-0-r2:0 >virtual/package-manager-1:0 >virtual/pager-0-r1:0 >virtual/perl-Carp-1.520.0-r2:0 >virtual/perl-CPAN-2.330.0:0 >virtual/perl-CPAN-Meta-2.150.10-r6:0 >virtual/perl-CPAN-Meta-YAML-0.18.0-r8:0 >virtual/perl-Data-Dumper-2.184.0:0 >virtual/perl-Encode-3.170.0:0 >virtual/perl-Exporter-5.770.0:0 >virtual/perl-ExtUtils-CBuilder-0.280.236-r1:0 >virtual/perl-ExtUtils-Install-2.200.0-r1:0 >virtual/perl-ExtUtils-MakeMaker-7.640.0:0 >virtual/perl-ExtUtils-Manifest-1.730.0-r1:0 >virtual/perl-ExtUtils-ParseXS-3.450.0:0 >virtual/perl-File-Path-2.180.0-r1:0 >virtual/perl-File-Spec-3.840.0:0 >virtual/perl-File-Temp-0.231.100:0 >virtual/perl-Getopt-Long-2.520.0-r1:0 >virtual/perl-JSON-PP-4.70.0:0 >virtual/perl-libnet-3.140.0:0 ssl >virtual/perl-MIME-Base64-3.160.0-r1:0 >virtual/perl-Module-Metadata-1.0.37-r2:0 >virtual/perl-parent-0.238.0-r2:0 >virtual/perl-Parse-CPAN-Meta-2.150.10-r6:0 >virtual/perl-Perl-OSType-1.10.0-r6:0 >virtual/perl-podlators-4.140.0-r3:0 >virtual/perl-Scalar-List-Utils-1.620.0:0 >virtual/perl-Test-Harness-3.440.0:0 >virtual/perl-Text-ParseWords-3.310.0:0 >virtual/perl-version-0.992.900:0 >virtual/pkgconfig-2-r1:0 >virtual/service-manager-1-r1:0 >virtual/ssh-0-r1:0 -minimal >virtual/tmpfiles-0-r3:0 >virtual/ttf-fonts-1-r2:0 >virtual/udev-217-r5:0 >virtual/w3m-1:0 >www-client/pybugz-0.13-r2:0 python_targets_python3_10 python_targets_python3_11 >www-client/w3m-0.5.3_p20230121:0 -X -fbcon -gdk-pixbuf -gpm -imlib l10n_ja -lynxkeymap nls -nntp ssl unicode -xface >x11-apps/xprop-1.2.6:0 >x11-apps/xset-1.2.5:0 >x11-base/xcb-proto-1.15.2:0 python_targets_python3_10 python_targets_python3_11 >x11-base/xorg-proto-2022.2:0 -test >x11-libs/cairo-1.17.8:0 X -abi_mips_n32 -abi_mips_n64 -abi_mips_o32 -abi_s390_32 -abi_s390_64 -abi_x86_32 abi_x86_64 -abi_x86_x32 -aqua -debug glib -gtk-doc -test >x11-libs/libICE-1.1.1-r1:0 -abi_mips_n32 -abi_mips_n64 -abi_mips_o32 -abi_s390_32 -abi_s390_64 -abi_x86_32 abi_x86_64 -abi_x86_x32 >x11-libs/libSM-1.2.4:0 -abi_mips_n32 -abi_mips_n64 -abi_mips_o32 -abi_s390_32 -abi_s390_64 -abi_x86_32 abi_x86_64 -abi_x86_x32 -doc uuid >x11-libs/libX11-1.8.4-r1:0 -abi_mips_n32 -abi_mips_n64 -abi_mips_o32 -abi_s390_32 -abi_s390_64 -abi_x86_32 abi_x86_64 -abi_x86_x32 -doc -test >x11-libs/libXau-1.0.11:0 -abi_mips_n32 -abi_mips_n64 -abi_mips_o32 -abi_s390_32 -abi_s390_64 -abi_x86_32 abi_x86_64 -abi_x86_x32 -doc >x11-libs/libxcb-1.15-r1:0/1.12 -abi_mips_n32 -abi_mips_n64 -abi_mips_o32 -abi_s390_32 -abi_s390_64 -abi_x86_32 abi_x86_64 -abi_x86_x32 -doc -doc -selinux -test xkb >x11-libs/libXdmcp-1.1.4-r2:0 -abi_mips_n32 -abi_mips_n64 -abi_mips_o32 -abi_s390_32 -abi_s390_64 -abi_x86_32 abi_x86_64 -abi_x86_x32 -doc >x11-libs/libXext-1.3.5:0 -abi_mips_n32 -abi_mips_n64 -abi_mips_o32 -abi_s390_32 -abi_s390_64 -abi_x86_32 abi_x86_64 -abi_x86_x32 -doc >x11-libs/libXmu-1.1.4:0 -abi_mips_n32 -abi_mips_n64 -abi_mips_o32 -abi_s390_32 -abi_s390_64 -abi_x86_32 abi_x86_64 -abi_x86_x32 -doc >x11-libs/libXrender-0.9.11:0 -abi_mips_n32 -abi_mips_n64 -abi_mips_o32 -abi_s390_32 -abi_s390_64 -abi_x86_32 abi_x86_64 -abi_x86_x32 >x11-libs/libXt-1.3.0:0 -abi_mips_n32 -abi_mips_n64 -abi_mips_o32 -abi_s390_32 -abi_s390_64 -abi_x86_32 abi_x86_64 -abi_x86_x32 -doc -test >x11-libs/pixman-0.42.2:0 -abi_mips_n32 -abi_mips_n64 -abi_mips_o32 -abi_s390_32 -abi_s390_64 -abi_x86_32 abi_x86_64 -abi_x86_x32 -cpu_flags_arm_iwmmxt -cpu_flags_arm_iwmmxt2 -cpu_flags_arm_neon -cpu_flags_ppc_altivec cpu_flags_x86_mmxext cpu_flags_x86_sse2 cpu_flags_x86_ssse3 -loongson2f -static-libs -test >x11-libs/xtrans-1.4.0:0 -doc >x11-misc/compose-tables-1.8.4-r1:0 >x11-misc/shared-mime-info-2.2:0 -test >x11-misc/xdg-utils-1.1.3_p20210805-r1:0 -dbus -doc -gnome > > >####################### ># build.log # >####################### > >>>> Unpacking source... >>>> Unpacking v1.0.0rc4.tar.gz to /var/tmp/portage/app-office/lotus123r3-1.0.0_rc4/work >>>> Unpacking 123UNIX1.IMG to /var/tmp/portage/app-office/lotus123r3-1.0.0_rc4/work >unpack 123UNIX1.IMG: file format not recognized. Ignoring. >>>> Unpacking 123UNIX2.IMG to /var/tmp/portage/app-office/lotus123r3-1.0.0_rc4/work >unpack 123UNIX2.IMG: file format not recognized. Ignoring. >>>> Unpacking 123UNIX3.IMG to /var/tmp/portage/app-office/lotus123r3-1.0.0_rc4/work >unpack 123UNIX3.IMG: file format not recognized. Ignoring. >>>> Unpacking 123UNIX4.IMG to /var/tmp/portage/app-office/lotus123r3-1.0.0_rc4/work >unpack 123UNIX4.IMG: file format not recognized. Ignoring. >>>> Unpacking 123UNIX5.IMG to /var/tmp/portage/app-office/lotus123r3-1.0.0_rc4/work >unpack 123UNIX5.IMG: file format not recognized. Ignoring. >>>> Source unpacked in /var/tmp/portage/app-office/lotus123r3-1.0.0_rc4/work >>>> Preparing source in /var/tmp/portage/app-office/lotus123r3-1.0.0_rc4/work/123elf-1.0.0rc4 ... >==> Extracting 123UNIX1.IMG tar archive >./tmp/_lbl/prd=123/typ=n386/rel=1.0/vol=01 >./tmp/perms/123 >./usr/tmp/lotus_install/123/Install >./usr/tmp/lotus_install/123/messages >./usr/tmp/lotus_install/123/mk_banner >./usr/tmp/lotus_install/123/banner >./usr/tmp/lotus_install/123/chkdskno >./usr/tmp/lotus_install/123/combine_exe >./usr/tmp/lotus_install/123/copyright.d >./usr/tmp/lotus_install/123/filelist.1 >./usr/tmp/lotus_install/123/filelist.2 >./usr/tmp/lotus_install/123/filelist.3 >./usr/tmp/lotus_install/123/filelist.4 >./usr/tmp/lotus_install/123/filelist.5 >./tmp/init.123 >./lotus/123.v10/fonts/aa012lfa.lrf.z >./lotus/123.v10/fonts/aa012lha.lrf.z >./lotus/123.v10/fonts/aa017laa.lrf.z >./lotus/123.v10/fonts/aa017lia.lrf.z >./lotus/123.v10/fonts/aa024lfa.lrf.z >./lotus/123.v10/fonts/aa024lha.lrf.z >./lotus/123.v10/fonts/aa025laa.lrf.z >./lotus/123.v10/fonts/aa030laa.lrf.z >./lotus/123.v10/fonts/aa030lga.lrf.z >./lotus/123.v10/fonts/aa033laa.lrf.z >./lotus/123.v10/fonts/aa033lia.lrf.z >./lotus/123.v10/fonts/aa050laa.lrf.z >./lotus/123.v10/fonts/aa060laa.lrf.z >./lotus/123.v10/fonts/aa060lga.lrf.z >./lotus/123.v10/fonts/aa100laa.lrf.z >./lotus/123.v10/fonts/ac016lfa.lrf.z >./lotus/123.v10/fonts/ac016lha.lrf.z >./lotus/123.v10/fonts/ac017laa.lrf.z >./lotus/123.v10/fonts/ac022laa.lrf.z >./lotus/123.v10/fonts/ac022lia.lrf.z >./lotus/123.v10/fonts/ac033laa.lrf.z >./lotus/123.v10/fonts/ac040laa.lrf.z >./lotus/123.v10/fonts/ac040lga.lrf.z >./lotus/123.v10/fonts/ac066laa.lrf.z >./lotus/123.v10/fonts/ai012laa.lrf.z >./lotus/123.v10/fonts/ai012lfa.lrf.z >./lotus/123.v10/fonts/ai012lha.lrf.z >./lotus/123.v10/fonts/ai017laa.lrf.z >./lotus/123.v10/fonts/ai017lia.lrf.z >./lotus/123.v10/fonts/ai024lfa.lrf.z >./lotus/123.v10/fonts/ai024lha.lrf.z >./lotus/123.v10/fonts/ai025laa.lrf.z >./lotus/123.v10/fonts/ai030laa.lrf.z >./lotus/123.v10/fonts/ai030lga.lrf.z >./lotus/123.v10/fonts/ai033laa.lrf.z >./lotus/123.v10/fonts/ai033lia.lrf.z >./lotus/123.v10/fonts/ai050laa.lrf.z >./lotus/123.v10/fonts/ai060laa.lrf.z >./lotus/123.v10/fonts/ai060lga.lrf.z >./lotus/123.v10/fonts/ai100laa.lrf.z >./lotus/123.v10/fonts/aj016lfa.lrf.z >./lotus/123.v10/fonts/aj016lha.lrf.z >./lotus/123.v10/fonts/aj017laa.lrf.z >./lotus/123.v10/fonts/aj022laa.lrf.z >./lotus/123.v10/fonts/aj022lia.lrf.z >./lotus/123.v10/fonts/aj033laa.lrf.z >./lotus/123.v10/fonts/aj040laa.lrf.z >./lotus/123.v10/fonts/aj040lga.lrf.z >./lotus/123.v10/fonts/aj066laa.lrf.z >./lotus/123.v10/fonts/bc008lba.lrf.z >./lotus/123.v10/fonts/bc010lba.lrf.z >./lotus/123.v10/fonts/bc012lea.lrf.z >./lotus/123.v10/fonts/bc014lda.lrf.z >./lotus/123.v10/fonts/bc016lba.lrf.z >./lotus/123.v10/fonts/bc016lca.lrf.z >./lotus/123.v10/fonts/bc016lda.lrf.z >./lotus/123.v10/fonts/bc018lba.lrf.z >./lotus/123.v10/fonts/bc021laa.lrf.z >./lotus/123.v10/fonts/bc031lca.lrf.z >./lotus/123.v10/fonts/bc031lda.lrf.z >./lotus/123.v10/fonts/bc042laa.lrf.z >./lotus/123.v10/fonts/bo008lda.lrf.z >./lotus/123.v10/fonts/bo014lca.lrf.z >./lotus/123.v10/fonts/bo014lda.lrf.z >./lotus/123.v10/fonts/bo016lba.lrf.z >./lotus/123.v10/fonts/bo019laa.lrf.z >./lotus/123.v10/fonts/aa012laa.lrf.z >./lotus/123.v10/pbd/egas25ci.vbd.z >./lotus/123.v10/pbd/egas25cs.vbd.z >./lotus/123.v10/pbd/egas25la.vbd.z >./lotus/123.v10/pbd/egas25li.vbd.z >./lotus/123.v10/pbd/egas25ls.vbd.z >./lotus/123.v10/pbd/egas25ma.vbd.z >./lotus/123.v10/pbd/egas25mi.vbd.z >./lotus/123.v10/pbd/egas25ms.vbd.z >./lotus/123.v10/pbd/egas25pa.vbd.z >./lotus/123.v10/pbd/egas25pi.vbd.z >./lotus/123.v10/pbd/egas25ps.vbd.z >./lotus/123.v10/pbd/egas43ca.vbd.z >./lotus/123.v10/pbd/egas43ci.vbd.z >./lotus/123.v10/pbd/egas43cs.vbd.z >./lotus/123.v10/pbd/egas43ma.vbd.z >./lotus/123.v10/pbd/egas43mi.vbd.z >./lotus/123.v10/pbd/egas43ms.vbd.z >./lotus/123.v10/pbd/egas43pa.vbd.z >./lotus/123.v10/pbd/egas43pi.vbd.z >./lotus/123.v10/pbd/egas43ps.vbd.z >./lotus/123.v10/pbd/epdtfx.pbd.z >./lotus/123.v10/pbd/epdtmx.pbd.z >./lotus/123.v10/pbd/eplql15p.pbd.z >./lotus/123.v10/pbd/eplql25m.pbd.z >./lotus/123.v10/pbd/eplql25p.pbd.z >./lotus/123.v10/pbd/eplql2mc.pbd.z >./lotus/123.v10/pbd/eplql2pc.pbd.z >./lotus/123.v10/pbd/eplql80m.pbd.z >./lotus/123.v10/pbd/eplql80p.pbd.z >./lotus/123.v10/pbd/hplj1jlo.pbd.z >./lotus/123.v10/pbd/gc_bs.pbd >./lotus/123.v10/pbd/gc_nobs.pbd >./lotus/123.v10/pbd/hplj1flo.pbd >./lotus/123.v10/pbd/hplj1zlo.pbd.z >./lotus/123.v10/pbd/hplj1nol.pbd >./lotus/123.v10/pbd/hplj2fhi.pbd.z >./lotus/123.v10/pbd/hplj2flo.pbd.z >./lotus/123.v10/pbd/hplj2jhi.pbd.z >./lotus/123.v10/pbd/hplj2jlo.pbd.z >./lotus/123.v10/pbd/hplj2noh.pbd.z >./lotus/123.v10/pbd/hpljnolo.pbd.z >./lotus/123.v10/pbd/hpljpfhi.pbd.z >./lotus/123.v10/pbd/hpljpflo.pbd.z >./lotus/123.v10/pbd/hpljpjhi.pbd.z >./lotus/123.v10/pbd/hpljpjlo.pbd.z >./lotus/123.v10/pbd/hpljpnoh.pbd.z >./lotus/123.v10/pbd/hpljpnol.pbd.z >./lotus/123.v10/pbd/hpljzhi.pbd.z >./lotus/123.v10/pbd/hpljzlo.pbd.z >./lotus/123.v10/pbd/hppjpapr.pbd.z >./lotus/123.v10/pbd/hppjtran.pbd.z >./lotus/123.v10/pbd/hrcf25ma.vbd.z >./lotus/123.v10/pbd/hrcf25mi.vbd.z >./lotus/123.v10/pbd/hrcf25ms.vbd.z >./lotus/123.v10/pbd/ps00alw0.pbd.z >./lotus/123.v10/pbd/hrcs43ma.vbd >./lotus/123.v10/pbd/hrcs43mi.vbd >./lotus/123.v10/pbd/hrcs43ms.vbd >./lotus/123.v10/pbd/ps00alwp.pbd.z >./lotus/123.v10/pbd/vgas25ca.vbd.z >./lotus/123.v10/pbd/vgas25ci.vbd.z >./lotus/123.v10/pbd/vgas25cs.vbd.z >./lotus/123.v10/pbd/vgas25ma.vbd.z >./lotus/123.v10/pbd/vgas25mi.vbd.z >./lotus/123.v10/pbd/vgas25ms.vbd.z >./lotus/123.v10/pbd/vgas34ca.vbd.z >./lotus/123.v10/pbd/vgas34ci.vbd.z >./lotus/123.v10/pbd/vgas34cs.vbd.z >./lotus/123.v10/pbd/vgas34ma.vbd.z >./lotus/123.v10/pbd/vgas34mi.vbd.z >./lotus/123.v10/pbd/vgas43ms.vbd.z >./lotus/123.v10/pbd/vgas60ca.vbd.z >./lotus/123.v10/pbd/vgas60ci.vbd.z >./lotus/123.v10/pbd/vgas60cs.vbd.z >./lotus/123.v10/pbd/vgas60ma.vbd.z >./lotus/123.v10/pbd/vgas60mi.vbd.z >./lotus/123.v10/pbd/egas25ca.vbd.z >./lotus/123.v10/smpfiles/intro/houston.wk3.z >./lotus/123.v10/smpfiles/intro/debugmac.wk3 >./lotus/123.v10/smpfiles/intro/less1ex2.wk3.z >./lotus/123.v10/smpfiles/intro/less1ex1.wk3 >./lotus/123.v10/smpfiles/intro/less2ex1.wk3.z >./lotus/123.v10/smpfiles/intro/less3ex2.wk3.z >./lotus/123.v10/smpfiles/intro/less2ex2.wk3 >./lotus/123.v10/smpfiles/intro/less4ex1.wk3.z >./lotus/123.v10/smpfiles/intro/less4ex2.wk3.z >./lotus/123.v10/smpfiles/intro/less5ex1.wk3.z >./lotus/123.v10/smpfiles/intro/less5ex2.wk3.z >./lotus/123.v10/smpfiles/intro/less5ex3.wk3.z >./lotus/123.v10/smpfiles/intro/less6ex1.wk3.z >./lotus/123.v10/smpfiles/intro/less6ex2.wk3.z >./lotus/123.v10/smpfiles/intro/less7ex1.wk3.z >./lotus/123.v10/smpfiles/intro/less7ex2.wk3.z >./lotus/123.v10/smpfiles/intro/less8ex2.wk3.z >./lotus/123.v10/smpfiles/intro/mis.wk3.z >./lotus/123.v10/smpfiles/intro/less9ex1.wk3 >./lotus/123.v10/smpfiles/intro/macros.wk3 >./lotus/123.v10/smpfiles/intro/menuexam.wk3 >./lotus/123.v10/smpfiles/intro/menumac.wk3 >./lotus/123.v10/smpfiles/intro/nyc.wk3.z >./lotus/123.v10/smpfiles/intro/mlibrary.wk3 >./lotus/123.v10/smpfiles/intro/parts.wk3.z >./lotus/123.v10/smpfiles/intro/planning.wk3.z >./lotus/123.v10/smpfiles/intro/q2graph2.wk3.z >./lotus/123.v10/smpfiles/intro/q2graph.wk3 >./lotus/123.v10/smpfiles/intro/q2inc2.wk3.z >./lotus/123.v10/smpfiles/intro/q2inc.wk3 >./lotus/123.v10/smpfiles/intro/q2mac.wk3.z >./lotus/123.v10/smpfiles/intro/q2macro.wk3.z >./lotus/123.v10/smpfiles/intro/q2price.wk3.z >./lotus/123.v10/smpfiles/intro/research.wk3.z >./lotus/123.v10/smpfiles/intro/sanfran.wk3.z >./lotus/123.v10/smpfiles/intro/salary.wk3 >./lotus/123.v10/smpfiles/intro/supplier.wk3.z >./lotus/123.v10/smpfiles/intro/chicago.wk3.z >./lotus/123.v10/smpfiles/nf/actual.wk3.z >./lotus/123.v10/smpfiles/nf/asset.wk3.z >./lotus/123.v10/smpfiles/nf/budget.wk3.z >./lotus/123.v10/smpfiles/nf/bud91.wk3 >./lotus/123.v10/smpfiles/nf/calcex.wk3.z >./lotus/123.v10/smpfiles/nf/consol.wk3.z >./lotus/123.v10/smpfiles/nf/data.wk3.z >./lotus/123.v10/smpfiles/nf/dataex.wk3.z >./lotus/123.v10/smpfiles/nf/datatab.wk3.z >./lotus/123.v10/smpfiles/nf/dattim.wk3.z >./lotus/123.v10/smpfiles/nf/dept_emp.wk3.z >./lotus/123.v10/smpfiles/nf/deptexp.wk3.z >./lotus/123.v10/smpfiles/nf/dfillex.wk3.z >./lotus/123.v10/smpfiles/nf/deptname.wk3 >./lotus/123.v10/smpfiles/nf/graphex.wk3.z >./lotus/123.v10/smpfiles/nf/hotel90.wk3.z >./lotus/123.v10/smpfiles/nf/hotel_q1.wk1.z >./lotus/123.v10/smpfiles/nf/hotel_q2.wk1.z >./lotus/123.v10/smpfiles/nf/hotel_q3.wk1.z >./lotus/123.v10/smpfiles/nf/hotel_q4.wk1.z >./lotus/123.v10/smpfiles/nf/joinex.wk3.z >./lotus/123.v10/smpfiles/nf/macex.wk3.z >./lotus/123.v10/smpfiles/nf/macros.wk3.z >./lotus/123.v10/smpfiles/nf/mfg.wk3.z >./lotus/123.v10/smpfiles/nf/mis.wk1.z >./lotus/123.v10/smpfiles/nf/planning.wk1.z >./lotus/123.v10/smpfiles/nf/print.wk3.z >./lotus/123.v10/smpfiles/nf/print_bw.wk3.z >./lotus/123.v10/smpfiles/nf/printex.wk3.z >./lotus/123.v10/smpfiles/nf/q2price.wk3.z >./lotus/123.v10/smpfiles/nf/research.wk1.z >./lotus/123.v10/smpfiles/nf/rev-1.wk3.z >./lotus/123.v10/smpfiles/nf/rev-2.wk3.z >./lotus/123.v10/smpfiles/nf/sales.wk3.z >./lotus/123.v10/smpfiles/nf/salary.wk3 >./lotus/123.v10/smpfiles/nf/shoes.wk3.z >./lotus/123.v10/smpfiles/nf/shoes_bw.wk3.z >./lotus/123.v10/smpfiles/nf/summary.wk3.z >./lotus/123.v10/smpfiles/nf/tables.wk3.z >./lotus/123.v10/smpfiles/nf/temp.wk3.z >./lotus/123.v10/smpfiles/nf/util.wk3.z >./lotus/123.v10/smpfiles/nf/world.wk3.z >./lotus/123.v10/smpfiles/nf/acctg.wk3.z >==> Extracting 123UNIX2.IMG cpio archive >lotus/log >lotus/man/cat.LOCAL >lotus/man/man1 >lotus/man >lotus/123.v10/cbd >lotus/123.v10/fonts >lotus/123.v10/hlp/USA-English >lotus/123.v10/hlp >lotus/123.v10/keymaps/a >lotus/123.v10/keymaps/b >lotus/123.v10/keymaps/c >lotus/123.v10/keymaps/d >lotus/123.v10/keymaps/e >lotus/123.v10/keymaps/f >lotus/123.v10/keymaps/g >lotus/123.v10/keymaps/h >lotus/123.v10/keymaps/i >lotus/123.v10/keymaps/j >lotus/123.v10/keymaps/k >lotus/123.v10/keymaps/l >lotus/123.v10/keymaps/m >lotus/123.v10/keymaps/n >lotus/123.v10/keymaps/o >lotus/123.v10/keymaps/p >lotus/123.v10/keymaps/q >lotus/123.v10/keymaps/r >lotus/123.v10/keymaps/s >lotus/123.v10/keymaps/t >lotus/123.v10/keymaps/u >lotus/123.v10/keymaps/v >lotus/123.v10/keymaps/w >lotus/123.v10/keymaps/x >lotus/123.v10/keymaps/y >lotus/123.v10/keymaps/z >lotus/123.v10/keymaps/A >lotus/123.v10/keymaps/B >lotus/123.v10/keymaps/C >lotus/123.v10/keymaps/D >lotus/123.v10/keymaps/E >lotus/123.v10/keymaps/F >lotus/123.v10/keymaps/G >lotus/123.v10/keymaps/H >lotus/123.v10/keymaps/I >lotus/123.v10/keymaps/J >lotus/123.v10/keymaps/K >lotus/123.v10/keymaps/L >lotus/123.v10/keymaps/M >lotus/123.v10/keymaps/N >lotus/123.v10/keymaps/O >lotus/123.v10/keymaps/P >lotus/123.v10/keymaps/Q >lotus/123.v10/keymaps/R >lotus/123.v10/keymaps/S >lotus/123.v10/keymaps/T >lotus/123.v10/keymaps/U >lotus/123.v10/keymaps/V >lotus/123.v10/keymaps/W >lotus/123.v10/keymaps/X >lotus/123.v10/keymaps/Y >lotus/123.v10/keymaps/Z >lotus/123.v10/keymaps >lotus/123.v10/pbd >lotus/123.v10/ri/USA-English >lotus/123.v10/ri >lotus/123.v10/smpfiles/intro >lotus/123.v10/smpfiles/INTRO >lotus/123.v10/smpfiles/nf >lotus/123.v10/smpfiles/NF >lotus/123.v10/smpfiles >lotus/123.v10/sysV386/123lic.v10 >lotus/123.v10/sysV386/bin >lotus/123.v10/sysV386/dvr >lotus/123.v10/sysV386/lib >lotus/123.v10/sysV386 >lotus/123.v10 >lotus >lotus/man/cat.LOCAL/123.LOCAL.z >lotus/man/cat.LOCAL/inst_dl.1.z >lotus/man/cat.LOCAL/keyedit.1.z >lotus/man/cat.LOCAL/inst_dl.LOCAL >lotus/man/cat.LOCAL/setup123.1.z >lotus/man/cat.LOCAL/keyedit.LOCAL >lotus/man/cat.LOCAL/setup123.LOCAL >lotus/man/cat.LOCAL/123.1.z >lotus/man/man1/inst_dl.1 >lotus/man/man1/keyedit.1 >lotus/man/man1/setup123.1 >lotus/man/man1/123.1.z >lotus/123.v10/hlp/USA-English/123_sysV.hlp.z >lotus/123.v10/hlp/USA-English/keyedit.hlp.z >lotus/123.v10/hlp/USA-English/setup123.hlp.z >lotus/123.v10/ri/USA-English/keyedit.ri.z >lotus/123.v10/ri/USA-English/123.ri.z >lotus/123.v10/ri/USA-English/l123txt3.ri.z >lotus/123.v10/ri/USA-English/dr123txt.ri >lotus/123.v10/ri/USA-English/inst_dl.ri >lotus/123.v10/ri/USA-English/license.ri.z >lotus/123.v10/ri/USA-English/l123smp3.ri >lotus/123.v10/ri/USA-English/printer.ri.z >lotus/123.v10/ri/USA-English/prsetup.ri.z >lotus/123.v10/ri/USA-English/setup123.ri.z >lotus/123.v10/cbd/dfbcp850.bun.z >lotus/123.v10/cbd/l_ascii.bun.z >lotus/123.v10/cbd/l13cUSA3.cbd >lotus/123.v10/cbd/l13cUSF3.cbd >lotus/123.v10/cbd/l13cUSL3.cbd >lotus/123.v10/cbd/l_latin1.bun.z >lotus/123.v10/cbd/l_lrf.bun.z >lotus/123.v10/cbd/dfbcp437.bun.z >lotus/123.v10/keymaps/s/sun.z >lotus/123.v10/keymaps/s/sysV386-101.z >lotus/123.v10/keymaps/s/sysV386-xterm >lotus/123.v10/keymaps/s/sco386-101.z >lotus/123.v10/keymaps/v/vtxxx.z >lotus/123.v10/keymaps/v/vt100.z >lotus/123.v10/keymaps/w/wyse50.z >lotus/123.v10/keymaps/w/wyse50-lts123 >lotus/123.v10/keymaps/w/wyse-pce.z >lotus/123.v10/keymaps/A/AT386.z >lotus/123.v10/keymaps/P/PC-NFS.z >lotus/123.v10/smpfiles/ACCTG.WK3.z >lotus/123.v10/smpfiles/CONSOL.WK3.z >lotus/123.v10/smpfiles/DATA.WK3.z >lotus/123.v10/smpfiles/DBT13S.WK3.z >lotus/123.v10/smpfiles/DBT14S.WK3.z >lotus/123.v10/smpfiles/INC10S.WK3.z >lotus/123.v10/smpfiles/INC11S.WK3.z >lotus/123.v10/smpfiles/INC12S.WK3.z >lotus/123.v10/smpfiles/INC16S.WK3.z >lotus/123.v10/smpfiles/INC2S.WK3 >lotus/123.v10/smpfiles/INC4S.WK3 >lotus/123.v10/smpfiles/INC5S.WK3.z >lotus/123.v10/smpfiles/INC6S.WK3 >lotus/123.v10/smpfiles/INC7S.WK3.z >lotus/123.v10/smpfiles/INC8S.WK3.z >lotus/123.v10/smpfiles/INC9S.WK3.z >lotus/123.v10/smpfiles/MAC17S.WK3.z >lotus/123.v10/smpfiles/MFG.WK3 >lotus/123.v10/smpfiles/SALES.WK3 >lotus/123.v10/smpfiles/SAMPMACS.WK3.z >lotus/123.v10/smpfiles/SHOES.WK3.z >lotus/123.v10/smpfiles/SMPSCHED.WK3.z >lotus/123.v10/smpfiles/SUM1988S.WK3.z >lotus/123.v10/smpfiles/SUMMARY.WK3 >lotus/123.v10/smpfiles/TABLES.WK3.z >lotus/123.v10/smpfiles/consale.wk1.z >lotus/123.v10/smpfiles/consale.wk3.z >lotus/123.v10/smpfiles/consaler.wk1.z >lotus/123.v10/smpfiles/income.wk3.z >lotus/123.v10/smpfiles/income2.wk3.z >lotus/123.v10/smpfiles/income3.wk3.z >lotus/123.v10/smpfiles/income4.wk3.z >lotus/123.v10/smpfiles/incomer.wk3.z >lotus/123.v10/smpfiles/menu2.wk3.z >lotus/123.v10/smpfiles/menu3.wk3.z >lotus/123.v10/smpfiles/menu4.wk3.z >1555 blocks >==> Extracting 123UNIX3.IMG cpio archive >lotus/123.v10/sysV386/lotus.bcf >lotus/123.v10/sysV386/lib/wyse50-lts123 >lotus/123.v10/sysV386/bin/123.sh.z >lotus/123.v10/sysV386/bin/123_exe.z >lotus/123.v10/sysV386/bin/keyedit.z >lotus/123.v10/sysV386/bin/l13pbanr.z >lotus/123.v10/sysV386/bin/l13pupif.z >lotus/123.v10/sysV386/bin/prsetup123.z >lotus/123.v10/sysV386/bin/setup123_exe.z >2606 blocks >==> Seeking into 123UNIX4.IMG to extract cpio archive >lotus/123.v10/sysV386/lib/123.o.z_2 >1434 blocks >==> Extracting 123UNIX5.IMG cpio archive >lotus/123.v10/sysV386/bin/inst_dl.z >lotus/123.v10/sysV386/lib/ld.z >lotus/123.v10/sysV386/lib/tail.o >lotus/123.v10/sysV386/lib/mkdlobj.z >lotus/123.v10/sysV386/lib/dl_init.o.z >lotus/123.v10/sysV386/lib/stub.o >lotus/123.v10/sysV386/lib/123.o.z_1 >2481 blocks >==> Reconstructing object file >==> Uncompressing .z files >==> Uncompressing and copying remaining object files >==> Copying the banner template over >'/var/tmp/portage/app-office/lotus123r3-1.0.0_rc4/work/123elf-1.0.0rc4/share/usr/tmp/lotus_install/123/banner' -> '/var/tmp/portage/app-office/lotus123r3-1.0.0_rc4/work/123elf-1.0.0rc4/share/lotus/123.v10/ri/USA-English/123ban.ri' >==> Copying default config file >/usr/bin/install: creating directory '/var/tmp/portage/app-office/lotus123r3-1.0.0_rc4/work/123elf-1.0.0rc4/share/lotus/etc' >'l123set.cf' -> '/var/tmp/portage/app-office/lotus123r3-1.0.0_rc4/work/123elf-1.0.0rc4/share/lotus/etc/l123set.cf' >==> Copying man page >/usr/bin/install: creating directory '/var/tmp/portage/app-office/lotus123r3-1.0.0_rc4/work/123elf-1.0.0rc4/share/man' >/usr/bin/install: creating directory '/var/tmp/portage/app-office/lotus123r3-1.0.0_rc4/work/123elf-1.0.0rc4/share/man/man1' >'/var/tmp/portage/app-office/lotus123r3-1.0.0_rc4/work/123elf-1.0.0rc4/share/lotus/man/man1/123.1' -> '/var/tmp/portage/app-office/lotus123r3-1.0.0_rc4/work/123elf-1.0.0rc4/share/man/man1/123.1' >>>> Source prepared. >>>> Configuring source in /var/tmp/portage/app-office/lotus123r3-1.0.0_rc4/work/123elf-1.0.0rc4 ... >>>> Source configured. >>>> Compiling source in /var/tmp/portage/app-office/lotus123r3-1.0.0_rc4/work/123elf-1.0.0rc4 ... >make -j28 >x86_64-pc-linux-gnu-gcc -freg-struct-return -W -Wall -m32 -O2 -fno-stack-protector -I. -D_FILE_OFFSET_BITS=64 -D_TIME_BITS=64 -D_GNU_SOURCE -I atfuncs -I ttydraw -Wno-unused-parameter -freg-struct-return -W -Wall -m32 -O2 -fno-stack-protector -lc -B. -Wl,-b,coff-i386 -no-pie coffsyrup.c -lncurses -ltinfo -lm -o coffsyrup >/bin/sh: line 1: objdump: command not found >objcopy -I coff-i386 -O coff-i386 --wildcard --localize-symbols=localize.lst --globalize-symbols=globalize.lst --redefine-syms=redefine.lst --add-symbol fmt_cpy=.text:0x6e530,function,local orig/dl_init.o dl_init.o >make: objcopy: No such file or directory >make: *** [Makefile:47: dl_init.o] Error 127 >make: *** Waiting for unfinished jobs.... >Your version of binutils was compiled without coff-i386 target support. >You can try running ./binutils.sh to build a version that does support it. >make: *** [Makefile:35: check] Error 1 >coffsyrup.c: In function âmainâ: >coffsyrup.c:93:5: warning: ignoring return value of â-Wunused-result][]] > 93 | fread(&opt, sizeof opt, 1, infile); > | ^~~~~~~~~~~~~~~~~~~~~~~~~~~~~~~~~~ >/usr/lib/gcc/x86_64-pc-linux-gnu/13/../../../../x86_64-pc-linux-gnu/bin/ld: cannot find -lncurses: No such file or directory >/usr/lib/gcc/x86_64-pc-linux-gnu/13/../../../../x86_64-pc-linux-gnu/bin/ld: cannot find -ltinfo: No such file or directory >collect2: error: ld returned 1 exit status >make: *** [<builtin>: coffsyrup] Error 1 > * ERROR: app-office/lotus123r3-1.0.0_rc4::guru failed (compile phase): > * emake failed > * > * If you need support, post the output of `emerge --info '=app-office/lotus123r3-1.0.0_rc4::guru'`, > * the complete build log and the output of `emerge -pqv '=app-office/lotus123r3-1.0.0_rc4::guru'`. > * The complete build log is located at '/var/log/emerge-log/build/app-office/lotus123r3-1.0.0_rc4:20230506-143557.log'. > * For convenience, a symlink to the build log is located at '/var/tmp/portage/app-office/lotus123r3-1.0.0_rc4/temp/build.log'. > * The ebuild environment file is located at '/var/tmp/portage/app-office/lotus123r3-1.0.0_rc4/temp/environment'. > * Working directory: '/var/tmp/portage/app-office/lotus123r3-1.0.0_rc4/work/123elf-1.0.0rc4' > * S: '/var/tmp/portage/app-office/lotus123r3-1.0.0_rc4/work/123elf-1.0.0rc4' >
You cannot view the attachment while viewing its details because your browser does not support IFRAMEs.
View the attachment on a separate page
.
View Attachment As Raw
Actions:
View
Attachments on
bug 905832
: 861236