Go to:
Gentoo Home
Documentation
Forums
Lists
Bugs
Planet
Store
Wiki
Get Gentoo!
Gentoo's Bugzilla – Attachment 851108 Details for
Bug 894386
dev-util/ltrace-0.7.3.6.1 fails tests (HARDENED-SYSTEM)
Home
|
New
–
[Ex]
|
Browse
|
Search
|
Privacy Policy
|
[?]
|
Reports
|
Requests
|
Help
|
New Account
|
Log In
[x]
|
Forgot Password
Login:
[x]
build.log
build.log (text/plain), 137.39 KB, created by
Agostino Sarubbo
on 2023-02-14 13:12:00 UTC
(
hide
)
Description:
build.log
Filename:
MIME Type:
Creator:
Agostino Sarubbo
Created:
2023-02-14 13:12:00 UTC
Size:
137.39 KB
patch
obsolete
> * Package: dev-util/ltrace-0.7.3.6.1:0 > * Repository: gentoo > * Maintainer: marecki@gentoo.org > * USE: abi_x86_64 amd64 debug elibc_glibc kernel_linux test userland_GNU > * FEATURES: network-sandbox preserve-libs sandbox test userpriv usersandbox > > >@@@@@ PLEASE PAY ATTENTION HERE!!! @@@@@ >This information may help you to understand if this is a duplicate or if this bug exists after you pushed a fix; >This ebuild was merged at the following commit: >https://github.com/gentoo-mirror/gentoo/commit/4520b7316c16594a959ef304429c0e0b84895d79 (Tue Feb 14 10:02:05 UTC 2023) >@@@@@ END @@@@@ > > > >################## ># emerge --info: # >################## >Portage 3.0.44 (python 3.11.2-final-0, default/linux/amd64/17.1/hardened, gcc-12, glibc-2.36-r7, 5.15.85-gentoo-dist x86_64) >================================================================= >System uname: Linux-5.15.85-gentoo-dist-x86_64-AMD_EPYC_7513_32-Core_Processor-with-glibc2.36 >KiB Mem: 263532996 total, 16221860 free >KiB Swap: 0 total, 0 free >Timestamp of repository gentoo: Tue, 14 Feb 2023 10:02:05 +0000 >sh bash 5.2_p15-r2 >ld GNU ld (Gentoo 2.40 p2) 2.40.0 >app-misc/pax-utils: 1.3.7::gentoo >app-shells/bash: 5.2_p15-r2::gentoo >dev-lang/perl: 5.36.0-r2::gentoo >dev-lang/python: 3.9.16-r1::gentoo, 3.10.10::gentoo, 3.11.2::gentoo >dev-util/cmake: 3.25.2::gentoo >dev-util/meson: 1.0.0::gentoo >sys-apps/baselayout: 2.13-r1::gentoo >sys-apps/openrc: 0.46::gentoo >sys-apps/sandbox: 2.30-r1::gentoo >sys-devel/autoconf: 2.71-r5::gentoo >sys-devel/automake: 1.16.5::gentoo >sys-devel/binutils: 2.40-r1::gentoo >sys-devel/binutils-config: 5.5::gentoo >sys-devel/gcc: 12.2.1_p20230121-r1::gentoo >sys-devel/gcc-config: 2.10::gentoo >sys-devel/libtool: 2.4.7-r1::gentoo >sys-devel/make: 4.4::gentoo >sys-kernel/linux-headers: 6.1::gentoo (virtual/os-headers) >sys-libs/glibc: 2.36-r7::gentoo >Repositories: > >gentoo > location: /usr/portage > sync-type: rsync > sync-uri: rsync://rsync.gentoo.org/gentoo-portage > priority: -1000 > volatile: True > sync-rsync-verify-max-age: 24 > sync-rsync-verify-jobs: 1 > sync-rsync-extra-opts: > sync-rsync-verify-metamanifest: yes > >ACCEPT_KEYWORDS="amd64 ~amd64" >ACCEPT_LICENSE="* GPL-2" >CBUILD="x86_64-pc-linux-gnu" >CFLAGS="-O2 -march=x86-64 -pipe -pipe -frecord-gcc-switches -fno-diagnostics-color -fmessage-length=0" >CHOST="x86_64-pc-linux-gnu" >CONFIG_PROTECT="/etc /usr/share/gnupg/qualified.txt" >CONFIG_PROTECT_MASK="/etc/ca-certificates.conf /etc/env.d /etc/fonts/fonts.conf /etc/gconf /etc/gentoo-release /etc/revdep-rebuild /etc/sandbox.d /etc/terminfo" >CXXFLAGS="-O2 -march=x86-64 -pipe -pipe -frecord-gcc-switches -fno-diagnostics-color -fmessage-length=0" >DISTDIR="/var/tmp/portage/dev-util/ltrace-0.7.3.6.1/distdir" >EMERGE_DEFAULT_OPTS="--with-bdeps=y -1 -k -b" >ENV_UNSET="CARGO_HOME DBUS_SESSION_BUS_ADDRESS DISPLAY GDK_PIXBUF_MODULE_FILE GOBIN GOPATH PERL5LIB PERL5OPT PERLPREFIX PERL_CORE PERL_MB_OPT PERL_MM_OPT XAUTHORITY XDG_CACHE_HOME XDG_CONFIG_HOME XDG_DATA_HOME XDG_RUNTIME_DIR XDG_STATE_HOME" >FCFLAGS="-O2 -march=x86-64 -pipe -pipe -frecord-gcc-switches -fno-diagnostics-color -fmessage-length=0" >FEATURES="assume-digests binpkg-docompress binpkg-dostrip binpkg-logs binpkg-multi-instance buildpkg buildpkg-live config-protect-if-modified distlocks ebuild-locks fixlafiles ipc-sandbox merge-sync multilib-strict network-sandbox news parallel-fetch pid-sandbox preserve-libs protect-owned qa-unresolved-soname-deps sandbox sfperms sign split-log strict test unknown-features-warn unmerge-logs unmerge-orphans userfetch userpriv usersandbox usersync xattr" >FFLAGS="-O2 -march=x86-64 -pipe -pipe -frecord-gcc-switches -fno-diagnostics-color -fmessage-length=0" >GENTOO_MIRRORS="http://mirror.leaseweb.com/gentoo/ http://ftp.snt.utwente.nl/pub/os/linux/gentoo/ http://ftp.belnet.be/pub/rsync.gentoo.org/gentoo/ http://distfiles.gentoo.org" >LANG="C.UTF8" >LDFLAGS="-Wl,-O1 -Wl,--as-needed -Wl,--defsym=__gentoo_check_ldflags__=0" >LEX="flex" >MAKEOPTS="-j16" >PKGDIR="/root/tbci/binpkg" >PORTAGE_CONFIGROOT="/" >PORTAGE_RSYNC_OPTS="--recursive --links --safe-links --perms --times --omit-dir-times --compress --force --whole-file --delete --stats --human-readable --timeout=180 --exclude=/distfiles --exclude=/local --exclude=/packages --exclude=/.git" >PORTAGE_TMPDIR="/var/tmp" >SHELL="/bin/bash" >USE="acl amd64 bzip2 cet cli crypt debug dri elogind fortran gdbm hardened iconv ipv6 jumbo-build libglvnd libtirpc multilib native-symlinks ncurses nls nptl openmp pam pcre pie readline seccomp split-usr ssl ssp test test-rust unicode xattr xtpax zlib" ABI_X86="64" ELIBC="glibc" KERNEL="linux" USERLAND="GNU" >Unset: ADDR2LINE, AR, ARFLAGS, AS, ASFLAGS, CC, CCLD, CONFIG_SHELL, CPP, CPPFLAGS, CTARGET, CXX, CXXFILT, ELFEDIT, EXTRA_ECONF, F77FLAGS, FC, GCOV, GPROF, INSTALL_MASK, LC_ALL, LD, LFLAGS, LIBTOOL, LINGUAS, MAKE, MAKEFLAGS, NM, OBJCOPY, OBJDUMP, PORTAGE_BINHOST, PORTAGE_BUNZIP2_COMMAND, PORTAGE_COMPRESS, PORTAGE_COMPRESS_FLAGS, PORTAGE_RSYNC_EXTRA_OPTS, RANLIB, READELF, RUSTFLAGS, SIZE, STRINGS, STRIP, YACC, YFLAGS > > > > > >############################## ># emerge history (qlop -mv): # >############################## >2023-02-14T11:48:21 >>> sys-libs/binutils-libs-2.40-r2 >2023-02-14T11:48:24 >>> dev-util/ltrace-0.7.3.6.1 >2023-02-14T11:48:48 >>> dev-tcltk/expect-5.45.4-r4 >2023-02-14T11:48:50 >>> dev-util/dejagnu-1.6.3 > > > > >####################################### ># installed packages (qlist -ICvUSS): # >####################################### >acct-group/audio-0-r1:0 >acct-group/cdrom-0-r1:0 >acct-group/dialout-0-r1:0 >acct-group/disk-0-r1:0 >acct-group/floppy-0:0 >acct-group/input-0-r1:0 >acct-group/kmem-0-r1:0 >acct-group/kvm-0-r1:0 >acct-group/lp-0-r1:0 >acct-group/man-0-r1:0 >acct-group/messagebus-0-r1:0 >acct-group/polkitd-0-r1:0 >acct-group/portage-0:0 >acct-group/render-0-r1:0 >acct-group/root-0:0 >acct-group/sgx-0:0 >acct-group/sshd-0-r1:0 >acct-group/tape-0-r1:0 >acct-group/tty-0-r1:0 >acct-group/usb-0-r1:0 >acct-group/video-0-r1:0 >acct-user/man-1-r1:0 >acct-user/messagebus-0-r1:0 >acct-user/polkitd-0-r1:0 >acct-user/portage-0:0 >acct-user/sshd-0-r1:0 >app-admin/eselect-1.4.20:0 -doc -emacs -vim-syntax >app-admin/perl-cleaner-2.30-r1:0 -pkgcore >app-alternatives/awk-4:0 -busybox gawk -mawk -nawk split-usr >app-alternatives/bc-0:0 -gh gnu >app-alternatives/bzip2-1:0 -lbzip2 -pbzip2 reference split-usr >app-alternatives/gzip-0:0 -pigz reference split-usr >app-alternatives/lex-0-r1:0 flex -reflex >app-alternatives/sh-0:0 bash -busybox -dash -ksh -lksh -mksh >app-alternatives/tar-0:0 gnu -libarchive split-usr >app-alternatives/yacc-1-r2:0 bison -byacc -reference >app-arch/bzip2-1.0.8-r4:0/1 -abi_mips_n32 -abi_mips_n64 -abi_mips_o32 -abi_s390_32 -abi_s390_64 -abi_x86_32 abi_x86_64 -abi_x86_x32 split-usr -static -static-libs -verify-sig >app-arch/gzip-1.12-r4:0 -pic -static -verify-sig >app-arch/libarchive-3.6.1-r1:0/13 -abi_mips_n32 -abi_mips_n64 -abi_mips_o32 -abi_s390_32 -abi_s390_64 -abi_x86_32 abi_x86_64 -abi_x86_x32 acl -blake2 bzip2 e2fsprogs -expat iconv -lz4 lzma -lzo -nettle -static-libs -verify-sig xattr -zstd >app-arch/tar-1.34-r2:0 acl -minimal nls -selinux -verify-sig xattr >app-arch/unzip-6.0_p27-r1:0 bzip2 -natspec unicode >app-arch/xz-utils-5.4.1:0 -abi_mips_n32 -abi_mips_n64 -abi_mips_o32 -abi_s390_32 -abi_s390_64 -abi_x86_32 abi_x86_64 -abi_x86_x32 extra-filters nls split-usr -static-libs -verify-sig >app-arch/zstd-1.5.4-r2:0/1 -abi_mips_n32 -abi_mips_n64 -abi_mips_o32 -abi_s390_32 -abi_s390_64 -abi_x86_32 abi_x86_64 -abi_x86_x32 -lz4 lzma split-usr -static-libs -test zlib >app-crypt/gnupg-2.4.0:0 bzip2 -doc -ldap nls readline -selinux smartcard ssl -test tofu -tools -tpm -usb -user-socket -verify-sig -wks-server >app-crypt/gpgme-1.18.0-r2:1/11.6.15.1 -common-lisp cxx -python python_targets_python3_10 python_targets_python3_11 python_targets_python3_9 -qt5 -static-libs -test -verify-sig >app-crypt/libb2-0.98.1-r3:0 -abi_mips_n32 -abi_mips_n64 -abi_mips_o32 -abi_s390_32 -abi_s390_64 -abi_x86_32 abi_x86_64 -abi_x86_x32 -native-cflags openmp -static-libs >app-crypt/pinentry-1.2.1-r1:0 -caps -efl -emacs -gnome-keyring -gtk ncurses -qt5 -verify-sig >app-crypt/rhash-1.4.3:0 -abi_mips_n32 -abi_mips_n64 -abi_mips_o32 -abi_s390_32 -abi_s390_64 -abi_x86_32 abi_x86_64 -abi_x86_x32 debug nls ssl -static-libs >app-editors/nano-7.2:0 -debug -justify -magic -minimal ncurses nls spell -static unicode >app-eselect/eselect-fontconfig-20220403:0 >app-eselect/eselect-iptables-20220320:0 >app-eselect/eselect-lib-bin-symlink-0.1.1-r1:0 >app-eselect/eselect-pinentry-0.7.2-r1:0 >app-i18n/man-pages-ja-20180315-r1:0 >app-i18n/man-pages-l10n-4.17.0:0 l10n_cs l10n_da l10n_de l10n_el l10n_es l10n_fi l10n_fr l10n_hu l10n_id l10n_it l10n_mk l10n_nb l10n_nl l10n_pl l10n_pt-BR l10n_ro l10n_ru l10n_sr l10n_sv l10n_uk l10n_vi >app-i18n/man-pages-zh_CN-1.6.3.6:0 >app-misc/ca-certificates-20211016.3.87-r1:0 -cacert >app-misc/editor-wrapper-4-r1:0 >app-misc/mime-types-2.1.53:0 -nginx >app-misc/pax-utils-1.3.7:0 -caps -man -python python_single_target_python3_10 -python_single_target_python3_11 -python_single_target_python3_9 -seccomp -test >app-misc/tmux-3.3a-r1:0 debug -selinux -systemd -utempter -vim-syntax >app-portage/eix-0.36.6:0 debug -doc nls -sqlite >app-portage/elt-patches-20221210:0 >app-portage/gemato-18.0:0 gpg -pretty-log python_targets_pypy3 python_targets_python3_10 python_targets_python3_11 python_targets_python3_9 -test -tools >app-portage/gentoolkit-0.6.1-r3:0 python_targets_pypy3 python_targets_python3_10 python_targets_python3_11 python_targets_python3_9 -test >app-portage/portage-utils-0.94.4:0 openmp qmanifest qtegrity -static >app-shells/bash-5.2_p15-r2:0 -afs -bashlogger -examples -mem-scramble net nls -pgo -plugins readline -verify-sig >app-shells/bash-completion-2.11:0 eselect -test >app-shells/gentoo-bashcomp-20190211-r1:0 >app-shells/push-3.4:0 >app-shells/quoter-4.2:0 >app-text/ansifilter-2.18:0 -qt5 >app-text/build-docbook-catalog-2.3-r1:0 >app-text/docbook-xml-dtd-4.5-r2:4.5 >app-text/docbook-xml-dtd-4.4-r3:4.4 >app-text/docbook-xml-dtd-4.2-r3:4.2 >app-text/docbook-xml-dtd-4.1.2-r7:4.1.2 >app-text/docbook-xsl-stylesheets-1.79.1-r3:0 -ruby >app-text/manpager-1:0 >app-text/opensp-1.5.2-r10:0 -doc nls -static-libs -test >app-text/po4a-0.69:0 -test -test >app-text/sgml-common-0.6.3-r7:0 >app-text/xmlto-0.0.28-r10:0 -latex text >dev-db/sqlite-3.40.1:3 -abi_mips_n32 -abi_mips_n64 -abi_mips_o32 -abi_s390_32 -abi_s390_64 -abi_x86_32 abi_x86_64 -abi_x86_x32 debug -doc -icu readline -secure-delete -static-libs -tcl -test -tools >dev-lang/duktape-2.7.0-r3:0/2.7.0 >dev-lang/perl-5.36.0-r2:0/5.36 -berkdb debug -doc gdbm ithreads -minimal -quadmath >dev-lang/python-3.11.2:3.11 -bluetooth -build ensurepip -examples gdbm hardened -libedit -lto ncurses -pgo readline sqlite ssl -test -tk -valgrind -verify-sig >dev-lang/python-3.10.10:3.10 -bluetooth -build ensurepip -examples gdbm hardened -libedit -lto ncurses -pgo readline sqlite ssl -test -tk -valgrind -verify-sig xml >dev-lang/python-3.9.16-r1:3.9 -bluetooth -build ensurepip -examples gdbm hardened -lto ncurses -pgo readline sqlite ssl -test -tk -valgrind -verify-sig xml >dev-lang/python-exec-2.4.10:2 native-symlinks python_targets_pypy3 python_targets_python3_10 python_targets_python3_11 python_targets_python3_9 -test >dev-lang/python-exec-conf-2.4.6:2 python_targets_pypy3 python_targets_python3_10 python_targets_python3_11 python_targets_python3_9 >dev-lang/tcl-8.6.13-r1:0/8.6 -abi_mips_n32 -abi_mips_n64 -abi_mips_o32 -abi_s390_32 -abi_s390_64 -abi_x86_32 abi_x86_64 -abi_x86_x32 debug threads >dev-libs/boehm-gc-8.2.2-r1:0 -abi_mips_n32 -abi_mips_n64 -abi_mips_o32 -abi_s390_32 -abi_s390_64 -abi_x86_32 abi_x86_64 -abi_x86_x32 -cxx large -static-libs threads >dev-libs/elfutils-0.188:0 -abi_mips_n32 -abi_mips_n64 -abi_mips_o32 -abi_s390_32 -abi_s390_64 -abi_x86_32 abi_x86_64 -abi_x86_x32 bzip2 -lzma nls -static-libs -test utils -valgrind -verify-sig -zstd >dev-libs/expat-2.5.0:0 -abi_mips_n32 -abi_mips_n64 -abi_mips_o32 -abi_s390_32 -abi_s390_64 -abi_x86_32 abi_x86_64 -abi_x86_x32 -examples -static-libs unicode >dev-libs/glib-2.74.5:2 -abi_mips_n32 -abi_mips_n64 -abi_mips_o32 -abi_s390_32 -abi_s390_64 -abi_x86_32 abi_x86_64 -abi_x86_x32 -dbus debug elf -gtk-doc mime -selinux -static-libs -sysprof -systemtap -test -utils xattr >dev-libs/gmp-6.2.1-r5:0/10.4 -abi_mips_n32 -abi_mips_n64 -abi_mips_o32 -abi_s390_32 -abi_s390_64 -abi_x86_32 abi_x86_64 -abi_x86_x32 asm cpudetection cxx -doc -pic -static-libs >dev-libs/gobject-introspection-1.74.0:0 -doctool -gtk-doc python_single_target_python3_10 -python_single_target_python3_11 -python_single_target_python3_9 -test >dev-libs/gobject-introspection-common-1.74.0:0 >dev-libs/isl-0.24-r2:0/23 -abi_mips_n32 -abi_mips_n64 -abi_mips_o32 -abi_s390_32 -abi_s390_64 -abi_x86_32 abi_x86_64 -abi_x86_x32 -static-libs >dev-libs/jsoncpp-1.9.5:0/25 -doc -test >dev-libs/libassuan-2.5.5:0 >dev-libs/libatomic_ops-7.6.14:0 -abi_mips_n32 -abi_mips_n64 -abi_mips_o32 -abi_s390_32 -abi_s390_64 -abi_x86_32 abi_x86_64 -abi_x86_x32 >dev-libs/libevent-2.1.12-r1:0/2.1-7 -abi_mips_n32 -abi_mips_n64 -abi_mips_o32 -abi_s390_32 -abi_s390_64 -abi_x86_32 abi_x86_64 -abi_x86_x32 clock-gettime debug -malloc-replacement ssl -static-libs -test -verbose-debug >dev-libs/libffi-3.4.4:0/8 -abi_mips_n32 -abi_mips_n64 -abi_mips_o32 -abi_s390_32 -abi_s390_64 -abi_x86_32 abi_x86_64 -abi_x86_x32 debug -exec-static-trampoline -pax-kernel -static-libs -test >dev-libs/libgcrypt-1.10.1-r3:0/20 -abi_mips_n32 -abi_mips_n64 -abi_mips_o32 -abi_s390_32 -abi_s390_64 -abi_x86_32 abi_x86_64 -abi_x86_x32 asm -cpu_flags_arm_aes -cpu_flags_arm_neon -cpu_flags_arm_sha1 -cpu_flags_arm_sha2 -cpu_flags_ppc_altivec -cpu_flags_ppc_vsx2 -cpu_flags_ppc_vsx3 cpu_flags_x86_aes cpu_flags_x86_avx cpu_flags_x86_avx2 -cpu_flags_x86_padlock -cpu_flags_x86_sha cpu_flags_x86_sse4_1 -doc getentropy -static-libs -verify-sig >dev-libs/libgpg-error-1.46-r1:0 -abi_mips_n32 -abi_mips_n64 -abi_mips_o32 -abi_s390_32 -abi_s390_64 -abi_x86_32 abi_x86_64 -abi_x86_x32 -common-lisp nls -static-libs -test -verify-sig >dev-libs/libksba-1.6.3:0 -static-libs -verify-sig >dev-libs/libltdl-2.4.7-r1:0 -abi_mips_n32 -abi_mips_n64 -abi_mips_o32 -abi_s390_32 -abi_s390_64 -abi_x86_32 abi_x86_64 -abi_x86_x32 -static-libs >dev-libs/libpcre2-10.42-r1:0/3 -abi_mips_n32 -abi_mips_n64 -abi_mips_o32 -abi_s390_32 -abi_s390_64 -abi_x86_32 abi_x86_64 -abi_x86_x32 bzip2 -jit -libedit pcre16 pcre32 readline split-usr -static-libs unicode -verify-sig zlib >dev-libs/libpipeline-1.5.7:0 -test >dev-libs/libtasn1-4.19.0:0/6 -abi_mips_n32 -abi_mips_n64 -abi_mips_o32 -abi_s390_32 -abi_s390_64 -abi_x86_32 abi_x86_64 -abi_x86_x32 -static-libs -test -valgrind -verify-sig >dev-libs/libunistring-1.1-r1:0/5 -abi_mips_n32 -abi_mips_n64 -abi_mips_o32 -abi_s390_32 -abi_s390_64 -abi_x86_32 abi_x86_64 -abi_x86_x32 -doc -static-libs >dev-libs/libuv-1.44.2-r1:0/1 >dev-libs/libxml2-2.10.3-r1:2 -abi_mips_n32 -abi_mips_n64 -abi_mips_o32 -abi_s390_32 -abi_s390_64 -abi_x86_32 abi_x86_64 -abi_x86_x32 -debug -examples ftp -icu -lzma python python_targets_python3_10 python_targets_python3_11 python_targets_python3_9 readline -static-libs -test >dev-libs/libxslt-1.1.37-r1:0 -abi_mips_n32 -abi_mips_n64 -abi_mips_o32 -abi_s390_32 -abi_s390_64 -abi_x86_32 abi_x86_64 -abi_x86_x32 crypt debug -examples -python python_targets_python3_10 python_targets_python3_11 python_targets_python3_9 -static-libs >dev-libs/lzo-2.10:2 -abi_mips_n32 -abi_mips_n64 -abi_mips_o32 -abi_s390_32 -abi_s390_64 -abi_x86_32 abi_x86_64 -abi_x86_x32 -examples split-usr -static-libs >dev-libs/mpc-1.3.1:0/3 -abi_mips_n32 -abi_mips_n64 -abi_mips_o32 -abi_s390_32 -abi_s390_64 -abi_x86_32 abi_x86_64 -abi_x86_x32 -static-libs >dev-libs/mpfr-4.2.0:0/6 -abi_mips_n32 -abi_mips_n64 -abi_mips_o32 -abi_s390_32 -abi_s390_64 -abi_x86_32 abi_x86_64 -abi_x86_x32 -static-libs -verify-sig >dev-libs/nettle-3.8.1:0/8-6 -abi_mips_n32 -abi_mips_n64 -abi_mips_o32 -abi_s390_32 -abi_s390_64 -abi_x86_32 abi_x86_64 -abi_x86_x32 asm -cpu_flags_arm_aes -cpu_flags_arm_neon -cpu_flags_arm_sha1 -cpu_flags_arm_sha2 -cpu_flags_ppc_altivec cpu_flags_x86_aes cpu_flags_x86_pclmul -cpu_flags_x86_sha -doc gmp -static-libs -verify-sig >dev-libs/npth-1.6-r1:0 -test >dev-libs/openssl-3.0.8:0/3 -abi_mips_n32 -abi_mips_n64 -abi_mips_o32 -abi_s390_32 -abi_s390_64 -abi_x86_32 abi_x86_64 -abi_x86_x32 asm cpu_flags_x86_sse2 -fips -ktls -rfc3779 -sctp -static-libs -test -tls-compression -vanilla -verify-sig -verify-sig -weak-ssl-ciphers >dev-libs/popt-1.19:0 -abi_mips_n32 -abi_mips_n64 -abi_mips_o32 -abi_s390_32 -abi_s390_64 -abi_x86_32 abi_x86_64 -abi_x86_x32 nls -static-libs >dev-perl/Clone-0.460.0:0 -test >dev-perl/Devel-CheckLib-1.160.0:0 -test >dev-perl/Encode-EUCJPASCII-0.30.0-r1:0 -test >dev-perl/Encode-HanExtra-0.230.0-r3:0 >dev-perl/Encode-Locale-1.50.0-r1:0 -test >dev-perl/ExtUtils-CChecker-0.110.0:0 -test >dev-perl/File-BaseDir-0.90.0:0 -test >dev-perl/File-DesktopEntry-0.220.0-r1:0 -test >dev-perl/File-Listing-6.150.0:0 -test -test >dev-perl/File-MimeInfo-0.300.0:0 -test >dev-perl/HTML-Parser-3.760.0:0 -test >dev-perl/HTML-Tagset-3.200.0-r2:0 >dev-perl/HTTP-Cookies-6.100.0:0 -test >dev-perl/HTTP-Date-6.50.0:0 >dev-perl/HTTP-Message-6.440.0:0 -test -test >dev-perl/HTTP-Negotiate-6.10.0-r2:0 -test >dev-perl/IO-HTML-1.4.0:0 -test >dev-perl/IO-Socket-INET6-2.720.0-r2:0 -test >dev-perl/IO-Socket-SSL-2.81.0:0 -examples -idn -test >dev-perl/IPC-System-Simple-1.300.0:0 -test >dev-perl/libwww-perl-6.600.0-r1:0 ssl -test >dev-perl/Locale-gettext-1.70.0-r1:0 -test >dev-perl/LWP-MediaTypes-6.40.0:0 -test >dev-perl/LWP-Protocol-https-6.100.0:0 -test >dev-perl/MIME-Charset-1.12.2-r1:0 l10n_ja l10n_zh -test >dev-perl/Module-Build-0.423.100:0 -test >dev-perl/Mozilla-CA-20999999-r1:0 -test >dev-perl/Net-HTTP-6.210.0:0 -minimal -test >dev-perl/Net-SSLeay-1.920.0:0 -examples -examples -minimal -test >dev-perl/Pod-Parser-1.630.0-r1:0 -test >dev-perl/SGMLSpm-1.1-r2:0 -test >dev-perl/Socket6-0.290.0:0 -test >dev-perl/Sub-Name-0.260.0:0 -suggested -test >dev-perl/Syntax-Keyword-Try-0.270.0:0 -test >dev-perl/TermReadKey-2.380.0-r1:0 -examples -test >dev-perl/Text-CharWidth-0.40.0-r2:0 -test >dev-perl/Text-WrapI18N-0.60.0-r2:0 -test >dev-perl/TimeDate-2.330.0-r1:0 -test >dev-perl/Try-Tiny-0.310.0:0 -minimal -test >dev-perl/Unicode-LineBreak-2019.1.0:0 >dev-perl/URI-5.110.0:0 -test >dev-perl/WWW-RobotRules-6.20.0-r2:0 -test >dev-perl/XML-Parser-2.460.0-r2:0 >dev-perl/XS-Parse-Keyword-0.250.0:0 -test >dev-perl/YAML-Tiny-1.730.0-r1:0 -minimal -test >dev-python/autocommand-2.2.2:0 python_targets_pypy3 python_targets_python3_10 python_targets_python3_11 python_targets_python3_9 -test >dev-python/certifi-3021.3.16-r3:0 python_targets_pypy3 python_targets_python3_10 python_targets_python3_11 python_targets_python3_9 -test >dev-python/charset_normalizer-3.0.1:0 python_targets_pypy3 python_targets_python3_10 python_targets_python3_11 python_targets_python3_9 -test >dev-python/cython-0.29.33:0 -doc -emacs python_targets_pypy3 python_targets_python3_10 python_targets_python3_11 python_targets_python3_9 -test >dev-python/ensurepip-pip-23.0:0 >dev-python/ensurepip-setuptools-67.2.0:0 >dev-python/ensurepip-wheels-100:0 >dev-python/flit_core-3.8.0:0 python_targets_pypy3 python_targets_python3_10 python_targets_python3_11 python_targets_python3_9 -test >dev-python/gentoo-common-1:0 >dev-python/gpep517-13:0 python_targets_pypy3 python_targets_python3_10 python_targets_python3_11 python_targets_python3_9 -test >dev-python/idna-3.4:0 python_targets_pypy3 python_targets_python3_10 python_targets_python3_11 python_targets_python3_9 -test >dev-python/importlib_metadata-6.0.0:0 python_targets_pypy3 python_targets_python3_10 python_targets_python3_11 python_targets_python3_9 -test >dev-python/inflect-6.0.2:0 python_targets_pypy3 python_targets_python3_10 python_targets_python3_11 python_targets_python3_9 -test >dev-python/installer-0.6.0:0 python_targets_pypy3 python_targets_python3_10 python_targets_python3_11 python_targets_python3_9 -test >dev-python/jaraco-context-4.3.0:0 python_targets_pypy3 python_targets_python3_10 python_targets_python3_11 python_targets_python3_9 -test >dev-python/jaraco-functools-3.5.2:0 python_targets_pypy3 python_targets_python3_10 python_targets_python3_11 python_targets_python3_9 -test >dev-python/jaraco-text-3.11.1:0 python_targets_pypy3 python_targets_python3_10 python_targets_python3_11 python_targets_python3_9 -test >dev-python/jinja-3.1.2:0 -doc -examples python_targets_pypy3 python_targets_python3_10 python_targets_python3_11 python_targets_python3_9 -test >dev-python/markupsafe-2.1.2:0 python_targets_pypy3 python_targets_python3_10 python_targets_python3_11 python_targets_python3_9 -test >dev-python/more-itertools-9.0.0:0 -doc python_targets_pypy3 python_targets_python3_10 python_targets_python3_11 python_targets_python3_9 -test >dev-python/nspektr-0.4.0:0 python_targets_pypy3 python_targets_python3_10 python_targets_python3_11 python_targets_python3_9 -test >dev-python/ordered-set-4.1.0:0 python_targets_pypy3 python_targets_python3_10 python_targets_python3_11 python_targets_python3_9 -test >dev-python/packaging-23.0-r1:0 python_targets_pypy3 python_targets_python3_10 python_targets_python3_11 python_targets_python3_9 -test >dev-python/platformdirs-3.0.0:0 python_targets_pypy3 python_targets_python3_10 python_targets_python3_11 python_targets_python3_9 -test >dev-python/pydantic-1.10.4:0 native-extensions python_targets_pypy3 python_targets_python3_10 python_targets_python3_11 python_targets_python3_9 -test >dev-python/pyparsing-3.0.9:0 -examples python_targets_pypy3 python_targets_python3_10 python_targets_python3_11 python_targets_python3_9 -test >dev-python/pypax-0.9.5-r1:0 -ptpax python_targets_python3_10 python_targets_python3_9 xtpax >dev-python/pypy3-7.3.11-r1:0/pypy39-pp73-336 ensurepip gdbm -jit ncurses sqlite -tk >dev-python/pypy3-exe-bin-7.3.11:3.9-7.3.11 >dev-python/PySocks-1.7.1-r2:0 python_targets_pypy3 python_targets_python3_10 python_targets_python3_11 python_targets_python3_9 >dev-python/requests-2.28.2:0 python_targets_pypy3 python_targets_python3_10 python_targets_python3_11 python_targets_python3_9 -socks5 -test test-rust >dev-python/setuptools-67.2.0-r1:0 python_targets_pypy3 python_targets_python3_10 python_targets_python3_11 python_targets_python3_9 -test >dev-python/setuptools_scm-7.1.0:0 python_targets_pypy3 python_targets_python3_10 python_targets_python3_11 python_targets_python3_9 -test >dev-python/six-1.16.0-r1:0 -doc python_targets_pypy3 python_targets_python3_10 python_targets_python3_11 python_targets_python3_9 -test >dev-python/tomli-2.0.1-r1:0 python_targets_pypy3 python_targets_python3_10 python_targets_python3_11 python_targets_python3_9 -test >dev-python/typing-extensions-4.4.0:0 python_targets_pypy3 python_targets_python3_10 python_targets_python3_11 python_targets_python3_9 -test >dev-python/urllib3-1.26.14:0 -brotli python_targets_pypy3 python_targets_python3_10 python_targets_python3_11 python_targets_python3_9 -test >dev-python/wheel-0.38.4:0 python_targets_pypy3 python_targets_python3_10 python_targets_python3_11 python_targets_python3_9 -test >dev-python/zipp-3.13.0:0 python_targets_pypy3 python_targets_python3_10 python_targets_python3_11 python_targets_python3_9 -test >dev-tcltk/expect-5.45.4-r4:0 debug -doc -test -threads >dev-util/checkbashisms-2.22.2:0 >dev-util/cmake-3.25.2:0 -doc -emacs ncurses -qt5 -test -test -verify-sig >dev-util/dejagnu-1.6.3:0 -test >dev-util/desktop-file-utils-0.26-r2:0 -emacs >dev-util/glib-utils-2.74.5:0 python_single_target_python3_10 -python_single_target_python3_11 -python_single_target_python3_9 >dev-util/gperf-3.1-r1:0 >dev-util/gtk-doc-am-1.33.2:0 >dev-util/intltool-0.51.0-r3:0 >dev-util/ltrace-0.7.3.6.1:0 debug -selinux -test -unwind >dev-util/meson-1.0.0:0 python_targets_python3_10 python_targets_python3_11 python_targets_python3_9 -test >dev-util/meson-format-array-0:0 python_targets_python3_10 python_targets_python3_11 python_targets_python3_9 >dev-util/ninja-1.11.1-r2:0 -doc -emacs -test >dev-util/pkgconf-1.8.1:0/3 -abi_mips_n32 -abi_mips_n64 -abi_mips_o32 -abi_s390_32 -abi_s390_64 -abi_x86_32 abi_x86_64 -abi_x86_x32 -test >dev-util/re2c-2.2:0 debug -test >dev-vcs/git-2.39.1:0 blksha1 -cgi curl -cvs -doc -gnome-keyring gpg -highlight iconv -mediawiki -mediawiki-experimental nls pcre -perforce -perl python_single_target_python3_10 -python_single_target_python3_11 -python_single_target_python3_9 safe-directory -selinux -subversion -test -tk webdav -xinetd >media-fonts/liberation-fonts-2.1.5:0 -X -X -fontforge >media-gfx/graphite2-1.3.14_p20210810-r3:0 -abi_mips_n32 -abi_mips_n64 -abi_mips_o32 -abi_s390_32 -abi_s390_64 -abi_x86_32 abi_x86_64 -abi_x86_x32 -perl -test >media-libs/fontconfig-2.14.2:1.0 -abi_mips_n32 -abi_mips_n64 -abi_mips_o32 -abi_s390_32 -abi_s390_64 -abi_x86_32 abi_x86_64 -abi_x86_x32 -doc nls -test >media-libs/freetype-2.13.0:2 -X -abi_mips_n32 -abi_mips_n64 -abi_mips_o32 -abi_s390_32 -abi_s390_64 -abi_x86_32 abi_x86_64 -abi_x86_x32 adobe-cff -brotli bzip2 cleartype-hinting debug -doc -fontforge harfbuzz -infinality png -static-libs -svg -utils >media-libs/harfbuzz-6.0.0:0/6.0.0 -abi_mips_n32 -abi_mips_n64 -abi_mips_o32 -abi_s390_32 -abi_s390_64 -abi_x86_32 abi_x86_64 -abi_x86_x32 cairo debug -doc -experimental glib graphite -icu introspection -test truetype >media-libs/libpng-1.6.39:0/16 -abi_mips_n32 -abi_mips_n64 -abi_mips_o32 -abi_s390_32 -abi_s390_64 -abi_x86_32 abi_x86_64 -abi_x86_x32 -apng -cpu_flags_arm_neon cpu_flags_x86_sse -static-libs >net-dns/c-ares-1.19.0:0/2 -abi_mips_n32 -abi_mips_n64 -abi_mips_o32 -abi_s390_32 -abi_s390_64 -abi_x86_32 abi_x86_64 -abi_x86_x32 -static-libs -test -verify-sig >net-dns/libidn2-2.3.4:0/2 -abi_mips_n32 -abi_mips_n64 -abi_mips_o32 -abi_s390_32 -abi_s390_64 -abi_x86_32 abi_x86_64 -abi_x86_x32 nls -static-libs -verify-sig >net-firewall/iptables-1.8.9:0/1.8.3 -conntrack -netlink -nftables -pcap split-usr -static-libs >net-libs/gnutls-3.8.0:0/30.30 -abi_mips_n32 -abi_mips_n64 -abi_mips_o32 -abi_s390_32 -abi_s390_64 -abi_x86_32 abi_x86_64 -abi_x86_x32 -brotli cxx -dane -doc -examples idn nls openssl -pkcs11 seccomp -sslv2 -sslv3 -static-libs -test -test-full tls-heartbeat -tools -valgrind -verify-sig zlib -zstd >net-libs/libmnl-1.0.5:0/0.2.0 -examples -verify-sig >net-libs/libnsl-2.0.0-r1:0/3 -abi_mips_n32 -abi_mips_n64 -abi_mips_o32 -abi_s390_32 -abi_s390_64 -abi_x86_32 abi_x86_64 -abi_x86_x32 -static-libs >net-libs/libtirpc-1.3.3:0/3 -abi_mips_n32 -abi_mips_n64 -abi_mips_o32 -abi_s390_32 -abi_s390_64 -abi_x86_32 abi_x86_64 -abi_x86_x32 -kerberos split-usr -static-libs >net-libs/nghttp2-1.51.0:0/1.14 -abi_mips_n32 -abi_mips_n64 -abi_mips_o32 -abi_s390_32 -abi_s390_64 -abi_x86_32 abi_x86_64 -abi_x86_x32 -cxx debug -hpack-tools -jemalloc -static-libs -test -utils -xml >net-misc/curl-7.87.0-r2:0 -abi_mips_n32 -abi_mips_n64 -abi_mips_o32 -abi_s390_32 -abi_s390_64 -abi_x86_32 abi_x86_64 -abi_x86_x32 adns -alt-svc -brotli -curl_ssl_gnutls -curl_ssl_mbedtls -curl_ssl_nss curl_ssl_openssl -curl_ssl_rustls ftp -gnutls -gopher -hsts http2 -idn imap ipv6 -kerberos -ldap -mbedtls -nghttp3 -nss openssl pop3 progress-meter -quiche -rtmp -rustls -samba smtp -ssh ssl -sslv3 -static-libs -telnet -test tftp -verify-sig -websockets -zstd >net-misc/dhcpcd-9.4.1:0 debug embedded ipv6 -privsep udev >net-misc/iputils-20221126:0 arping -caps -clockdiff -doc filecaps -idn nls -test -tracepath >net-misc/netifrc-0.7.3-r1:0 dhcp >net-misc/openssh-9.2_p1-r2:0 -X -X509 -abi_mips_n32 -audit -debug -hpn -kerberos -ldns -libedit -livecd pam pie -sctp -security-key -selinux ssl -static -test -verify-sig -xmss >net-misc/rsync-3.2.7-r2:0 acl -examples iconv -lz4 python_single_target_python3_10 -python_single_target_python3_11 -python_single_target_python3_9 -rrsync ssl -stunnel -system-zlib -verify-sig xattr -xxhash -zstd >net-misc/wget-1.21.3-r1:0 -cookie-check debug -gnutls -idn ipv6 -metalink nls -ntlm pcre ssl -static -test -uuid -verify-sig zlib >perl-core/Compress-Raw-Zlib-2.202.0:0 >perl-core/File-Temp-0.231.100:0 >sec-keys/openpgp-keys-gentoo-release-20220101:0 -test >sys-apps/acl-2.3.1-r1:0 -abi_mips_n32 -abi_mips_n64 -abi_mips_o32 -abi_s390_32 -abi_s390_64 -abi_x86_32 abi_x86_64 -abi_x86_x32 nls split-usr -static-libs >sys-apps/attr-2.5.1-r2:0 -abi_mips_n32 -abi_mips_n64 -abi_mips_o32 -abi_s390_32 -abi_s390_64 -abi_x86_32 abi_x86_64 -abi_x86_x32 debug nls split-usr -static-libs >sys-apps/baselayout-2.13-r1:0 -build split-usr >sys-apps/coreutils-9.1-r2:0 acl -caps -gmp -hostname -kill -multicall nls openssl -selinux split-usr -static -test -vanilla -verify-sig xattr >sys-apps/dbus-1.15.4:0 -X -abi_mips_n32 -abi_mips_n64 -abi_mips_o32 -abi_s390_32 -abi_s390_64 -abi_x86_32 abi_x86_64 -abi_x86_x32 debug -doc elogind -selinux -static-libs -systemd -test -test >sys-apps/debianutils-5.7:0 installkernel -static >sys-apps/diffutils-3.9-r1:0 nls -static -verify-sig >sys-apps/elfix-0.9.5:0 -ptpax xtpax >sys-apps/file-5.44-r3:0 -abi_mips_n32 -abi_mips_n64 -abi_mips_o32 -abi_s390_32 -abi_s390_64 -abi_x86_32 abi_x86_64 -abi_x86_x32 bzip2 -lzip -lzma -python python_targets_python3_10 python_targets_python3_11 python_targets_python3_9 -seccomp -static-libs -verify-sig zlib -zstd >sys-apps/findutils-4.9.0-r2:0 nls -selinux -static -test -verify-sig >sys-apps/gawk-5.2.1:0 -mpfr nls -pma readline -verify-sig >sys-apps/gentoo-functions-0.19:0 >sys-apps/grep-3.8-r1:0 egrep-fgrep nls pcre -static -verify-sig >sys-apps/groff-1.22.4:0 -X -examples -uchardet >sys-apps/help2man-1.49.3:0 nls >sys-apps/install-xattr-0.8-r1:0 >sys-apps/iproute2-6.1.0-r1:0 -atm -berkdb -bpf -caps -elf iptables -libbsd -minimal -nfs -selinux split-usr >sys-apps/kbd-2.5.1:0 nls pam -test >sys-apps/kmod-30-r1:0 debug -doc lzma -pkcs7 -python python_targets_python3_10 python_targets_python3_11 python_targets_python3_9 -static-libs tools zlib zstd >sys-apps/less-608-r2:0 pcre unicode >sys-apps/man-db-2.11.2:0 manpager nls seccomp -selinux -static-libs zlib >sys-apps/man-pages-6.03:0 l10n_cs l10n_da l10n_de l10n_el l10n_es l10n_fi l10n_fr l10n_hu l10n_id l10n_it l10n_ja l10n_mk l10n_nb l10n_nl l10n_pl l10n_pt-BR l10n_ro l10n_ru l10n_sr l10n_sv l10n_uk l10n_vi l10n_zh-CN >sys-apps/miscfiles-1.5-r4:0 -minimal >sys-apps/net-tools-2.10:0 arp hostname ipv6 -nis nls -plipconfig -selinux -slattach -static >sys-apps/openrc-0.46:0 -audit -bash debug ncurses netifrc -newnet pam -selinux -sysv-utils unicode >sys-apps/portage-3.0.44:0 -apidoc -build -doc -gentoo-dev ipc native-extensions python_targets_pypy3 python_targets_python3_10 python_targets_python3_11 python_targets_python3_9 rsync-verify -selinux -test xattr >sys-apps/sandbox-2.30-r1:0 -abi_mips_n32 -abi_mips_n64 -abi_mips_o32 -abi_s390_32 -abi_s390_64 abi_x86_32 abi_x86_64 -abi_x86_x32 nnp >sys-apps/sed-4.9:0 acl nls -selinux -static -verify-sig >sys-apps/shadow-4.13-r1:0/4 acl -audit -bcrypt -cracklib nls pam -selinux -skey split-usr -su -verify-sig xattr >sys-apps/systemd-utils-252.5:0 -abi_mips_n32 -abi_mips_n64 -abi_mips_o32 -abi_s390_32 -abi_s390_64 -abi_x86_32 abi_x86_64 -abi_x86_x32 acl -boot kmod -selinux split-usr -split-usr -sysusers -test tmpfiles udev >sys-apps/sysvinit-3.06-r1:0 -ibm nls -selinux -static -verify-sig >sys-apps/texinfo-7.0.2:0 nls standalone -static >sys-apps/util-linux-2.38.1-r2:0 -abi_mips_n32 -abi_mips_n64 -abi_mips_o32 -abi_s390_32 -abi_s390_64 -abi_x86_32 abi_x86_64 -abi_x86_x32 -audit -build -caps cramfs -cryptsetup -fdformat hardlink -kill logger -magic ncurses nls pam -python python_targets_python3_10 python_targets_python3_11 python_targets_python3_9 readline -rtas -selinux -slang split-usr -static-libs su suid -systemd -test -tty-helpers -udev unicode -verify-sig >sys-apps/which-2.21:0 >sys-auth/elogind-246.10-r2:0 acl -audit cgroup-hybrid debug -doc pam policykit -selinux -test >sys-auth/pambase-20220214:0 -caps -debug elogind -gnome-keyring -homed -minimal -mktemp nullok -pam_krb5 -pam_ssh passwdqc -pwhistory -pwquality -securetty -selinux sha512 -systemd -yescrypt >sys-auth/passwdqc-2.0.2-r1:0 >sys-auth/polkit-122:0 daemon duktape -examples -gtk introspection -kde pam -selinux -systemd -test >sys-devel/autoconf-2.71-r5:2.71 -emacs >sys-devel/autoconf-archive-2022.09.03:0 >sys-devel/autoconf-wrapper-20221207-r1:0 >sys-devel/automake-1.16.5:1.16 -test >sys-devel/automake-wrapper-20221207:0 >sys-devel/bc-1.07.1-r6:0 -libedit readline -static >sys-devel/binutils-2.40-r1:2.40 cet -doc -gold -gprofng -multitarget nls -pgo plugins -static-libs -test -vanilla -zstd >sys-devel/binutils-config-5.5:0 native-symlinks >sys-devel/bison-3.8.2-r2:0 -examples nls -static -test -verify-sig >sys-devel/flex-2.6.4-r5:0 -abi_mips_n32 -abi_mips_n64 -abi_mips_o32 -abi_s390_32 -abi_s390_64 -abi_x86_32 abi_x86_64 -abi_x86_x32 nls -static -test >sys-devel/gcc-12.2.1_p20230121-r1:12 -ada cet -custom-cflags cxx -d -debug default-stack-clash-protection default-znow -doc -fixed-point fortran -go graphite hardened -ieee-long-double -jit -libssp lto multilib nls nptl -objc -objc++ -objc-gc openmp -pch -pgo pie sanitize ssp -systemtap -test -valgrind -vanilla -vtv -zstd >sys-devel/gcc-config-2.10:0 cc-wrappers native-symlinks >sys-devel/gettext-0.21.1:0 -abi_mips_n32 -abi_mips_n64 -abi_mips_o32 -abi_s390_32 -abi_s390_64 -abi_x86_32 abi_x86_64 -abi_x86_x32 acl -cvs cxx -doc -emacs -git -java -java ncurses nls openmp -static-libs -verify-sig >sys-devel/gnuconfig-20221007:0 >sys-devel/libtool-2.4.7-r1:2 -vanilla >sys-devel/m4-1.4.19-r1:0 -examples nls -verify-sig >sys-devel/make-4.4:0 -guile nls -static -verify-sig >sys-devel/patch-2.7.6-r5:0 -static -test -verify-sig xattr >sys-fs/e2fsprogs-1.47.0:0 -abi_mips_n32 -abi_mips_n64 -abi_mips_o32 -abi_s390_32 -abi_s390_64 -abi_x86_32 abi_x86_64 -abi_x86_x32 -cron -fuse nls split-usr -static-libs -test tools >sys-fs/udev-init-scripts-35:0 >sys-kernel/installkernel-gentoo-6:0 -grub >sys-kernel/linux-headers-6.1:0 -headers-only >sys-libs/binutils-libs-2.40-r2:0/2.40 -64-bit-bfd -abi_mips_n32 -abi_mips_n64 -abi_mips_o32 -abi_s390_32 -abi_s390_64 -abi_x86_32 abi_x86_64 -abi_x86_x32 cet -multitarget nls -static-libs >sys-libs/gdbm-1.23:0/6 -abi_mips_n32 -abi_mips_n64 -abi_mips_o32 -abi_s390_32 -abi_s390_64 -abi_x86_32 abi_x86_64 -abi_x86_x32 berkdb nls readline -static-libs -test -verify-sig >sys-libs/glibc-2.36-r7:2.2 -audit -caps cet -compile-locales -crypt -custom-cflags -doc -gd -hash-sysv-compat -headers-only multiarch multilib -multilib-bootstrap -nscd -perl -profile -selinux ssp stack-realign static-libs -suid -systemd -systemtap -test -vanilla >sys-libs/libcap-2.67:0 -abi_mips_n32 -abi_mips_n64 -abi_mips_o32 -abi_s390_32 -abi_s390_64 -abi_x86_32 abi_x86_64 -abi_x86_x32 pam split-usr -static-libs -tools >sys-libs/libseccomp-2.5.4:0 -abi_mips_n32 -abi_mips_n64 -abi_mips_o32 -abi_s390_32 -abi_s390_64 -abi_x86_32 abi_x86_64 -abi_x86_x32 -experimental-loong -python python_targets_python3_10 python_targets_python3_9 -static-libs -test >sys-libs/libxcrypt-4.4.33:0/1 -abi_mips_n32 -abi_mips_n64 -abi_mips_o32 -abi_s390_32 -abi_s390_64 abi_x86_32 abi_x86_64 -abi_x86_x32 compat -headers-only split-usr -static-libs system -test >sys-libs/ncurses-6.4:0/6 -abi_mips_n32 -abi_mips_n64 -abi_mips_o32 -abi_s390_32 -abi_s390_64 -abi_x86_32 abi_x86_64 -abi_x86_x32 -ada cxx debug -doc -gpm -minimal -profile split-usr -split-usr stack-realign -static-libs -test tinfo -trace -verify-sig >sys-libs/pam-1.5.2-r3:0 -abi_mips_n32 -abi_mips_n64 -abi_mips_o32 -abi_s390_32 -abi_s390_64 -abi_x86_32 abi_x86_64 -abi_x86_x32 -audit -berkdb -debug filecaps -nis -selinux split-usr >sys-libs/readline-8.2_p1:0/8 -abi_mips_n32 -abi_mips_n64 -abi_mips_o32 -abi_s390_32 -abi_s390_64 -abi_x86_32 abi_x86_64 -abi_x86_x32 split-usr -static-libs unicode -utils -verify-sig >sys-libs/timezone-data-2022g:0 -leaps-timezone nls -zic-slim >sys-libs/zlib-1.2.13-r1:0/1 -abi_mips_n32 -abi_mips_n64 -abi_mips_o32 -abi_s390_32 -abi_s390_64 -abi_x86_32 abi_x86_64 -abi_x86_x32 minizip split-usr -static-libs -verify-sig >sys-process/procps-3.3.17-r1:0/8 -abi_mips_n32 -abi_mips_n64 -abi_mips_o32 -abi_s390_32 -abi_s390_64 -abi_x86_32 abi_x86_64 -abi_x86_x32 elogind kill -modern-top ncurses nls -selinux split-usr -static-libs -systemd -test unicode >sys-process/psmisc-23.6:0 -X -apparmor nls -selinux -test >virtual/acl-0-r2:0 -abi_mips_n32 -abi_mips_n64 -abi_mips_o32 -abi_s390_32 -abi_s390_64 -abi_x86_32 abi_x86_64 -abi_x86_x32 -static-libs >virtual/dev-manager-0-r2:0 >virtual/editor-0-r4:0 >virtual/libc-1-r1:0 >virtual/libcrypt-2-r1:0/2 -abi_mips_n32 -abi_mips_n64 -abi_mips_o32 -abi_s390_32 -abi_s390_64 abi_x86_32 abi_x86_64 -abi_x86_x32 -static-libs >virtual/libelf-3-r1:0/1 -abi_mips_n32 -abi_mips_n64 -abi_mips_o32 -abi_s390_32 -abi_s390_64 -abi_x86_32 abi_x86_64 -abi_x86_x32 >virtual/libiconv-0-r2:0 -abi_mips_n32 -abi_mips_n64 -abi_mips_o32 -abi_s390_32 -abi_s390_64 -abi_x86_32 abi_x86_64 -abi_x86_x32 >virtual/libintl-0-r2:0 -abi_mips_n32 -abi_mips_n64 -abi_mips_o32 -abi_s390_32 -abi_s390_64 -abi_x86_32 abi_x86_64 -abi_x86_x32 >virtual/libudev-232-r7:0/1 -abi_mips_n32 -abi_mips_n64 -abi_mips_o32 -abi_s390_32 -abi_s390_64 -abi_x86_32 abi_x86_64 -abi_x86_x32 -systemd >virtual/man-0-r4:0 >virtual/os-headers-0-r2:0 >virtual/package-manager-1:0 >virtual/pager-0-r1:0 >virtual/perl-Carp-1.520.0-r2:0 >virtual/perl-Compress-Raw-Bzip2-2.103.0-r3:0 >virtual/perl-Compress-Raw-Zlib-2.202.0:0 >virtual/perl-CPAN-2.330.0:0 >virtual/perl-CPAN-Meta-2.150.10-r6:0 >virtual/perl-CPAN-Meta-Requirements-2.140.0-r8:0 >virtual/perl-CPAN-Meta-YAML-0.18.0-r8:0 >virtual/perl-Data-Dumper-2.184.0:0 >virtual/perl-Digest-MD5-2.580.0-r1:0 >virtual/perl-Encode-3.170.0:0 >virtual/perl-Exporter-5.770.0:0 >virtual/perl-ExtUtils-CBuilder-0.280.236-r1:0 >virtual/perl-ExtUtils-Install-2.200.0-r1:0 >virtual/perl-ExtUtils-MakeMaker-7.640.0:0 >virtual/perl-ExtUtils-Manifest-1.730.0-r1:0 >virtual/perl-ExtUtils-ParseXS-3.450.0:0 >virtual/perl-File-Path-2.180.0-r1:0 >virtual/perl-File-Spec-3.840.0:0 >virtual/perl-File-Temp-0.231.100:0 >virtual/perl-Getopt-Long-2.520.0-r1:0 >virtual/perl-IO-1.500.0:0 >virtual/perl-IO-Compress-2.106.0:0 >virtual/perl-IO-Socket-IP-0.410.0-r1:0 >virtual/perl-JSON-PP-4.70.0:0 >virtual/perl-libnet-3.140.0:0 ssl >virtual/perl-MIME-Base64-3.160.0-r1:0 >virtual/perl-Module-Metadata-1.0.37-r2:0 >virtual/perl-parent-0.238.0-r2:0 >virtual/perl-Parse-CPAN-Meta-2.150.10-r6:0 >virtual/perl-Perl-OSType-1.10.0-r6:0 >virtual/perl-podlators-4.140.0-r3:0 >virtual/perl-Scalar-List-Utils-1.620.0:0 >virtual/perl-Test-Harness-3.440.0:0 >virtual/perl-Text-ParseWords-3.310.0:0 >virtual/perl-Time-Local-1.300.0-r1:0 >virtual/perl-version-0.992.900:0 >virtual/perl-XSLoader-0.310.0:0 >virtual/pkgconfig-2-r1:0 >virtual/service-manager-1-r1:0 >virtual/ssh-0-r1:0 -minimal >virtual/tmpfiles-0-r3:0 >virtual/ttf-fonts-1-r2:0 >virtual/udev-217-r5:0 >virtual/w3m-1:0 >www-client/pybugz-0.13-r2:0 python_targets_python3_10 python_targets_python3_11 python_targets_python3_9 >www-client/w3m-0.5.3_p20230121:0 -X -fbcon -gdk-pixbuf -gpm -imlib l10n_ja -lynxkeymap nls -nntp ssl unicode -xface >x11-apps/xprop-1.2.6:0 >x11-apps/xset-1.2.5:0 >x11-base/xcb-proto-1.15.2:0 python_targets_python3_10 python_targets_python3_11 python_targets_python3_9 >x11-base/xorg-proto-2022.2:0 -test >x11-libs/cairo-1.17.6-r1:0 -X -abi_mips_n32 -abi_mips_n64 -abi_mips_o32 -abi_s390_32 -abi_s390_64 -abi_x86_32 abi_x86_64 -abi_x86_x32 -aqua -debug glib -gtk-doc -test >x11-libs/libICE-1.1.1-r1:0 -abi_mips_n32 -abi_mips_n64 -abi_mips_o32 -abi_s390_32 -abi_s390_64 -abi_x86_32 abi_x86_64 -abi_x86_x32 >x11-libs/libSM-1.2.4:0 -abi_mips_n32 -abi_mips_n64 -abi_mips_o32 -abi_s390_32 -abi_s390_64 -abi_x86_32 abi_x86_64 -abi_x86_x32 -doc uuid >x11-libs/libX11-1.8.4:0 -abi_mips_n32 -abi_mips_n64 -abi_mips_o32 -abi_s390_32 -abi_s390_64 -abi_x86_32 abi_x86_64 -abi_x86_x32 -doc -test >x11-libs/libXau-1.0.11:0 -abi_mips_n32 -abi_mips_n64 -abi_mips_o32 -abi_s390_32 -abi_s390_64 -abi_x86_32 abi_x86_64 -abi_x86_x32 -doc >x11-libs/libxcb-1.15-r1:0/1.12 -abi_mips_n32 -abi_mips_n64 -abi_mips_o32 -abi_s390_32 -abi_s390_64 -abi_x86_32 abi_x86_64 -abi_x86_x32 -doc -doc -selinux -test xkb >x11-libs/libXdmcp-1.1.4-r2:0 -abi_mips_n32 -abi_mips_n64 -abi_mips_o32 -abi_s390_32 -abi_s390_64 -abi_x86_32 abi_x86_64 -abi_x86_x32 -doc >x11-libs/libXext-1.3.5:0 -abi_mips_n32 -abi_mips_n64 -abi_mips_o32 -abi_s390_32 -abi_s390_64 -abi_x86_32 abi_x86_64 -abi_x86_x32 -doc >x11-libs/libXmu-1.1.4:0 -abi_mips_n32 -abi_mips_n64 -abi_mips_o32 -abi_s390_32 -abi_s390_64 -abi_x86_32 abi_x86_64 -abi_x86_x32 -doc >x11-libs/libXt-1.2.1:0 -abi_mips_n32 -abi_mips_n64 -abi_mips_o32 -abi_s390_32 -abi_s390_64 -abi_x86_32 abi_x86_64 -abi_x86_x32 -doc -test >x11-libs/pixman-0.42.2:0 -abi_mips_n32 -abi_mips_n64 -abi_mips_o32 -abi_s390_32 -abi_s390_64 -abi_x86_32 abi_x86_64 -abi_x86_x32 -cpu_flags_arm_iwmmxt -cpu_flags_arm_iwmmxt2 -cpu_flags_arm_neon -cpu_flags_ppc_altivec cpu_flags_x86_mmxext cpu_flags_x86_sse2 cpu_flags_x86_ssse3 -loongson2f -static-libs -test >x11-libs/xtrans-1.4.0:0 -doc >x11-misc/compose-tables-1.8.4:0 >x11-misc/shared-mime-info-2.2:0 -test >x11-misc/xdg-utils-1.1.3_p20210805-r1:0 -dbus -doc -gnome > > >####################### ># build.log # >####################### > >>>> Unpacking source... >>>> Unpacking ltrace_0.7.3.orig.tar.bz2 to /var/tmp/portage/dev-util/ltrace-0.7.3.6.1/work >>>> Unpacking ltrace_0.7.3-6.1.debian.tar.xz to /var/tmp/portage/dev-util/ltrace-0.7.3.6.1/work >>>> Source unpacked in /var/tmp/portage/dev-util/ltrace-0.7.3.6.1/work >>>> Preparing source in /var/tmp/portage/dev-util/ltrace-0.7.3.6.1/work/ltrace-0.7.3 ... > * Applying 01-avoid-libstdc++ ... > [ ok ] > * Applying 02-printf-p ... > [ ok ] > * Applying 03-alpha-debug.h ... > [ ok ] > * Applying 04-compile-warning ... > [ ok ] > * Applying 05-sparc-ftbfs ... > [ ok ] > * Applying 06-unexpected-breakpoint ... > [ ok ] > * Applying ltrace-0.7.3-test-protos.patch ... > [ ok ] > * Applying ltrace-0.7.3-alpha-protos.patch ... > [ ok ] > * Applying ltrace-0.7.3-ia64.patch ... > [ ok ] > * Applying ltrace-0.7.3-print-test-pie.patch ... > [ ok ] > * Applying ltrace-0.7.3-ia64-pid_t.patch ... > [ ok ] > * Applying ltrace-0.7.3-musl-host.patch ... > [ ok ] > * Applying ltrace-0.7.3-no-error.h.patch ... > [ ok ] > * Applying ltrace-0.7.3-no-error.h-2.patch ... > [ ok ] > * Applying ltrace-0.7.3-no-REG_NOERROR.patch ... > [ ok ] > * Applying ltrace-0.7.3-pid_t.patch ... > [ ok ] > * Applying ltrace-0.7.3-tuple-tests.patch ... > [ ok ] > * Applying ltrace-0.7.3-CXX-for-tests.patch ... > [ ok ] > * Applying ltrace-0.7.3-test-glibc-2.33.patch ... > [ ok ] > * Applying ltrace-0.7.3-disable-munmap-test.patch ... > [ ok ] > * Running eautoreconf in '/var/tmp/portage/dev-util/ltrace-0.7.3.6.1/work/ltrace-0.7.3' ... > * Running 'libtoolize --install --copy --force --automake' ... > [ ok ] > * Running 'aclocal -I config/m4 --system-acdir=/var/tmp/portage/dev-util/ltrace-0.7.3.6.1/temp/aclocal' ... > [ ok ] > * Running 'autoconf --force' ... > [ ok ] > * Running 'autoheader' ... > [ ok ] > * Running 'automake --add-missing --copy --foreign --force-missing' ... > [ ok ] > * Running elibtoolize in: ltrace-0.7.3/ > * Running elibtoolize in: ltrace-0.7.3/config/autoconf/ > * Applying portage/1.2.0 patch ... > * Applying sed/1.5.6 patch ... > * Applying as-needed/2.4.3 patch ... >>>> Source prepared. >>>> Configuring source in /var/tmp/portage/dev-util/ltrace-0.7.3.6.1/work/ltrace-0.7.3 ... > * econf: updating ltrace-0.7.3/config.sub with /usr/share/gnuconfig/config.sub > * econf: updating ltrace-0.7.3/config.guess with /usr/share/gnuconfig/config.guess > * econf: updating ltrace-0.7.3/config/autoconf/config.sub with /usr/share/gnuconfig/config.sub > * econf: updating ltrace-0.7.3/config/autoconf/config.guess with /usr/share/gnuconfig/config.guess >./configure --prefix=/usr --build=x86_64-pc-linux-gnu --host=x86_64-pc-linux-gnu --mandir=/usr/share/man --infodir=/usr/share/info --datadir=/usr/share --sysconfdir=/etc --localstatedir=/var/lib --disable-dependency-tracking --disable-silent-rules --docdir=/usr/share/doc/ltrace-0.7.3.6.1 --htmldir=/usr/share/doc/ltrace-0.7.3.6.1/html --with-sysroot=/ --libdir=/usr/lib64 --disable-werror --enable-debug --without-libunwind >checking build system type... x86_64-pc-linux-gnu >checking host system type... x86_64-pc-linux-gnu >checking for x86_64-pc-linux-gnu-gcc... x86_64-pc-linux-gnu-gcc >checking whether the C compiler works... yes >checking for C compiler default output file name... a.out >checking for suffix of executables... >checking whether we are cross compiling... no >checking for suffix of object files... o >checking whether the compiler supports GNU C... yes >checking whether x86_64-pc-linux-gnu-gcc accepts -g... yes >checking for x86_64-pc-linux-gnu-gcc option to enable C11 features... none needed >checking whether x86_64-pc-linux-gnu-gcc understands -c and -o together... yes >checking for x86_64-pc-linux-gnu-g++... x86_64-pc-linux-gnu-g++ >checking whether the compiler supports GNU C++... yes >checking whether x86_64-pc-linux-gnu-g++ accepts -g... yes >checking for x86_64-pc-linux-gnu-g++ option to enable C++11 features... none needed >checking how to print strings... printf >checking for a sed that does not truncate output... /bin/sed >checking for grep that handles long lines and -e... /bin/grep >checking for egrep... /bin/grep -E >checking for fgrep... /bin/grep -F >checking for ld used by x86_64-pc-linux-gnu-gcc... /usr/x86_64-pc-linux-gnu/bin/ld >checking if the linker (/usr/x86_64-pc-linux-gnu/bin/ld) is GNU ld... yes >checking for BSD- or MS-compatible name lister (nm)... /usr/bin/x86_64-pc-linux-gnu-nm -B >checking the name lister (/usr/bin/x86_64-pc-linux-gnu-nm -B) interface... BSD nm >checking whether ln -s works... yes >checking the maximum length of command line arguments... 1572864 >checking how to convert x86_64-pc-linux-gnu file names to x86_64-pc-linux-gnu format... func_convert_file_noop >checking how to convert x86_64-pc-linux-gnu file names to toolchain format... func_convert_file_noop >checking for /usr/x86_64-pc-linux-gnu/bin/ld option to reload object files... -r >checking for x86_64-pc-linux-gnu-file... no >checking for file... file >checking for x86_64-pc-linux-gnu-objdump... x86_64-pc-linux-gnu-objdump >checking how to recognize dependent libraries... pass_all >checking for x86_64-pc-linux-gnu-dlltool... no >checking for dlltool... no >checking how to associate runtime and link libraries... printf %s\n >checking for x86_64-pc-linux-gnu-ar... x86_64-pc-linux-gnu-ar >checking for archiver @FILE support... @ >checking for x86_64-pc-linux-gnu-strip... x86_64-pc-linux-gnu-strip >checking for x86_64-pc-linux-gnu-ranlib... x86_64-pc-linux-gnu-ranlib >checking for gawk... gawk >checking command to parse /usr/bin/x86_64-pc-linux-gnu-nm -B output from x86_64-pc-linux-gnu-gcc object... ok >checking for sysroot... / >checking for a working dd... /bin/dd >checking how to truncate binary pipes... /bin/dd bs=4096 count=1 >checking for x86_64-pc-linux-gnu-mt... no >checking for mt... no >checking if : is a manifest tool... no >checking for stdio.h... yes >checking for stdlib.h... yes >checking for string.h... yes >checking for inttypes.h... yes >checking for stdint.h... yes >checking for strings.h... yes >checking for sys/stat.h... yes >checking for sys/types.h... yes >checking for unistd.h... yes >checking for vfork.h... no >checking for dlfcn.h... yes >checking for objdir... .libs >checking if x86_64-pc-linux-gnu-gcc supports -fno-rtti -fno-exceptions... no >checking for x86_64-pc-linux-gnu-gcc option to produce PIC... -fPIC -DPIC >checking if x86_64-pc-linux-gnu-gcc PIC flag -fPIC -DPIC works... yes >checking if x86_64-pc-linux-gnu-gcc static flag -static works... yes >checking if x86_64-pc-linux-gnu-gcc supports -c -o file.o... yes >checking if x86_64-pc-linux-gnu-gcc supports -c -o file.o... (cached) yes >checking whether the x86_64-pc-linux-gnu-gcc linker (/usr/x86_64-pc-linux-gnu/bin/ld -m elf_x86_64) supports shared libraries... yes >checking whether -lc should be explicitly linked in... no >checking dynamic linker characteristics... GNU/Linux ld.so >checking how to hardcode library paths into programs... immediate >checking whether stripping libraries is possible... yes >checking if libtool supports shared libraries... yes >checking whether to build shared libraries... yes >checking whether to build static libraries... yes >checking how to run the C++ preprocessor... x86_64-pc-linux-gnu-g++ -E >checking for ld used by x86_64-pc-linux-gnu-g++... /usr/x86_64-pc-linux-gnu/bin/ld -m elf_x86_64 >checking if the linker (/usr/x86_64-pc-linux-gnu/bin/ld -m elf_x86_64) is GNU ld... yes >checking whether the x86_64-pc-linux-gnu-g++ linker (/usr/x86_64-pc-linux-gnu/bin/ld -m elf_x86_64) supports shared libraries... yes >checking for x86_64-pc-linux-gnu-g++ option to produce PIC... -fPIC -DPIC >checking if x86_64-pc-linux-gnu-g++ PIC flag -fPIC -DPIC works... yes >checking if x86_64-pc-linux-gnu-g++ static flag -static works... yes >checking if x86_64-pc-linux-gnu-g++ supports -c -o file.o... yes >checking if x86_64-pc-linux-gnu-g++ supports -c -o file.o... (cached) yes >checking whether the x86_64-pc-linux-gnu-g++ linker (/usr/x86_64-pc-linux-gnu/bin/ld -m elf_x86_64) supports shared libraries... yes >checking dynamic linker characteristics... (cached) GNU/Linux ld.so >checking how to hardcode library paths into programs... immediate >checking for a BSD-compatible install... /usr/lib/portage/python3.11/ebuild-helpers/xattr/install -c >checking whether build environment is sane... yes >checking for a race-free mkdir -p... /bin/mkdir -p >checking whether make sets $(MAKE)... yes >checking whether make supports the include directive... yes (GNU style) >checking whether make supports nested variables... yes >checking dependency style of x86_64-pc-linux-gnu-gcc... none >checking dependency style of x86_64-pc-linux-gnu-g++... none >checking whether to enable maintainer-specific portions of Makefiles... no >checking for elf.h... yes >checking for gelf.h... yes >checking for elf_begin in -lelf... yes >checking for cplus_demangle in -liberty... yes >checking for __cxa_demangle in -lsupc++... yes >checking for __cxa_demangle in -lstdc++... yes >checking for selinux/selinux.h... (cached) no >checking for security_get_boolean_active in -lselinux... (cached) no >checking for libunwind.h... no >checking for libunwind-ptrace.h... no >checking whether to use libunwind support... no >checking whether elf_begin accepts ELF_C_READ_MMAP... yes >checking whether elf_hash takes a char* argument... yes >checking for fcntl.h... yes >checking for limits.h... yes >checking for stddef.h... yes >checking for stdint.h... (cached) yes >checking for stdlib.h... (cached) yes >checking for string.h... (cached) yes >checking for sys/ioctl.h... yes >checking for sys/param.h... yes >checking for sys/time.h... yes >checking for unistd.h... (cached) yes >checking how to run the C preprocessor... x86_64-pc-linux-gnu-gcc -E >checking for uid_t in sys/types.h... yes >checking for inline... inline >checking for pid_t... yes >checking for size_t... yes >checking size of long... 8 >checking for error_at_line... yes >checking for fork... yes >checking for vfork... yes >checking for working fork... yes >checking for working vfork... (cached) yes >checking for alarm... yes >checking for atexit... yes >checking for getcwd... yes >checking for gettimeofday... yes >checking for memset... yes >checking for mkdir... yes >checking for rmdir... yes >checking for strchr... yes >checking for strdup... yes >checking for strerror... yes >checking for strtol... yes >checking for strtoul... yes >checking whether to enable debugging... yes >checking that generated files are newer than configure... done >configure: creating ./config.status >config.status: creating Makefile >config.status: creating sysdeps/Makefile >config.status: creating sysdeps/linux-gnu/Makefile >config.status: creating sysdeps/linux-gnu/alpha/Makefile >config.status: creating sysdeps/linux-gnu/arm/Makefile >config.status: creating sysdeps/linux-gnu/cris/Makefile >config.status: creating sysdeps/linux-gnu/ia64/Makefile >config.status: creating sysdeps/linux-gnu/m68k/Makefile >config.status: creating sysdeps/linux-gnu/mips/Makefile >config.status: creating sysdeps/linux-gnu/ppc/Makefile >config.status: creating sysdeps/linux-gnu/s390/Makefile >config.status: creating sysdeps/linux-gnu/sparc/Makefile >config.status: creating sysdeps/linux-gnu/x86/Makefile >config.status: creating testsuite/Makefile >config.status: creating testsuite/ltrace.main/Makefile >config.status: creating testsuite/ltrace.minor/Makefile >config.status: creating testsuite/ltrace.torture/Makefile >config.status: creating config.h >config.status: executing libtool commands >config.status: executing depfiles commands >>>> Source configured. >>>> Compiling source in /var/tmp/portage/dev-util/ltrace-0.7.3.6.1/work/ltrace-0.7.3 ... >make -j16 >make all-recursive >make[1]: Entering directory '/var/tmp/portage/dev-util/ltrace-0.7.3.6.1/work/ltrace-0.7.3' >Making all in sysdeps >make[2]: Entering directory '/var/tmp/portage/dev-util/ltrace-0.7.3.6.1/work/ltrace-0.7.3/sysdeps' >Making all in linux-gnu >make[3]: Entering directory '/var/tmp/portage/dev-util/ltrace-0.7.3.6.1/work/ltrace-0.7.3/sysdeps/linux-gnu' >Making all in x86 >make[4]: Entering directory '/var/tmp/portage/dev-util/ltrace-0.7.3.6.1/work/ltrace-0.7.3/sysdeps/linux-gnu/x86' >/bin/sh ../../../libtool --tag=CC --mode=compile x86_64-pc-linux-gnu-gcc -DHAVE_CONFIG_H -I. -I../../.. -I../../../sysdeps/linux-gnu/x86 -I../../../sysdeps/linux-gnu -I../../../sysdeps -I../../.. -Wall -Wsign-compare -Wfloat-equal -Wformat-security -O2 -march=x86-64 -pipe -pipe -frecord-gcc-switches -fno-diagnostics-color -fmessage-length=0 -c -o plt.lo plt.c >/bin/sh ../../../libtool --tag=CC --mode=compile x86_64-pc-linux-gnu-gcc -DHAVE_CONFIG_H -I. -I../../.. -I../../../sysdeps/linux-gnu/x86 -I../../../sysdeps/linux-gnu -I../../../sysdeps -I../../.. -Wall -Wsign-compare -Wfloat-equal -Wformat-security -O2 -march=x86-64 -pipe -pipe -frecord-gcc-switches -fno-diagnostics-color -fmessage-length=0 -c -o regs.lo regs.c >/bin/sh ../../../libtool --tag=CC --mode=compile x86_64-pc-linux-gnu-gcc -DHAVE_CONFIG_H -I. -I../../.. -I../../../sysdeps/linux-gnu/x86 -I../../../sysdeps/linux-gnu -I../../../sysdeps -I../../.. -Wall -Wsign-compare -Wfloat-equal -Wformat-security -O2 -march=x86-64 -pipe -pipe -frecord-gcc-switches -fno-diagnostics-color -fmessage-length=0 -c -o trace.lo trace.c >/bin/sh ../../../libtool --tag=CC --mode=compile x86_64-pc-linux-gnu-gcc -DHAVE_CONFIG_H -I. -I../../.. -I../../../sysdeps/linux-gnu/x86 -I../../../sysdeps/linux-gnu -I../../../sysdeps -I../../.. -Wall -Wsign-compare -Wfloat-equal -Wformat-security -O2 -march=x86-64 -pipe -pipe -frecord-gcc-switches -fno-diagnostics-color -fmessage-length=0 -c -o fetch.lo fetch.c >libtool: compile: x86_64-pc-linux-gnu-gcc -DHAVE_CONFIG_H -I. -I../../.. -I../../../sysdeps/linux-gnu/x86 -I../../../sysdeps/linux-gnu -I../../../sysdeps -I../../.. -Wall -Wsign-compare -Wfloat-equal -Wformat-security -O2 -march=x86-64 -pipe -pipe -frecord-gcc-switches -fno-diagnostics-color -fmessage-length=0 -c fetch.c -fPIC -DPIC -o .libs/fetch.o >libtool: compile: x86_64-pc-linux-gnu-gcc -DHAVE_CONFIG_H -I. -I../../.. -I../../../sysdeps/linux-gnu/x86 -I../../../sysdeps/linux-gnu -I../../../sysdeps -I../../.. -Wall -Wsign-compare -Wfloat-equal -Wformat-security -O2 -march=x86-64 -pipe -pipe -frecord-gcc-switches -fno-diagnostics-color -fmessage-length=0 -c plt.c -fPIC -DPIC -o .libs/plt.o >libtool: compile: x86_64-pc-linux-gnu-gcc -DHAVE_CONFIG_H -I. -I../../.. -I../../../sysdeps/linux-gnu/x86 -I../../../sysdeps/linux-gnu -I../../../sysdeps -I../../.. -Wall -Wsign-compare -Wfloat-equal -Wformat-security -O2 -march=x86-64 -pipe -pipe -frecord-gcc-switches -fno-diagnostics-color -fmessage-length=0 -c trace.c -fPIC -DPIC -o .libs/trace.o >libtool: compile: x86_64-pc-linux-gnu-gcc -DHAVE_CONFIG_H -I. -I../../.. -I../../../sysdeps/linux-gnu/x86 -I../../../sysdeps/linux-gnu -I../../../sysdeps -I../../.. -Wall -Wsign-compare -Wfloat-equal -Wformat-security -O2 -march=x86-64 -pipe -pipe -frecord-gcc-switches -fno-diagnostics-color -fmessage-length=0 -c regs.c -fPIC -DPIC -o .libs/regs.o >libtool: compile: x86_64-pc-linux-gnu-gcc -DHAVE_CONFIG_H -I. -I../../.. -I../../../sysdeps/linux-gnu/x86 -I../../../sysdeps/linux-gnu -I../../../sysdeps -I../../.. -Wall -Wsign-compare -Wfloat-equal -Wformat-security -O2 -march=x86-64 -pipe -pipe -frecord-gcc-switches -fno-diagnostics-color -fmessage-length=0 -c plt.c -o plt.o >/dev/null 2>&1 >libtool: compile: x86_64-pc-linux-gnu-gcc -DHAVE_CONFIG_H -I. -I../../.. -I../../../sysdeps/linux-gnu/x86 -I../../../sysdeps/linux-gnu -I../../../sysdeps -I../../.. -Wall -Wsign-compare -Wfloat-equal -Wformat-security -O2 -march=x86-64 -pipe -pipe -frecord-gcc-switches -fno-diagnostics-color -fmessage-length=0 -c regs.c -o regs.o >/dev/null 2>&1 >libtool: compile: x86_64-pc-linux-gnu-gcc -DHAVE_CONFIG_H -I. -I../../.. -I../../../sysdeps/linux-gnu/x86 -I../../../sysdeps/linux-gnu -I../../../sysdeps -I../../.. -Wall -Wsign-compare -Wfloat-equal -Wformat-security -O2 -march=x86-64 -pipe -pipe -frecord-gcc-switches -fno-diagnostics-color -fmessage-length=0 -c trace.c -o trace.o >/dev/null 2>&1 >libtool: compile: x86_64-pc-linux-gnu-gcc -DHAVE_CONFIG_H -I. -I../../.. -I../../../sysdeps/linux-gnu/x86 -I../../../sysdeps/linux-gnu -I../../../sysdeps -I../../.. -Wall -Wsign-compare -Wfloat-equal -Wformat-security -O2 -march=x86-64 -pipe -pipe -frecord-gcc-switches -fno-diagnostics-color -fmessage-length=0 -c fetch.c -o fetch.o >/dev/null 2>&1 >/bin/sh ../../../libtool --tag=CC --mode=link x86_64-pc-linux-gnu-gcc -Wall -Wsign-compare -Wfloat-equal -Wformat-security -O2 -march=x86-64 -pipe -pipe -frecord-gcc-switches -fno-diagnostics-color -fmessage-length=0 -Wl,-O1 -Wl,--as-needed -Wl,--defsym=__gentoo_check_ldflags__=0 -o ../libcpu.la plt.lo regs.lo trace.lo fetch.lo -lelf >libtool: link: x86_64-pc-linux-gnu-ar cr ../.libs/libcpu.a .libs/plt.o .libs/regs.o .libs/trace.o .libs/fetch.o >libtool: link: x86_64-pc-linux-gnu-ranlib ../.libs/libcpu.a >libtool: link: ( cd "../.libs" && rm -f "libcpu.la" && ln -s "../libcpu.la" "libcpu.la" ) >make[4]: Leaving directory '/var/tmp/portage/dev-util/ltrace-0.7.3.6.1/work/ltrace-0.7.3/sysdeps/linux-gnu/x86' >make[4]: Entering directory '/var/tmp/portage/dev-util/ltrace-0.7.3.6.1/work/ltrace-0.7.3/sysdeps/linux-gnu' >/bin/sh ../../libtool --tag=CC --mode=compile x86_64-pc-linux-gnu-gcc -DHAVE_CONFIG_H -I. -I../.. -I../../sysdeps/linux-gnu/x86 -I../../sysdeps/linux-gnu -I../../sysdeps -I../.. -Wall -Wsign-compare -Wfloat-equal -Wformat-security -O2 -march=x86-64 -pipe -pipe -frecord-gcc-switches -fno-diagnostics-color -fmessage-length=0 -c -o events.lo events.c >/bin/sh ../../libtool --tag=CC --mode=compile x86_64-pc-linux-gnu-gcc -DHAVE_CONFIG_H -I. -I../.. -I../../sysdeps/linux-gnu/x86 -I../../sysdeps/linux-gnu -I../../sysdeps -I../.. -Wall -Wsign-compare -Wfloat-equal -Wformat-security -O2 -march=x86-64 -pipe -pipe -frecord-gcc-switches -fno-diagnostics-color -fmessage-length=0 -c -o trace.lo trace.c >/bin/sh ../../libtool --tag=CC --mode=compile x86_64-pc-linux-gnu-gcc -DHAVE_CONFIG_H -I. -I../.. -I../../sysdeps/linux-gnu/x86 -I../../sysdeps/linux-gnu -I../../sysdeps -I../.. -Wall -Wsign-compare -Wfloat-equal -Wformat-security -O2 -march=x86-64 -pipe -pipe -frecord-gcc-switches -fno-diagnostics-color -fmessage-length=0 -c -o proc.lo proc.c >/bin/sh ../../libtool --tag=CC --mode=compile x86_64-pc-linux-gnu-gcc -DHAVE_CONFIG_H -I. -I../.. -I../../sysdeps/linux-gnu/x86 -I../../sysdeps/linux-gnu -I../../sysdeps -I../.. -Wall -Wsign-compare -Wfloat-equal -Wformat-security -O2 -march=x86-64 -pipe -pipe -frecord-gcc-switches -fno-diagnostics-color -fmessage-length=0 -c -o breakpoint.lo breakpoint.c >libtool: compile: x86_64-pc-linux-gnu-gcc -DHAVE_CONFIG_H -I. -I../.. -I../../sysdeps/linux-gnu/x86 -I../../sysdeps/linux-gnu -I../../sysdeps -I../.. -Wall -Wsign-compare -Wfloat-equal -Wformat-security -O2 -march=x86-64 -pipe -pipe -frecord-gcc-switches -fno-diagnostics-color -fmessage-length=0 -c events.c -fPIC -DPIC -o .libs/events.o >libtool: compile: x86_64-pc-linux-gnu-gcc -DHAVE_CONFIG_H -I. -I../.. -I../../sysdeps/linux-gnu/x86 -I../../sysdeps/linux-gnu -I../../sysdeps -I../.. -Wall -Wsign-compare -Wfloat-equal -Wformat-security -O2 -march=x86-64 -pipe -pipe -frecord-gcc-switches -fno-diagnostics-color -fmessage-length=0 -c proc.c -fPIC -DPIC -o .libs/proc.o >libtool: compile: x86_64-pc-linux-gnu-gcc -DHAVE_CONFIG_H -I. -I../.. -I../../sysdeps/linux-gnu/x86 -I../../sysdeps/linux-gnu -I../../sysdeps -I../.. -Wall -Wsign-compare -Wfloat-equal -Wformat-security -O2 -march=x86-64 -pipe -pipe -frecord-gcc-switches -fno-diagnostics-color -fmessage-length=0 -c breakpoint.c -fPIC -DPIC -o .libs/breakpoint.o >libtool: compile: x86_64-pc-linux-gnu-gcc -DHAVE_CONFIG_H -I. -I../.. -I../../sysdeps/linux-gnu/x86 -I../../sysdeps/linux-gnu -I../../sysdeps -I../.. -Wall -Wsign-compare -Wfloat-equal -Wformat-security -O2 -march=x86-64 -pipe -pipe -frecord-gcc-switches -fno-diagnostics-color -fmessage-length=0 -c trace.c -fPIC -DPIC -o .libs/trace.o >proc.c: In function 'process_tasks': >proc.c:245:17: warning: 'readdir_r' is deprecated [-Wdeprecated-declarations[https://gcc.gnu.org/onlinedocs/gcc/Warning-Options.html#index-Wdeprecated-declarations]] > 245 | if (readdir_r(d, &entry, &result) != 0) { > | ^~ >In file included from proc.c:31: >/usr/include/dirent.h:185:12: note: declared here > 185 | extern int readdir_r (DIR *__restrict __dirp, > | ^~~~~~~~~ >libtool: compile: x86_64-pc-linux-gnu-gcc -DHAVE_CONFIG_H -I. -I../.. -I../../sysdeps/linux-gnu/x86 -I../../sysdeps/linux-gnu -I../../sysdeps -I../.. -Wall -Wsign-compare -Wfloat-equal -Wformat-security -O2 -march=x86-64 -pipe -pipe -frecord-gcc-switches -fno-diagnostics-color -fmessage-length=0 -c breakpoint.c -o breakpoint.o >/dev/null 2>&1 >libtool: compile: x86_64-pc-linux-gnu-gcc -DHAVE_CONFIG_H -I. -I../.. -I../../sysdeps/linux-gnu/x86 -I../../sysdeps/linux-gnu -I../../sysdeps -I../.. -Wall -Wsign-compare -Wfloat-equal -Wformat-security -O2 -march=x86-64 -pipe -pipe -frecord-gcc-switches -fno-diagnostics-color -fmessage-length=0 -c events.c -o events.o >/dev/null 2>&1 >libtool: compile: x86_64-pc-linux-gnu-gcc -DHAVE_CONFIG_H -I. -I../.. -I../../sysdeps/linux-gnu/x86 -I../../sysdeps/linux-gnu -I../../sysdeps -I../.. -Wall -Wsign-compare -Wfloat-equal -Wformat-security -O2 -march=x86-64 -pipe -pipe -frecord-gcc-switches -fno-diagnostics-color -fmessage-length=0 -c proc.c -o proc.o >/dev/null 2>&1 >libtool: compile: x86_64-pc-linux-gnu-gcc -DHAVE_CONFIG_H -I. -I../.. -I../../sysdeps/linux-gnu/x86 -I../../sysdeps/linux-gnu -I../../sysdeps -I../.. -Wall -Wsign-compare -Wfloat-equal -Wformat-security -O2 -march=x86-64 -pipe -pipe -frecord-gcc-switches -fno-diagnostics-color -fmessage-length=0 -c trace.c -o trace.o >/dev/null 2>&1 >/bin/sh ../../libtool --tag=CC --mode=link x86_64-pc-linux-gnu-gcc -Wall -Wsign-compare -Wfloat-equal -Wformat-security -O2 -march=x86-64 -pipe -pipe -frecord-gcc-switches -fno-diagnostics-color -fmessage-length=0 -Wl,-O1 -Wl,--as-needed -Wl,--defsym=__gentoo_check_ldflags__=0 -o ../libos.la events.lo trace.lo proc.lo breakpoint.lo libcpu.la -lelf >libtool: link: (cd ../.libs/libos.lax/libcpu.a && x86_64-pc-linux-gnu-ar x "/var/tmp/portage/dev-util/ltrace-0.7.3.6.1/work/ltrace-0.7.3/sysdeps/linux-gnu/./.libs/libcpu.a") >copying selected object files to avoid basename conflicts... >libtool: link: ln ../.libs/libos.lax/libcpu.a/trace.o ../.libs/libos.lax/lt1-trace.o || cp ../.libs/libos.lax/libcpu.a/trace.o ../.libs/libos.lax/lt1-trace.o >libtool: link: x86_64-pc-linux-gnu-ar cr ../.libs/libos.a .libs/events.o .libs/trace.o .libs/proc.o .libs/breakpoint.o ../.libs/libos.lax/libcpu.a/fetch.o ../.libs/libos.lax/libcpu.a/plt.o ../.libs/libos.lax/libcpu.a/regs.o ../.libs/libos.lax/lt1-trace.o >libtool: link: x86_64-pc-linux-gnu-ranlib ../.libs/libos.a >libtool: link: rm -fr ../.libs/libos.lax ../.libs/libos.lax >libtool: link: ( cd "../.libs" && rm -f "libos.la" && ln -s "../libos.la" "libos.la" ) >make[4]: Leaving directory '/var/tmp/portage/dev-util/ltrace-0.7.3.6.1/work/ltrace-0.7.3/sysdeps/linux-gnu' >make[3]: Leaving directory '/var/tmp/portage/dev-util/ltrace-0.7.3.6.1/work/ltrace-0.7.3/sysdeps/linux-gnu' >make[3]: Entering directory '/var/tmp/portage/dev-util/ltrace-0.7.3.6.1/work/ltrace-0.7.3/sysdeps' >make[3]: Nothing to be done for 'all-am'. >make[3]: Leaving directory '/var/tmp/portage/dev-util/ltrace-0.7.3.6.1/work/ltrace-0.7.3/sysdeps' >make[2]: Leaving directory '/var/tmp/portage/dev-util/ltrace-0.7.3.6.1/work/ltrace-0.7.3/sysdeps' >Making all in . >make[2]: Entering directory '/var/tmp/portage/dev-util/ltrace-0.7.3.6.1/work/ltrace-0.7.3' >x86_64-pc-linux-gnu-gcc -DHAVE_CONFIG_H -I. -I./sysdeps/linux-gnu/x86 -I./sysdeps/linux-gnu -I./sysdeps -I. -DSYSCONFDIR=\"/etc\" -Wall -Wsign-compare -Wfloat-equal -Wformat-security -O2 -march=x86-64 -pipe -pipe -frecord-gcc-switches -fno-diagnostics-color -fmessage-length=0 -c -o main.o main.c >/bin/sh ./libtool --tag=CC --mode=compile x86_64-pc-linux-gnu-gcc -DHAVE_CONFIG_H -I. -I./sysdeps/linux-gnu/x86 -I./sysdeps/linux-gnu -I./sysdeps -I. -DSYSCONFDIR=\"/etc\" -Wall -Wsign-compare -Wfloat-equal -Wformat-security -O2 -march=x86-64 -pipe -pipe -frecord-gcc-switches -fno-diagnostics-color -fmessage-length=0 -c -o breakpoints.lo breakpoints.c >/bin/sh ./libtool --tag=CC --mode=compile x86_64-pc-linux-gnu-gcc -DHAVE_CONFIG_H -I. -I./sysdeps/linux-gnu/x86 -I./sysdeps/linux-gnu -I./sysdeps -I. -DSYSCONFDIR=\"/etc\" -Wall -Wsign-compare -Wfloat-equal -Wformat-security -O2 -march=x86-64 -pipe -pipe -frecord-gcc-switches -fno-diagnostics-color -fmessage-length=0 -c -o debug.lo debug.c >/bin/sh ./libtool --tag=CC --mode=compile x86_64-pc-linux-gnu-gcc -DHAVE_CONFIG_H -I. -I./sysdeps/linux-gnu/x86 -I./sysdeps/linux-gnu -I./sysdeps -I. -DSYSCONFDIR=\"/etc\" -Wall -Wsign-compare -Wfloat-equal -Wformat-security -O2 -march=x86-64 -pipe -pipe -frecord-gcc-switches -fno-diagnostics-color -fmessage-length=0 -c -o demangle.lo demangle.c >/bin/sh ./libtool --tag=CC --mode=compile x86_64-pc-linux-gnu-gcc -DHAVE_CONFIG_H -I. -I./sysdeps/linux-gnu/x86 -I./sysdeps/linux-gnu -I./sysdeps -I. -DSYSCONFDIR=\"/etc\" -Wall -Wsign-compare -Wfloat-equal -Wformat-security -O2 -march=x86-64 -pipe -pipe -frecord-gcc-switches -fno-diagnostics-color -fmessage-length=0 -c -o dict.lo dict.c >/bin/sh ./libtool --tag=CC --mode=compile x86_64-pc-linux-gnu-gcc -DHAVE_CONFIG_H -I. -I./sysdeps/linux-gnu/x86 -I./sysdeps/linux-gnu -I./sysdeps -I. -DSYSCONFDIR=\"/etc\" -Wall -Wsign-compare -Wfloat-equal -Wformat-security -O2 -march=x86-64 -pipe -pipe -frecord-gcc-switches -fno-diagnostics-color -fmessage-length=0 -c -o ltrace-elf.lo ltrace-elf.c >/bin/sh ./libtool --tag=CC --mode=compile x86_64-pc-linux-gnu-gcc -DHAVE_CONFIG_H -I. -I./sysdeps/linux-gnu/x86 -I./sysdeps/linux-gnu -I./sysdeps -I. -DSYSCONFDIR=\"/etc\" -Wall -Wsign-compare -Wfloat-equal -Wformat-security -O2 -march=x86-64 -pipe -pipe -frecord-gcc-switches -fno-diagnostics-color -fmessage-length=0 -c -o execute_program.lo execute_program.c >/bin/sh ./libtool --tag=CC --mode=compile x86_64-pc-linux-gnu-gcc -DHAVE_CONFIG_H -I. -I./sysdeps/linux-gnu/x86 -I./sysdeps/linux-gnu -I./sysdeps -I. -DSYSCONFDIR=\"/etc\" -Wall -Wsign-compare -Wfloat-equal -Wformat-security -O2 -march=x86-64 -pipe -pipe -frecord-gcc-switches -fno-diagnostics-color -fmessage-length=0 -c -o handle_event.lo handle_event.c >/bin/sh ./libtool --tag=CC --mode=compile x86_64-pc-linux-gnu-gcc -DHAVE_CONFIG_H -I. -I./sysdeps/linux-gnu/x86 -I./sysdeps/linux-gnu -I./sysdeps -I. -DSYSCONFDIR=\"/etc\" -Wall -Wsign-compare -Wfloat-equal -Wformat-security -O2 -march=x86-64 -pipe -pipe -frecord-gcc-switches -fno-diagnostics-color -fmessage-length=0 -c -o libltrace.lo libltrace.c >/bin/sh ./libtool --tag=CC --mode=compile x86_64-pc-linux-gnu-gcc -DHAVE_CONFIG_H -I. -I./sysdeps/linux-gnu/x86 -I./sysdeps/linux-gnu -I./sysdeps -I. -DSYSCONFDIR=\"/etc\" -Wall -Wsign-compare -Wfloat-equal -Wformat-security -O2 -march=x86-64 -pipe -pipe -frecord-gcc-switches -fno-diagnostics-color -fmessage-length=0 -c -o options.lo options.c >/bin/sh ./libtool --tag=CC --mode=compile x86_64-pc-linux-gnu-gcc -DHAVE_CONFIG_H -I. -I./sysdeps/linux-gnu/x86 -I./sysdeps/linux-gnu -I./sysdeps -I. -DSYSCONFDIR=\"/etc\" -Wall -Wsign-compare -Wfloat-equal -Wformat-security -O2 -march=x86-64 -pipe -pipe -frecord-gcc-switches -fno-diagnostics-color -fmessage-length=0 -c -o output.lo output.c >/bin/sh ./libtool --tag=CC --mode=compile x86_64-pc-linux-gnu-gcc -DHAVE_CONFIG_H -I. -I./sysdeps/linux-gnu/x86 -I./sysdeps/linux-gnu -I./sysdeps -I. -DSYSCONFDIR=\"/etc\" -Wall -Wsign-compare -Wfloat-equal -Wformat-security -O2 -march=x86-64 -pipe -pipe -frecord-gcc-switches -fno-diagnostics-color -fmessage-length=0 -c -o proc.lo proc.c >/bin/sh ./libtool --tag=CC --mode=compile x86_64-pc-linux-gnu-gcc -DHAVE_CONFIG_H -I. -I./sysdeps/linux-gnu/x86 -I./sysdeps/linux-gnu -I./sysdeps -I. -DSYSCONFDIR=\"/etc\" -Wall -Wsign-compare -Wfloat-equal -Wformat-security -O2 -march=x86-64 -pipe -pipe -frecord-gcc-switches -fno-diagnostics-color -fmessage-length=0 -c -o read_config_file.lo read_config_file.c >/bin/sh ./libtool --tag=CC --mode=compile x86_64-pc-linux-gnu-gcc -DHAVE_CONFIG_H -I. -I./sysdeps/linux-gnu/x86 -I./sysdeps/linux-gnu -I./sysdeps -I. -DSYSCONFDIR=\"/etc\" -Wall -Wsign-compare -Wfloat-equal -Wformat-security -O2 -march=x86-64 -pipe -pipe -frecord-gcc-switches -fno-diagnostics-color -fmessage-length=0 -c -o summary.lo summary.c >/bin/sh ./libtool --tag=CC --mode=compile x86_64-pc-linux-gnu-gcc -DHAVE_CONFIG_H -I. -I./sysdeps/linux-gnu/x86 -I./sysdeps/linux-gnu -I./sysdeps -I. -DSYSCONFDIR=\"/etc\" -Wall -Wsign-compare -Wfloat-equal -Wformat-security -O2 -march=x86-64 -pipe -pipe -frecord-gcc-switches -fno-diagnostics-color -fmessage-length=0 -c -o library.lo library.c >/bin/sh ./libtool --tag=CC --mode=compile x86_64-pc-linux-gnu-gcc -DHAVE_CONFIG_H -I. -I./sysdeps/linux-gnu/x86 -I./sysdeps/linux-gnu -I./sysdeps -I. -DSYSCONFDIR=\"/etc\" -Wall -Wsign-compare -Wfloat-equal -Wformat-security -O2 -march=x86-64 -pipe -pipe -frecord-gcc-switches -fno-diagnostics-color -fmessage-length=0 -c -o filter.lo filter.c >/bin/sh ./libtool --tag=CC --mode=compile x86_64-pc-linux-gnu-gcc -DHAVE_CONFIG_H -I. -I./sysdeps/linux-gnu/x86 -I./sysdeps/linux-gnu -I./sysdeps -I. -DSYSCONFDIR=\"/etc\" -Wall -Wsign-compare -Wfloat-equal -Wformat-security -O2 -march=x86-64 -pipe -pipe -frecord-gcc-switches -fno-diagnostics-color -fmessage-length=0 -c -o glob.lo glob.c >libtool: compile: x86_64-pc-linux-gnu-gcc -DHAVE_CONFIG_H -I. -I./sysdeps/linux-gnu/x86 -I./sysdeps/linux-gnu -I./sysdeps -I. -DSYSCONFDIR=\"/etc\" -Wall -Wsign-compare -Wfloat-equal -Wformat-security -O2 -march=x86-64 -pipe -pipe -frecord-gcc-switches -fno-diagnostics-color -fmessage-length=0 -c breakpoints.c -fPIC -DPIC -o .libs/breakpoints.o >libtool: compile: x86_64-pc-linux-gnu-gcc -DHAVE_CONFIG_H -I. -I./sysdeps/linux-gnu/x86 -I./sysdeps/linux-gnu -I./sysdeps -I. -DSYSCONFDIR=\"/etc\" -Wall -Wsign-compare -Wfloat-equal -Wformat-security -O2 -march=x86-64 -pipe -pipe -frecord-gcc-switches -fno-diagnostics-color -fmessage-length=0 -c demangle.c -fPIC -DPIC -o .libs/demangle.o >libtool: compile: x86_64-pc-linux-gnu-gcc -DHAVE_CONFIG_H -I. -I./sysdeps/linux-gnu/x86 -I./sysdeps/linux-gnu -I./sysdeps -I. -DSYSCONFDIR=\"/etc\" -Wall -Wsign-compare -Wfloat-equal -Wformat-security -O2 -march=x86-64 -pipe -pipe -frecord-gcc-switches -fno-diagnostics-color -fmessage-length=0 -c execute_program.c -fPIC -DPIC -o .libs/execute_program.o >libtool: compile: x86_64-pc-linux-gnu-gcc -DHAVE_CONFIG_H -I. -I./sysdeps/linux-gnu/x86 -I./sysdeps/linux-gnu -I./sysdeps -I. -DSYSCONFDIR=\"/etc\" -Wall -Wsign-compare -Wfloat-equal -Wformat-security -O2 -march=x86-64 -pipe -pipe -frecord-gcc-switches -fno-diagnostics-color -fmessage-length=0 -c ltrace-elf.c -fPIC -DPIC -o .libs/ltrace-elf.o >libtool: compile: x86_64-pc-linux-gnu-gcc -DHAVE_CONFIG_H -I. -I./sysdeps/linux-gnu/x86 -I./sysdeps/linux-gnu -I./sysdeps -I. -DSYSCONFDIR=\"/etc\" -Wall -Wsign-compare -Wfloat-equal -Wformat-security -O2 -march=x86-64 -pipe -pipe -frecord-gcc-switches -fno-diagnostics-color -fmessage-length=0 -c libltrace.c -fPIC -DPIC -o .libs/libltrace.o >libtool: compile: x86_64-pc-linux-gnu-gcc -DHAVE_CONFIG_H -I. -I./sysdeps/linux-gnu/x86 -I./sysdeps/linux-gnu -I./sysdeps -I. -DSYSCONFDIR=\"/etc\" -Wall -Wsign-compare -Wfloat-equal -Wformat-security -O2 -march=x86-64 -pipe -pipe -frecord-gcc-switches -fno-diagnostics-color -fmessage-length=0 -c dict.c -fPIC -DPIC -o .libs/dict.o >libtool: compile: x86_64-pc-linux-gnu-gcc -DHAVE_CONFIG_H -I. -I./sysdeps/linux-gnu/x86 -I./sysdeps/linux-gnu -I./sysdeps -I. -DSYSCONFDIR=\"/etc\" -Wall -Wsign-compare -Wfloat-equal -Wformat-security -O2 -march=x86-64 -pipe -pipe -frecord-gcc-switches -fno-diagnostics-color -fmessage-length=0 -c options.c -fPIC -DPIC -o .libs/options.o >libtool: compile: x86_64-pc-linux-gnu-gcc -DHAVE_CONFIG_H -I. -I./sysdeps/linux-gnu/x86 -I./sysdeps/linux-gnu -I./sysdeps -I. -DSYSCONFDIR=\"/etc\" -Wall -Wsign-compare -Wfloat-equal -Wformat-security -O2 -march=x86-64 -pipe -pipe -frecord-gcc-switches -fno-diagnostics-color -fmessage-length=0 -c read_config_file.c -fPIC -DPIC -o .libs/read_config_file.o >libtool: compile: x86_64-pc-linux-gnu-gcc -DHAVE_CONFIG_H -I. -I./sysdeps/linux-gnu/x86 -I./sysdeps/linux-gnu -I./sysdeps -I. -DSYSCONFDIR=\"/etc\" -Wall -Wsign-compare -Wfloat-equal -Wformat-security -O2 -march=x86-64 -pipe -pipe -frecord-gcc-switches -fno-diagnostics-color -fmessage-length=0 -c filter.c -fPIC -DPIC -o .libs/filter.o >libtool: compile: x86_64-pc-linux-gnu-gcc -DHAVE_CONFIG_H -I. -I./sysdeps/linux-gnu/x86 -I./sysdeps/linux-gnu -I./sysdeps -I. -DSYSCONFDIR=\"/etc\" -Wall -Wsign-compare -Wfloat-equal -Wformat-security -O2 -march=x86-64 -pipe -pipe -frecord-gcc-switches -fno-diagnostics-color -fmessage-length=0 -c summary.c -fPIC -DPIC -o .libs/summary.o >libtool: compile: x86_64-pc-linux-gnu-gcc -DHAVE_CONFIG_H -I. -I./sysdeps/linux-gnu/x86 -I./sysdeps/linux-gnu -I./sysdeps -I. -DSYSCONFDIR=\"/etc\" -Wall -Wsign-compare -Wfloat-equal -Wformat-security -O2 -march=x86-64 -pipe -pipe -frecord-gcc-switches -fno-diagnostics-color -fmessage-length=0 -c output.c -fPIC -DPIC -o .libs/output.o >libtool: compile: x86_64-pc-linux-gnu-gcc -DHAVE_CONFIG_H -I. -I./sysdeps/linux-gnu/x86 -I./sysdeps/linux-gnu -I./sysdeps -I. -DSYSCONFDIR=\"/etc\" -Wall -Wsign-compare -Wfloat-equal -Wformat-security -O2 -march=x86-64 -pipe -pipe -frecord-gcc-switches -fno-diagnostics-color -fmessage-length=0 -c proc.c -fPIC -DPIC -o .libs/proc.o >libtool: compile: x86_64-pc-linux-gnu-gcc -DHAVE_CONFIG_H -I. -I./sysdeps/linux-gnu/x86 -I./sysdeps/linux-gnu -I./sysdeps -I. -DSYSCONFDIR=\"/etc\" -Wall -Wsign-compare -Wfloat-equal -Wformat-security -O2 -march=x86-64 -pipe -pipe -frecord-gcc-switches -fno-diagnostics-color -fmessage-length=0 -c handle_event.c -fPIC -DPIC -o .libs/handle_event.o >libtool: compile: x86_64-pc-linux-gnu-gcc -DHAVE_CONFIG_H -I. -I./sysdeps/linux-gnu/x86 -I./sysdeps/linux-gnu -I./sysdeps -I. -DSYSCONFDIR=\"/etc\" -Wall -Wsign-compare -Wfloat-equal -Wformat-security -O2 -march=x86-64 -pipe -pipe -frecord-gcc-switches -fno-diagnostics-color -fmessage-length=0 -c library.c -fPIC -DPIC -o .libs/library.o >libtool: compile: x86_64-pc-linux-gnu-gcc -DHAVE_CONFIG_H -I. -I./sysdeps/linux-gnu/x86 -I./sysdeps/linux-gnu -I./sysdeps -I. -DSYSCONFDIR=\"/etc\" -Wall -Wsign-compare -Wfloat-equal -Wformat-security -O2 -march=x86-64 -pipe -pipe -frecord-gcc-switches -fno-diagnostics-color -fmessage-length=0 -c debug.c -fPIC -DPIC -o .libs/debug.o >libtool: compile: x86_64-pc-linux-gnu-gcc -DHAVE_CONFIG_H -I. -I./sysdeps/linux-gnu/x86 -I./sysdeps/linux-gnu -I./sysdeps -I. -DSYSCONFDIR=\"/etc\" -Wall -Wsign-compare -Wfloat-equal -Wformat-security -O2 -march=x86-64 -pipe -pipe -frecord-gcc-switches -fno-diagnostics-color -fmessage-length=0 -c glob.c -fPIC -DPIC -o .libs/glob.o >ltrace-elf.c: In function 'elf_read_u16': >ltrace-elf.c:221:56: warning: comparison of constant '0' with boolean expression is always false [-Wbool-compare[https://gcc.gnu.org/onlinedocs/gcc/Warning-Options.html#index-Wbool-compare]] > 221 | if (!need_data(data, offset, SIZE / 8) < 0) \ > | ^ >ltrace-elf.c:238:1: note: in expansion of macro 'DEF_READER' > 238 | DEF_READER(elf_read_u16, 16) > | ^~~~~~~~~~ >ltrace-elf.c:221:56: warning: logical not is only applied to the left hand side of comparison [-Wlogical-not-parentheses[https://gcc.gnu.org/onlinedocs/gcc/Warning-Options.html#index-Wlogical-not-parentheses]] > 221 | if (!need_data(data, offset, SIZE / 8) < 0) \ > | ^ >ltrace-elf.c:238:1: note: in expansion of macro 'DEF_READER' > 238 | DEF_READER(elf_read_u16, 16) > | ^~~~~~~~~~ >ltrace-elf.c:221:21: note: add parentheses around left hand side expression to silence this warning > 221 | if (!need_data(data, offset, SIZE / 8) < 0) \ > | ^~~~~~~~~~~~~~~~~~~~~~~~~~~~~~~~~~ >ltrace-elf.c:238:1: note: in expansion of macro 'DEF_READER' > 238 | DEF_READER(elf_read_u16, 16) > | ^~~~~~~~~~ >ltrace-elf.c: In function 'elf_read_u32': >ltrace-elf.c:221:56: warning: comparison of constant '0' with boolean expression is always false [-Wbool-compare[https://gcc.gnu.org/onlinedocs/gcc/Warning-Options.html#index-Wbool-compare]] > 221 | if (!need_data(data, offset, SIZE / 8) < 0) \ > | ^ >ltrace-elf.c:239:1: note: in expansion of macro 'DEF_READER' > 239 | DEF_READER(elf_read_u32, 32) > | ^~~~~~~~~~ >ltrace-elf.c:221:56: warning: logical not is only applied to the left hand side of comparison [-Wlogical-not-parentheses[https://gcc.gnu.org/onlinedocs/gcc/Warning-Options.html#index-Wlogical-not-parentheses]] > 221 | if (!need_data(data, offset, SIZE / 8) < 0) \ > | ^ >ltrace-elf.c:239:1: note: in expansion of macro 'DEF_READER' > 239 | DEF_READER(elf_read_u32, 32) > | ^~~~~~~~~~ >ltrace-elf.c:221:21: note: add parentheses around left hand side expression to silence this warning > 221 | if (!need_data(data, offset, SIZE / 8) < 0) \ > | ^~~~~~~~~~~~~~~~~~~~~~~~~~~~~~~~~~ >ltrace-elf.c:239:1: note: in expansion of macro 'DEF_READER' > 239 | DEF_READER(elf_read_u32, 32) > | ^~~~~~~~~~ >ltrace-elf.c: In function 'elf_read_u64': >ltrace-elf.c:221:56: warning: comparison of constant '0' with boolean expression is always false [-Wbool-compare[https://gcc.gnu.org/onlinedocs/gcc/Warning-Options.html#index-Wbool-compare]] > 221 | if (!need_data(data, offset, SIZE / 8) < 0) \ > | ^ >ltrace-elf.c:240:1: note: in expansion of macro 'DEF_READER' > 240 | DEF_READER(elf_read_u64, 64) > | ^~~~~~~~~~ >ltrace-elf.c:221:56: warning: logical not is only applied to the left hand side of comparison [-Wlogical-not-parentheses[https://gcc.gnu.org/onlinedocs/gcc/Warning-Options.html#index-Wlogical-not-parentheses]] > 221 | if (!need_data(data, offset, SIZE / 8) < 0) \ > | ^ >ltrace-elf.c:240:1: note: in expansion of macro 'DEF_READER' > 240 | DEF_READER(elf_read_u64, 64) > | ^~~~~~~~~~ >ltrace-elf.c:221:21: note: add parentheses around left hand side expression to silence this warning > 221 | if (!need_data(data, offset, SIZE / 8) < 0) \ > | ^~~~~~~~~~~~~~~~~~~~~~~~~~~~~~~~~~ >ltrace-elf.c:240:1: note: in expansion of macro 'DEF_READER' > 240 | DEF_READER(elf_read_u64, 64) > | ^~~~~~~~~~ >libtool: compile: x86_64-pc-linux-gnu-gcc -DHAVE_CONFIG_H -I. -I./sysdeps/linux-gnu/x86 -I./sysdeps/linux-gnu -I./sysdeps -I. -DSYSCONFDIR=\"/etc\" -Wall -Wsign-compare -Wfloat-equal -Wformat-security -O2 -march=x86-64 -pipe -pipe -frecord-gcc-switches -fno-diagnostics-color -fmessage-length=0 -c demangle.c -o demangle.o >/dev/null 2>&1 >libtool: compile: x86_64-pc-linux-gnu-gcc -DHAVE_CONFIG_H -I. -I./sysdeps/linux-gnu/x86 -I./sysdeps/linux-gnu -I./sysdeps -I. -DSYSCONFDIR=\"/etc\" -Wall -Wsign-compare -Wfloat-equal -Wformat-security -O2 -march=x86-64 -pipe -pipe -frecord-gcc-switches -fno-diagnostics-color -fmessage-length=0 -c execute_program.c -o execute_program.o >/dev/null 2>&1 >libtool: compile: x86_64-pc-linux-gnu-gcc -DHAVE_CONFIG_H -I. -I./sysdeps/linux-gnu/x86 -I./sysdeps/linux-gnu -I./sysdeps -I. -DSYSCONFDIR=\"/etc\" -Wall -Wsign-compare -Wfloat-equal -Wformat-security -O2 -march=x86-64 -pipe -pipe -frecord-gcc-switches -fno-diagnostics-color -fmessage-length=0 -c summary.c -o summary.o >/dev/null 2>&1 >libtool: compile: x86_64-pc-linux-gnu-gcc -DHAVE_CONFIG_H -I. -I./sysdeps/linux-gnu/x86 -I./sysdeps/linux-gnu -I./sysdeps -I. -DSYSCONFDIR=\"/etc\" -Wall -Wsign-compare -Wfloat-equal -Wformat-security -O2 -march=x86-64 -pipe -pipe -frecord-gcc-switches -fno-diagnostics-color -fmessage-length=0 -c filter.c -o filter.o >/dev/null 2>&1 >libtool: compile: x86_64-pc-linux-gnu-gcc -DHAVE_CONFIG_H -I. -I./sysdeps/linux-gnu/x86 -I./sysdeps/linux-gnu -I./sysdeps -I. -DSYSCONFDIR=\"/etc\" -Wall -Wsign-compare -Wfloat-equal -Wformat-security -O2 -march=x86-64 -pipe -pipe -frecord-gcc-switches -fno-diagnostics-color -fmessage-length=0 -c debug.c -o debug.o >/dev/null 2>&1 >libtool: compile: x86_64-pc-linux-gnu-gcc -DHAVE_CONFIG_H -I. -I./sysdeps/linux-gnu/x86 -I./sysdeps/linux-gnu -I./sysdeps -I. -DSYSCONFDIR=\"/etc\" -Wall -Wsign-compare -Wfloat-equal -Wformat-security -O2 -march=x86-64 -pipe -pipe -frecord-gcc-switches -fno-diagnostics-color -fmessage-length=0 -c glob.c -o glob.o >/dev/null 2>&1 >libtool: compile: x86_64-pc-linux-gnu-gcc -DHAVE_CONFIG_H -I. -I./sysdeps/linux-gnu/x86 -I./sysdeps/linux-gnu -I./sysdeps -I. -DSYSCONFDIR=\"/etc\" -Wall -Wsign-compare -Wfloat-equal -Wformat-security -O2 -march=x86-64 -pipe -pipe -frecord-gcc-switches -fno-diagnostics-color -fmessage-length=0 -c libltrace.c -o libltrace.o >/dev/null 2>&1 >libtool: compile: x86_64-pc-linux-gnu-gcc -DHAVE_CONFIG_H -I. -I./sysdeps/linux-gnu/x86 -I./sysdeps/linux-gnu -I./sysdeps -I. -DSYSCONFDIR=\"/etc\" -Wall -Wsign-compare -Wfloat-equal -Wformat-security -O2 -march=x86-64 -pipe -pipe -frecord-gcc-switches -fno-diagnostics-color -fmessage-length=0 -c dict.c -o dict.o >/dev/null 2>&1 >/bin/sh ./libtool --tag=CC --mode=compile x86_64-pc-linux-gnu-gcc -DHAVE_CONFIG_H -I. -I./sysdeps/linux-gnu/x86 -I./sysdeps/linux-gnu -I./sysdeps -I. -DSYSCONFDIR=\"/etc\" -Wall -Wsign-compare -Wfloat-equal -Wformat-security -O2 -march=x86-64 -pipe -pipe -frecord-gcc-switches -fno-diagnostics-color -fmessage-length=0 -c -o type.lo type.c >libtool: compile: x86_64-pc-linux-gnu-gcc -DHAVE_CONFIG_H -I. -I./sysdeps/linux-gnu/x86 -I./sysdeps/linux-gnu -I./sysdeps -I. -DSYSCONFDIR=\"/etc\" -Wall -Wsign-compare -Wfloat-equal -Wformat-security -O2 -march=x86-64 -pipe -pipe -frecord-gcc-switches -fno-diagnostics-color -fmessage-length=0 -c library.c -o library.o >/dev/null 2>&1 >libtool: compile: x86_64-pc-linux-gnu-gcc -DHAVE_CONFIG_H -I. -I./sysdeps/linux-gnu/x86 -I./sysdeps/linux-gnu -I./sysdeps -I. -DSYSCONFDIR=\"/etc\" -Wall -Wsign-compare -Wfloat-equal -Wformat-security -O2 -march=x86-64 -pipe -pipe -frecord-gcc-switches -fno-diagnostics-color -fmessage-length=0 -c breakpoints.c -o breakpoints.o >/dev/null 2>&1 >/bin/sh ./libtool --tag=CC --mode=compile x86_64-pc-linux-gnu-gcc -DHAVE_CONFIG_H -I. -I./sysdeps/linux-gnu/x86 -I./sysdeps/linux-gnu -I./sysdeps -I. -DSYSCONFDIR=\"/etc\" -Wall -Wsign-compare -Wfloat-equal -Wformat-security -O2 -march=x86-64 -pipe -pipe -frecord-gcc-switches -fno-diagnostics-color -fmessage-length=0 -c -o value.lo value.c >/bin/sh ./libtool --tag=CC --mode=compile x86_64-pc-linux-gnu-gcc -DHAVE_CONFIG_H -I. -I./sysdeps/linux-gnu/x86 -I./sysdeps/linux-gnu -I./sysdeps -I. -DSYSCONFDIR=\"/etc\" -Wall -Wsign-compare -Wfloat-equal -Wformat-security -O2 -march=x86-64 -pipe -pipe -frecord-gcc-switches -fno-diagnostics-color -fmessage-length=0 -c -o value_dict.lo value_dict.c >libtool: compile: x86_64-pc-linux-gnu-gcc -DHAVE_CONFIG_H -I. -I./sysdeps/linux-gnu/x86 -I./sysdeps/linux-gnu -I./sysdeps -I. -DSYSCONFDIR=\"/etc\" -Wall -Wsign-compare -Wfloat-equal -Wformat-security -O2 -march=x86-64 -pipe -pipe -frecord-gcc-switches -fno-diagnostics-color -fmessage-length=0 -c type.c -fPIC -DPIC -o .libs/type.o >/bin/sh ./libtool --tag=CC --mode=compile x86_64-pc-linux-gnu-gcc -DHAVE_CONFIG_H -I. -I./sysdeps/linux-gnu/x86 -I./sysdeps/linux-gnu -I./sysdeps -I. -DSYSCONFDIR=\"/etc\" -Wall -Wsign-compare -Wfloat-equal -Wformat-security -O2 -march=x86-64 -pipe -pipe -frecord-gcc-switches -fno-diagnostics-color -fmessage-length=0 -c -o expr.lo expr.c >/bin/sh ./libtool --tag=CC --mode=compile x86_64-pc-linux-gnu-gcc -DHAVE_CONFIG_H -I. -I./sysdeps/linux-gnu/x86 -I./sysdeps/linux-gnu -I./sysdeps -I. -DSYSCONFDIR=\"/etc\" -Wall -Wsign-compare -Wfloat-equal -Wformat-security -O2 -march=x86-64 -pipe -pipe -frecord-gcc-switches -fno-diagnostics-color -fmessage-length=0 -c -o fetch.lo fetch.c >libtool: compile: x86_64-pc-linux-gnu-gcc -DHAVE_CONFIG_H -I. -I./sysdeps/linux-gnu/x86 -I./sysdeps/linux-gnu -I./sysdeps -I. -DSYSCONFDIR=\"/etc\" -Wall -Wsign-compare -Wfloat-equal -Wformat-security -O2 -march=x86-64 -pipe -pipe -frecord-gcc-switches -fno-diagnostics-color -fmessage-length=0 -c value.c -fPIC -DPIC -o .libs/value.o >/bin/sh ./libtool --tag=CC --mode=compile x86_64-pc-linux-gnu-gcc -DHAVE_CONFIG_H -I. -I./sysdeps/linux-gnu/x86 -I./sysdeps/linux-gnu -I./sysdeps -I. -DSYSCONFDIR=\"/etc\" -Wall -Wsign-compare -Wfloat-equal -Wformat-security -O2 -march=x86-64 -pipe -pipe -frecord-gcc-switches -fno-diagnostics-color -fmessage-length=0 -c -o vect.lo vect.c >libtool: compile: x86_64-pc-linux-gnu-gcc -DHAVE_CONFIG_H -I. -I./sysdeps/linux-gnu/x86 -I./sysdeps/linux-gnu -I./sysdeps -I. -DSYSCONFDIR=\"/etc\" -Wall -Wsign-compare -Wfloat-equal -Wformat-security -O2 -march=x86-64 -pipe -pipe -frecord-gcc-switches -fno-diagnostics-color -fmessage-length=0 -c value_dict.c -fPIC -DPIC -o .libs/value_dict.o >libtool: compile: x86_64-pc-linux-gnu-gcc -DHAVE_CONFIG_H -I. -I./sysdeps/linux-gnu/x86 -I./sysdeps/linux-gnu -I./sysdeps -I. -DSYSCONFDIR=\"/etc\" -Wall -Wsign-compare -Wfloat-equal -Wformat-security -O2 -march=x86-64 -pipe -pipe -frecord-gcc-switches -fno-diagnostics-color -fmessage-length=0 -c options.c -o options.o >/dev/null 2>&1 >libtool: compile: x86_64-pc-linux-gnu-gcc -DHAVE_CONFIG_H -I. -I./sysdeps/linux-gnu/x86 -I./sysdeps/linux-gnu -I./sysdeps -I. -DSYSCONFDIR=\"/etc\" -Wall -Wsign-compare -Wfloat-equal -Wformat-security -O2 -march=x86-64 -pipe -pipe -frecord-gcc-switches -fno-diagnostics-color -fmessage-length=0 -c expr.c -fPIC -DPIC -o .libs/expr.o >libtool: compile: x86_64-pc-linux-gnu-gcc -DHAVE_CONFIG_H -I. -I./sysdeps/linux-gnu/x86 -I./sysdeps/linux-gnu -I./sysdeps -I. -DSYSCONFDIR=\"/etc\" -Wall -Wsign-compare -Wfloat-equal -Wformat-security -O2 -march=x86-64 -pipe -pipe -frecord-gcc-switches -fno-diagnostics-color -fmessage-length=0 -c fetch.c -fPIC -DPIC -o .libs/fetch.o >/bin/sh ./libtool --tag=CC --mode=compile x86_64-pc-linux-gnu-gcc -DHAVE_CONFIG_H -I. -I./sysdeps/linux-gnu/x86 -I./sysdeps/linux-gnu -I./sysdeps -I. -DSYSCONFDIR=\"/etc\" -Wall -Wsign-compare -Wfloat-equal -Wformat-security -O2 -march=x86-64 -pipe -pipe -frecord-gcc-switches -fno-diagnostics-color -fmessage-length=0 -c -o param.lo param.c >libtool: compile: x86_64-pc-linux-gnu-gcc -DHAVE_CONFIG_H -I. -I./sysdeps/linux-gnu/x86 -I./sysdeps/linux-gnu -I./sysdeps -I. -DSYSCONFDIR=\"/etc\" -Wall -Wsign-compare -Wfloat-equal -Wformat-security -O2 -march=x86-64 -pipe -pipe -frecord-gcc-switches -fno-diagnostics-color -fmessage-length=0 -c output.c -o output.o >/dev/null 2>&1 >libtool: compile: x86_64-pc-linux-gnu-gcc -DHAVE_CONFIG_H -I. -I./sysdeps/linux-gnu/x86 -I./sysdeps/linux-gnu -I./sysdeps -I. -DSYSCONFDIR=\"/etc\" -Wall -Wsign-compare -Wfloat-equal -Wformat-security -O2 -march=x86-64 -pipe -pipe -frecord-gcc-switches -fno-diagnostics-color -fmessage-length=0 -c handle_event.c -o handle_event.o >/dev/null 2>&1 >libtool: compile: x86_64-pc-linux-gnu-gcc -DHAVE_CONFIG_H -I. -I./sysdeps/linux-gnu/x86 -I./sysdeps/linux-gnu -I./sysdeps -I. -DSYSCONFDIR=\"/etc\" -Wall -Wsign-compare -Wfloat-equal -Wformat-security -O2 -march=x86-64 -pipe -pipe -frecord-gcc-switches -fno-diagnostics-color -fmessage-length=0 -c vect.c -fPIC -DPIC -o .libs/vect.o >libtool: compile: x86_64-pc-linux-gnu-gcc -DHAVE_CONFIG_H -I. -I./sysdeps/linux-gnu/x86 -I./sysdeps/linux-gnu -I./sysdeps -I. -DSYSCONFDIR=\"/etc\" -Wall -Wsign-compare -Wfloat-equal -Wformat-security -O2 -march=x86-64 -pipe -pipe -frecord-gcc-switches -fno-diagnostics-color -fmessage-length=0 -c param.c -fPIC -DPIC -o .libs/param.o >/bin/sh ./libtool --tag=CC --mode=compile x86_64-pc-linux-gnu-gcc -DHAVE_CONFIG_H -I. -I./sysdeps/linux-gnu/x86 -I./sysdeps/linux-gnu -I./sysdeps -I. -DSYSCONFDIR=\"/etc\" -Wall -Wsign-compare -Wfloat-equal -Wformat-security -O2 -march=x86-64 -pipe -pipe -frecord-gcc-switches -fno-diagnostics-color -fmessage-length=0 -c -o printf.lo printf.c >libtool: compile: x86_64-pc-linux-gnu-gcc -DHAVE_CONFIG_H -I. -I./sysdeps/linux-gnu/x86 -I./sysdeps/linux-gnu -I./sysdeps -I. -DSYSCONFDIR=\"/etc\" -Wall -Wsign-compare -Wfloat-equal -Wformat-security -O2 -march=x86-64 -pipe -pipe -frecord-gcc-switches -fno-diagnostics-color -fmessage-length=0 -c proc.c -o proc.o >/dev/null 2>&1 >libtool: compile: x86_64-pc-linux-gnu-gcc -DHAVE_CONFIG_H -I. -I./sysdeps/linux-gnu/x86 -I./sysdeps/linux-gnu -I./sysdeps -I. -DSYSCONFDIR=\"/etc\" -Wall -Wsign-compare -Wfloat-equal -Wformat-security -O2 -march=x86-64 -pipe -pipe -frecord-gcc-switches -fno-diagnostics-color -fmessage-length=0 -c fetch.c -o fetch.o >/dev/null 2>&1 >/bin/sh ./libtool --tag=CC --mode=compile x86_64-pc-linux-gnu-gcc -DHAVE_CONFIG_H -I. -I./sysdeps/linux-gnu/x86 -I./sysdeps/linux-gnu -I./sysdeps -I. -DSYSCONFDIR=\"/etc\" -Wall -Wsign-compare -Wfloat-equal -Wformat-security -O2 -march=x86-64 -pipe -pipe -frecord-gcc-switches -fno-diagnostics-color -fmessage-length=0 -c -o zero.lo zero.c >libtool: compile: x86_64-pc-linux-gnu-gcc -DHAVE_CONFIG_H -I. -I./sysdeps/linux-gnu/x86 -I./sysdeps/linux-gnu -I./sysdeps -I. -DSYSCONFDIR=\"/etc\" -Wall -Wsign-compare -Wfloat-equal -Wformat-security -O2 -march=x86-64 -pipe -pipe -frecord-gcc-switches -fno-diagnostics-color -fmessage-length=0 -c value_dict.c -o value_dict.o >/dev/null 2>&1 >libtool: compile: x86_64-pc-linux-gnu-gcc -DHAVE_CONFIG_H -I. -I./sysdeps/linux-gnu/x86 -I./sysdeps/linux-gnu -I./sysdeps -I. -DSYSCONFDIR=\"/etc\" -Wall -Wsign-compare -Wfloat-equal -Wformat-security -O2 -march=x86-64 -pipe -pipe -frecord-gcc-switches -fno-diagnostics-color -fmessage-length=0 -c ltrace-elf.c -o ltrace-elf.o >/dev/null 2>&1 >libtool: compile: x86_64-pc-linux-gnu-gcc -DHAVE_CONFIG_H -I. -I./sysdeps/linux-gnu/x86 -I./sysdeps/linux-gnu -I./sysdeps -I. -DSYSCONFDIR=\"/etc\" -Wall -Wsign-compare -Wfloat-equal -Wformat-security -O2 -march=x86-64 -pipe -pipe -frecord-gcc-switches -fno-diagnostics-color -fmessage-length=0 -c printf.c -fPIC -DPIC -o .libs/printf.o >libtool: compile: x86_64-pc-linux-gnu-gcc -DHAVE_CONFIG_H -I. -I./sysdeps/linux-gnu/x86 -I./sysdeps/linux-gnu -I./sysdeps -I. -DSYSCONFDIR=\"/etc\" -Wall -Wsign-compare -Wfloat-equal -Wformat-security -O2 -march=x86-64 -pipe -pipe -frecord-gcc-switches -fno-diagnostics-color -fmessage-length=0 -c type.c -o type.o >/dev/null 2>&1 >/bin/sh ./libtool --tag=CC --mode=compile x86_64-pc-linux-gnu-gcc -DHAVE_CONFIG_H -I. -I./sysdeps/linux-gnu/x86 -I./sysdeps/linux-gnu -I./sysdeps -I. -DSYSCONFDIR=\"/etc\" -Wall -Wsign-compare -Wfloat-equal -Wformat-security -O2 -march=x86-64 -pipe -pipe -frecord-gcc-switches -fno-diagnostics-color -fmessage-length=0 -c -o lens.lo lens.c >libtool: compile: x86_64-pc-linux-gnu-gcc -DHAVE_CONFIG_H -I. -I./sysdeps/linux-gnu/x86 -I./sysdeps/linux-gnu -I./sysdeps -I. -DSYSCONFDIR=\"/etc\" -Wall -Wsign-compare -Wfloat-equal -Wformat-security -O2 -march=x86-64 -pipe -pipe -frecord-gcc-switches -fno-diagnostics-color -fmessage-length=0 -c zero.c -fPIC -DPIC -o .libs/zero.o >libtool: compile: x86_64-pc-linux-gnu-gcc -DHAVE_CONFIG_H -I. -I./sysdeps/linux-gnu/x86 -I./sysdeps/linux-gnu -I./sysdeps -I. -DSYSCONFDIR=\"/etc\" -Wall -Wsign-compare -Wfloat-equal -Wformat-security -O2 -march=x86-64 -pipe -pipe -frecord-gcc-switches -fno-diagnostics-color -fmessage-length=0 -c expr.c -o expr.o >/dev/null 2>&1 >libtool: compile: x86_64-pc-linux-gnu-gcc -DHAVE_CONFIG_H -I. -I./sysdeps/linux-gnu/x86 -I./sysdeps/linux-gnu -I./sysdeps -I. -DSYSCONFDIR=\"/etc\" -Wall -Wsign-compare -Wfloat-equal -Wformat-security -O2 -march=x86-64 -pipe -pipe -frecord-gcc-switches -fno-diagnostics-color -fmessage-length=0 -c vect.c -o vect.o >/dev/null 2>&1 >libtool: compile: x86_64-pc-linux-gnu-gcc -DHAVE_CONFIG_H -I. -I./sysdeps/linux-gnu/x86 -I./sysdeps/linux-gnu -I./sysdeps -I. -DSYSCONFDIR=\"/etc\" -Wall -Wsign-compare -Wfloat-equal -Wformat-security -O2 -march=x86-64 -pipe -pipe -frecord-gcc-switches -fno-diagnostics-color -fmessage-length=0 -c param.c -o param.o >/dev/null 2>&1 >/bin/sh ./libtool --tag=CC --mode=compile x86_64-pc-linux-gnu-gcc -DHAVE_CONFIG_H -I. -I./sysdeps/linux-gnu/x86 -I./sysdeps/linux-gnu -I./sysdeps -I. -DSYSCONFDIR=\"/etc\" -Wall -Wsign-compare -Wfloat-equal -Wformat-security -O2 -march=x86-64 -pipe -pipe -frecord-gcc-switches -fno-diagnostics-color -fmessage-length=0 -c -o lens_default.lo lens_default.c >libtool: compile: x86_64-pc-linux-gnu-gcc -DHAVE_CONFIG_H -I. -I./sysdeps/linux-gnu/x86 -I./sysdeps/linux-gnu -I./sysdeps -I. -DSYSCONFDIR=\"/etc\" -Wall -Wsign-compare -Wfloat-equal -Wformat-security -O2 -march=x86-64 -pipe -pipe -frecord-gcc-switches -fno-diagnostics-color -fmessage-length=0 -c lens.c -fPIC -DPIC -o .libs/lens.o >libtool: compile: x86_64-pc-linux-gnu-gcc -DHAVE_CONFIG_H -I. -I./sysdeps/linux-gnu/x86 -I./sysdeps/linux-gnu -I./sysdeps -I. -DSYSCONFDIR=\"/etc\" -Wall -Wsign-compare -Wfloat-equal -Wformat-security -O2 -march=x86-64 -pipe -pipe -frecord-gcc-switches -fno-diagnostics-color -fmessage-length=0 -c value.c -o value.o >/dev/null 2>&1 >libtool: compile: x86_64-pc-linux-gnu-gcc -DHAVE_CONFIG_H -I. -I./sysdeps/linux-gnu/x86 -I./sysdeps/linux-gnu -I./sysdeps -I. -DSYSCONFDIR=\"/etc\" -Wall -Wsign-compare -Wfloat-equal -Wformat-security -O2 -march=x86-64 -pipe -pipe -frecord-gcc-switches -fno-diagnostics-color -fmessage-length=0 -c lens_default.c -fPIC -DPIC -o .libs/lens_default.o >/bin/sh ./libtool --tag=CC --mode=compile x86_64-pc-linux-gnu-gcc -DHAVE_CONFIG_H -I. -I./sysdeps/linux-gnu/x86 -I./sysdeps/linux-gnu -I./sysdeps -I. -DSYSCONFDIR=\"/etc\" -Wall -Wsign-compare -Wfloat-equal -Wformat-security -O2 -march=x86-64 -pipe -pipe -frecord-gcc-switches -fno-diagnostics-color -fmessage-length=0 -c -o lens_enum.lo lens_enum.c >libtool: compile: x86_64-pc-linux-gnu-gcc -DHAVE_CONFIG_H -I. -I./sysdeps/linux-gnu/x86 -I./sysdeps/linux-gnu -I./sysdeps -I. -DSYSCONFDIR=\"/etc\" -Wall -Wsign-compare -Wfloat-equal -Wformat-security -O2 -march=x86-64 -pipe -pipe -frecord-gcc-switches -fno-diagnostics-color -fmessage-length=0 -c read_config_file.c -o read_config_file.o >/dev/null 2>&1 >libtool: compile: x86_64-pc-linux-gnu-gcc -DHAVE_CONFIG_H -I. -I./sysdeps/linux-gnu/x86 -I./sysdeps/linux-gnu -I./sysdeps -I. -DSYSCONFDIR=\"/etc\" -Wall -Wsign-compare -Wfloat-equal -Wformat-security -O2 -march=x86-64 -pipe -pipe -frecord-gcc-switches -fno-diagnostics-color -fmessage-length=0 -c lens.c -o lens.o >/dev/null 2>&1 >libtool: compile: x86_64-pc-linux-gnu-gcc -DHAVE_CONFIG_H -I. -I./sysdeps/linux-gnu/x86 -I./sysdeps/linux-gnu -I./sysdeps -I. -DSYSCONFDIR=\"/etc\" -Wall -Wsign-compare -Wfloat-equal -Wformat-security -O2 -march=x86-64 -pipe -pipe -frecord-gcc-switches -fno-diagnostics-color -fmessage-length=0 -c zero.c -o zero.o >/dev/null 2>&1 >libtool: compile: x86_64-pc-linux-gnu-gcc -DHAVE_CONFIG_H -I. -I./sysdeps/linux-gnu/x86 -I./sysdeps/linux-gnu -I./sysdeps -I. -DSYSCONFDIR=\"/etc\" -Wall -Wsign-compare -Wfloat-equal -Wformat-security -O2 -march=x86-64 -pipe -pipe -frecord-gcc-switches -fno-diagnostics-color -fmessage-length=0 -c printf.c -o printf.o >/dev/null 2>&1 >libtool: compile: x86_64-pc-linux-gnu-gcc -DHAVE_CONFIG_H -I. -I./sysdeps/linux-gnu/x86 -I./sysdeps/linux-gnu -I./sysdeps -I. -DSYSCONFDIR=\"/etc\" -Wall -Wsign-compare -Wfloat-equal -Wformat-security -O2 -march=x86-64 -pipe -pipe -frecord-gcc-switches -fno-diagnostics-color -fmessage-length=0 -c lens_enum.c -fPIC -DPIC -o .libs/lens_enum.o >libtool: compile: x86_64-pc-linux-gnu-gcc -DHAVE_CONFIG_H -I. -I./sysdeps/linux-gnu/x86 -I./sysdeps/linux-gnu -I./sysdeps -I. -DSYSCONFDIR=\"/etc\" -Wall -Wsign-compare -Wfloat-equal -Wformat-security -O2 -march=x86-64 -pipe -pipe -frecord-gcc-switches -fno-diagnostics-color -fmessage-length=0 -c lens_enum.c -o lens_enum.o >/dev/null 2>&1 >libtool: compile: x86_64-pc-linux-gnu-gcc -DHAVE_CONFIG_H -I. -I./sysdeps/linux-gnu/x86 -I./sysdeps/linux-gnu -I./sysdeps -I. -DSYSCONFDIR=\"/etc\" -Wall -Wsign-compare -Wfloat-equal -Wformat-security -O2 -march=x86-64 -pipe -pipe -frecord-gcc-switches -fno-diagnostics-color -fmessage-length=0 -c lens_default.c -o lens_default.o >/dev/null 2>&1 >/bin/sh ./libtool --tag=CC --mode=link x86_64-pc-linux-gnu-gcc -Wall -Wsign-compare -Wfloat-equal -Wformat-security -O2 -march=x86-64 -pipe -pipe -frecord-gcc-switches -fno-diagnostics-color -fmessage-length=0 -Wl,-O1 -Wl,--as-needed -Wl,--defsym=__gentoo_check_ldflags__=0 -o libltrace.la breakpoints.lo debug.lo demangle.lo dict.lo ltrace-elf.lo execute_program.lo handle_event.lo libltrace.lo options.lo output.lo proc.lo read_config_file.lo summary.lo library.lo filter.lo glob.lo type.lo value.lo value_dict.lo expr.lo fetch.lo vect.lo param.lo printf.lo zero.lo lens.lo lens_default.lo lens_enum.lo -liberty sysdeps/libos.la -lelf >libtool: link: (cd .libs/libltrace.lax/libos.a && x86_64-pc-linux-gnu-ar x "/var/tmp/portage/dev-util/ltrace-0.7.3.6.1/work/ltrace-0.7.3/sysdeps/.libs/libos.a") >copying selected object files to avoid basename conflicts... >libtool: link: ln .libs/libltrace.lax/libos.a/fetch.o .libs/libltrace.lax/lt1-fetch.o || cp .libs/libltrace.lax/libos.a/fetch.o .libs/libltrace.lax/lt1-fetch.o >libtool: link: ln .libs/libltrace.lax/libos.a/proc.o .libs/libltrace.lax/lt2-proc.o || cp .libs/libltrace.lax/libos.a/proc.o .libs/libltrace.lax/lt2-proc.o >libtool: link: x86_64-pc-linux-gnu-ar cr .libs/libltrace.a .libs/breakpoints.o .libs/debug.o .libs/demangle.o .libs/dict.o .libs/ltrace-elf.o .libs/execute_program.o .libs/handle_event.o .libs/libltrace.o .libs/options.o .libs/output.o .libs/proc.o .libs/read_config_file.o .libs/summary.o .libs/library.o .libs/filter.o .libs/glob.o .libs/type.o .libs/value.o .libs/value_dict.o .libs/expr.o .libs/fetch.o .libs/vect.o .libs/param.o .libs/printf.o .libs/zero.o .libs/lens.o .libs/lens_default.o .libs/lens_enum.o .libs/libltrace.lax/libos.a/breakpoint.o .libs/libltrace.lax/libos.a/events.o .libs/libltrace.lax/lt1-fetch.o .libs/libltrace.lax/libos.a/lt1-trace.o .libs/libltrace.lax/libos.a/plt.o .libs/libltrace.lax/lt2-proc.o .libs/libltrace.lax/libos.a/regs.o .libs/libltrace.lax/libos.a/trace.o >libtool: link: x86_64-pc-linux-gnu-ranlib .libs/libltrace.a >libtool: link: rm -fr .libs/libltrace.lax .libs/libltrace.lax >libtool: link: ( cd ".libs" && rm -f "libltrace.la" && ln -s "../libltrace.la" "libltrace.la" ) >/bin/sh ./libtool --tag=CC --mode=link x86_64-pc-linux-gnu-gcc -Wall -Wsign-compare -Wfloat-equal -Wformat-security -O2 -march=x86-64 -pipe -pipe -frecord-gcc-switches -fno-diagnostics-color -fmessage-length=0 -Wl,-O1 -Wl,--as-needed -Wl,--defsym=__gentoo_check_ldflags__=0 -o ltrace main.o libltrace.la -lelf >libtool: link: x86_64-pc-linux-gnu-gcc -Wall -Wsign-compare -Wfloat-equal -Wformat-security -O2 -march=x86-64 -pipe -pipe -frecord-gcc-switches -fno-diagnostics-color -fmessage-length=0 -Wl,-O1 -Wl,--defsym=__gentoo_check_ldflags__=0 -o ltrace main.o -Wl,--as-needed ./.libs/libltrace.a -liberty -lelf >make[2]: Leaving directory '/var/tmp/portage/dev-util/ltrace-0.7.3.6.1/work/ltrace-0.7.3' >Making all in testsuite >make[2]: Entering directory '/var/tmp/portage/dev-util/ltrace-0.7.3.6.1/work/ltrace-0.7.3/testsuite' >rm -f env.exp >echo set libelf_LD_LIBRARY_PATH '""' >> env.exp >echo set libunwind_LD_LIBRARY_PATH '""' >> env.exp >echo set CC_FOR_TARGET '"x86_64-pc-linux-gnu-gcc"' >> env.exp >echo set CXX_FOR_TARGET '"x86_64-pc-linux-gnu-g++"' >> env.exp >make all-recursive >make[3]: Entering directory '/var/tmp/portage/dev-util/ltrace-0.7.3.6.1/work/ltrace-0.7.3/testsuite' >Making all in ltrace.main >make[4]: Entering directory '/var/tmp/portage/dev-util/ltrace-0.7.3.6.1/work/ltrace-0.7.3/testsuite/ltrace.main' >make[4]: Nothing to be done for 'all'. >make[4]: Leaving directory '/var/tmp/portage/dev-util/ltrace-0.7.3.6.1/work/ltrace-0.7.3/testsuite/ltrace.main' >Making all in ltrace.minor >make[4]: Entering directory '/var/tmp/portage/dev-util/ltrace-0.7.3.6.1/work/ltrace-0.7.3/testsuite/ltrace.minor' >make[4]: Nothing to be done for 'all'. >make[4]: Leaving directory '/var/tmp/portage/dev-util/ltrace-0.7.3.6.1/work/ltrace-0.7.3/testsuite/ltrace.minor' >Making all in ltrace.torture >make[4]: Entering directory '/var/tmp/portage/dev-util/ltrace-0.7.3.6.1/work/ltrace-0.7.3/testsuite/ltrace.torture' >make[4]: Nothing to be done for 'all'. >make[4]: Leaving directory '/var/tmp/portage/dev-util/ltrace-0.7.3.6.1/work/ltrace-0.7.3/testsuite/ltrace.torture' >make[4]: Entering directory '/var/tmp/portage/dev-util/ltrace-0.7.3.6.1/work/ltrace-0.7.3/testsuite' >make[4]: Nothing to be done for 'all-am'. >make[4]: Leaving directory '/var/tmp/portage/dev-util/ltrace-0.7.3.6.1/work/ltrace-0.7.3/testsuite' >make[3]: Leaving directory '/var/tmp/portage/dev-util/ltrace-0.7.3.6.1/work/ltrace-0.7.3/testsuite' >make[2]: Leaving directory '/var/tmp/portage/dev-util/ltrace-0.7.3.6.1/work/ltrace-0.7.3/testsuite' >make[1]: Leaving directory '/var/tmp/portage/dev-util/ltrace-0.7.3.6.1/work/ltrace-0.7.3' >>>> Source compiled. >>>> Test phase: dev-util/ltrace-0.7.3.6.1 >make -j16 check >Making check in sysdeps >make[1]: Entering directory '/var/tmp/portage/dev-util/ltrace-0.7.3.6.1/work/ltrace-0.7.3/sysdeps' >Making check in linux-gnu >make[2]: Entering directory '/var/tmp/portage/dev-util/ltrace-0.7.3.6.1/work/ltrace-0.7.3/sysdeps/linux-gnu' >Making check in x86 >make[3]: Entering directory '/var/tmp/portage/dev-util/ltrace-0.7.3.6.1/work/ltrace-0.7.3/sysdeps/linux-gnu/x86' >make[3]: Nothing to be done for 'check'. >make[3]: Leaving directory '/var/tmp/portage/dev-util/ltrace-0.7.3.6.1/work/ltrace-0.7.3/sysdeps/linux-gnu/x86' >make[3]: Entering directory '/var/tmp/portage/dev-util/ltrace-0.7.3.6.1/work/ltrace-0.7.3/sysdeps/linux-gnu' >make[3]: Nothing to be done for 'check-am'. >make[3]: Leaving directory '/var/tmp/portage/dev-util/ltrace-0.7.3.6.1/work/ltrace-0.7.3/sysdeps/linux-gnu' >make[2]: Leaving directory '/var/tmp/portage/dev-util/ltrace-0.7.3.6.1/work/ltrace-0.7.3/sysdeps/linux-gnu' >make[2]: Entering directory '/var/tmp/portage/dev-util/ltrace-0.7.3.6.1/work/ltrace-0.7.3/sysdeps' >make[2]: Nothing to be done for 'check-am'. >make[2]: Leaving directory '/var/tmp/portage/dev-util/ltrace-0.7.3.6.1/work/ltrace-0.7.3/sysdeps' >make[1]: Leaving directory '/var/tmp/portage/dev-util/ltrace-0.7.3.6.1/work/ltrace-0.7.3/sysdeps' >Making check in . >make[1]: Entering directory '/var/tmp/portage/dev-util/ltrace-0.7.3.6.1/work/ltrace-0.7.3' >make[1]: Leaving directory '/var/tmp/portage/dev-util/ltrace-0.7.3.6.1/work/ltrace-0.7.3' >Making check in testsuite >make[1]: Entering directory '/var/tmp/portage/dev-util/ltrace-0.7.3.6.1/work/ltrace-0.7.3/testsuite' >make check-recursive >make[2]: Entering directory '/var/tmp/portage/dev-util/ltrace-0.7.3.6.1/work/ltrace-0.7.3/testsuite' >Making check in ltrace.main >make[3]: Entering directory '/var/tmp/portage/dev-util/ltrace-0.7.3.6.1/work/ltrace-0.7.3/testsuite/ltrace.main' >make[3]: Nothing to be done for 'check'. >make[3]: Leaving directory '/var/tmp/portage/dev-util/ltrace-0.7.3.6.1/work/ltrace-0.7.3/testsuite/ltrace.main' >Making check in ltrace.minor >make[3]: Entering directory '/var/tmp/portage/dev-util/ltrace-0.7.3.6.1/work/ltrace-0.7.3/testsuite/ltrace.minor' >make[3]: Nothing to be done for 'check'. >make[3]: Leaving directory '/var/tmp/portage/dev-util/ltrace-0.7.3.6.1/work/ltrace-0.7.3/testsuite/ltrace.minor' >Making check in ltrace.torture >make[3]: Entering directory '/var/tmp/portage/dev-util/ltrace-0.7.3.6.1/work/ltrace-0.7.3/testsuite/ltrace.torture' >make[3]: Nothing to be done for 'check'. >make[3]: Leaving directory '/var/tmp/portage/dev-util/ltrace-0.7.3.6.1/work/ltrace-0.7.3/testsuite/ltrace.torture' >make[3]: Entering directory '/var/tmp/portage/dev-util/ltrace-0.7.3.6.1/work/ltrace-0.7.3/testsuite' >make check-DEJAGNU >make[4]: Entering directory '/var/tmp/portage/dev-util/ltrace-0.7.3.6.1/work/ltrace-0.7.3/testsuite' >Making a new site.exp file ... >srcdir='.'; export srcdir; \ >EXPECT=expect; export EXPECT; \ >if /bin/sh -c "runtest --version" > /dev/null 2>&1; then \ > exit_status=0; l='ltrace'; for tool in $l; do \ > if runtest --srcdir . ; \ > then :; else exit_status=1; fi; \ > done; \ >else echo "WARNING: could not find 'runtest'" 1>&2; :;\ >fi; \ >exit $exit_status >WARNING: Couldn't find the global config file. >WARNING: No tool specified >Test run by portage on Tue Feb 14 11:49:11 2023 >Native configuration is x86_64-pc-linux-gnu > > === tests === > >Schedule of variations: > unix > >Running target unix >Using /usr/share/dejagnu/baseboards/unix.exp as board description file for target. >Using /usr/share/dejagnu/config/unix.exp as generic interface file for target. >Using /var/tmp/portage/dev-util/ltrace-0.7.3.6.1/work/ltrace-0.7.3/testsuite/config/unix.exp as tool-and-target-specific interface file. >Running /var/tmp/portage/dev-util/ltrace-0.7.3.6.1/work/ltrace-0.7.3/testsuite/ltrace.main/branch_func.exp ... >Running /var/tmp/portage/dev-util/ltrace-0.7.3.6.1/work/ltrace-0.7.3/testsuite/ltrace.main/filters.exp ... >FAIL: filt(\.pie)?->func1 appears in /var/tmp/portage/dev-util/ltrace-0.7.3.6.1/temp/lt-bfQUvMBecp.ltrace 0 times, expected == 1 >FAIL: libfilt1.so->func2 appears in /var/tmp/portage/dev-util/ltrace-0.7.3.6.1/temp/lt-bfQUvMBecp.ltrace 0 times, expected == 1 >FAIL: libfilt2.so->puts appears in /var/tmp/portage/dev-util/ltrace-0.7.3.6.1/temp/lt-bfQUvMBecp.ltrace 0 times, expected == 1 >FAIL: func2 resumed appears in /var/tmp/portage/dev-util/ltrace-0.7.3.6.1/temp/lt-bfQUvMBecp.ltrace 0 times, expected == 1 >FAIL: func1 resumed appears in /var/tmp/portage/dev-util/ltrace-0.7.3.6.1/temp/lt-bfQUvMBecp.ltrace 0 times, expected == 1 >FAIL: ^func1\(.*\) appears in /var/tmp/portage/dev-util/ltrace-0.7.3.6.1/temp/lt-hyd1STyZWL.ltrace 0 times, expected == 1 >FAIL: filt(\.pie)?->func1\(.*\) appears in /var/tmp/portage/dev-util/ltrace-0.7.3.6.1/temp/lt-rlNqIx5x5j.ltrace 0 times, expected == 1 >FAIL: libfilt1.so->func2\(.*\) appears in /var/tmp/portage/dev-util/ltrace-0.7.3.6.1/temp/lt-KNHwown4yZ.ltrace 0 times, expected == 1 >FAIL: libfilt2.so->puts\(.*\) appears in /var/tmp/portage/dev-util/ltrace-0.7.3.6.1/temp/lt-FI31TJ4oTQ.ltrace 0 times, expected == 1 >FAIL: libfilt1.so->func2\( appears in /var/tmp/portage/dev-util/ltrace-0.7.3.6.1/temp/lt-7S1OaBGKRg.ltrace 0 times, expected == 1 >FAIL: libfilt2.so->puts\(.*\) appears in /var/tmp/portage/dev-util/ltrace-0.7.3.6.1/temp/lt-7S1OaBGKRg.ltrace 0 times, expected == 1 >FAIL: func2 resumed appears in /var/tmp/portage/dev-util/ltrace-0.7.3.6.1/temp/lt-7S1OaBGKRg.ltrace 0 times, expected == 1 >FAIL: filt(\.pie)?->func1\( appears in /var/tmp/portage/dev-util/ltrace-0.7.3.6.1/temp/lt-5UyAdiCUj9.ltrace 0 times, expected == 1 >FAIL: libfilt1.so->func2\(.*\) appears in /var/tmp/portage/dev-util/ltrace-0.7.3.6.1/temp/lt-5UyAdiCUj9.ltrace 0 times, expected == 1 >FAIL: func1 resumed appears in /var/tmp/portage/dev-util/ltrace-0.7.3.6.1/temp/lt-5UyAdiCUj9.ltrace 0 times, expected == 1 >FAIL: filt(\.pie)?->func1\( appears in /var/tmp/portage/dev-util/ltrace-0.7.3.6.1/temp/lt-mN1r0CanhP.ltrace 0 times, expected == 1 >FAIL: func1 resumed appears in /var/tmp/portage/dev-util/ltrace-0.7.3.6.1/temp/lt-mN1r0CanhP.ltrace 0 times, expected == 1 >FAIL: filt(\.pie)?->func1\(.*\) appears in /var/tmp/portage/dev-util/ltrace-0.7.3.6.1/temp/lt-tiVHzXK1dy.ltrace 0 times, expected == 1 >FAIL: filt(\.pie)?->func1\( appears in /var/tmp/portage/dev-util/ltrace-0.7.3.6.1/temp/lt-SJy6BaIaT1.ltrace 0 times, expected == 1 >FAIL: libfilt1.so->func2\(.*\) appears in /var/tmp/portage/dev-util/ltrace-0.7.3.6.1/temp/lt-SJy6BaIaT1.ltrace 0 times, expected == 1 >FAIL: func1 resumed appears in /var/tmp/portage/dev-util/ltrace-0.7.3.6.1/temp/lt-SJy6BaIaT1.ltrace 0 times, expected == 1 >FAIL: filt(\.pie)?->func1 appears in /var/tmp/portage/dev-util/ltrace-0.7.3.6.1/temp/lt-9pso4CS51L.ltrace 0 times, expected == 1 >FAIL: libfilt1.so->func2 appears in /var/tmp/portage/dev-util/ltrace-0.7.3.6.1/temp/lt-9pso4CS51L.ltrace 0 times, expected == 1 >FAIL: libfilt2.so->puts appears in /var/tmp/portage/dev-util/ltrace-0.7.3.6.1/temp/lt-9pso4CS51L.ltrace 0 times, expected == 1 >FAIL: func2 resumed appears in /var/tmp/portage/dev-util/ltrace-0.7.3.6.1/temp/lt-9pso4CS51L.ltrace 0 times, expected == 1 >FAIL: func1 resumed appears in /var/tmp/portage/dev-util/ltrace-0.7.3.6.1/temp/lt-9pso4CS51L.ltrace 0 times, expected == 1 >FAIL: ^func1\(.*\) appears in /var/tmp/portage/dev-util/ltrace-0.7.3.6.1/temp/lt-3gfnOXskR3.ltrace 0 times, expected == 1 >FAIL: filt(\.pie)?->func1\(.*\) appears in /var/tmp/portage/dev-util/ltrace-0.7.3.6.1/temp/lt-Z0mp3KrHCt.ltrace 0 times, expected == 1 >FAIL: libfilt1.so->func2\(.*\) appears in /var/tmp/portage/dev-util/ltrace-0.7.3.6.1/temp/lt-tWJ1qZ0MIe.ltrace 0 times, expected == 1 >FAIL: libfilt2.so->puts\(.*\) appears in /var/tmp/portage/dev-util/ltrace-0.7.3.6.1/temp/lt-9oHtPOAfVl.ltrace 0 times, expected == 1 >FAIL: libfilt1.so->func2\( appears in /var/tmp/portage/dev-util/ltrace-0.7.3.6.1/temp/lt-dHE1lSx3fd.ltrace 0 times, expected == 1 >FAIL: libfilt2.so->puts\(.*\) appears in /var/tmp/portage/dev-util/ltrace-0.7.3.6.1/temp/lt-dHE1lSx3fd.ltrace 0 times, expected == 1 >FAIL: func2 resumed appears in /var/tmp/portage/dev-util/ltrace-0.7.3.6.1/temp/lt-dHE1lSx3fd.ltrace 0 times, expected == 1 >FAIL: filt(\.pie)?->func1\( appears in /var/tmp/portage/dev-util/ltrace-0.7.3.6.1/temp/lt-XR0JQFCdpz.ltrace 0 times, expected == 1 >FAIL: libfilt1.so->func2\(.*\) appears in /var/tmp/portage/dev-util/ltrace-0.7.3.6.1/temp/lt-XR0JQFCdpz.ltrace 0 times, expected == 1 >FAIL: func1 resumed appears in /var/tmp/portage/dev-util/ltrace-0.7.3.6.1/temp/lt-XR0JQFCdpz.ltrace 0 times, expected == 1 >FAIL: filt(\.pie)?->func1\( appears in /var/tmp/portage/dev-util/ltrace-0.7.3.6.1/temp/lt-b6h1e5rJXE.ltrace 0 times, expected == 1 >FAIL: func1 resumed appears in /var/tmp/portage/dev-util/ltrace-0.7.3.6.1/temp/lt-b6h1e5rJXE.ltrace 0 times, expected == 1 >FAIL: filt(\.pie)?->func1\(.*\) appears in /var/tmp/portage/dev-util/ltrace-0.7.3.6.1/temp/lt-lAR7mewCxp.ltrace 0 times, expected == 1 >FAIL: filt(\.pie)?->func1\( appears in /var/tmp/portage/dev-util/ltrace-0.7.3.6.1/temp/lt-8hsDabqYQt.ltrace 0 times, expected == 1 >FAIL: libfilt1.so->func2\(.*\) appears in /var/tmp/portage/dev-util/ltrace-0.7.3.6.1/temp/lt-8hsDabqYQt.ltrace 0 times, expected == 1 >FAIL: func1 resumed appears in /var/tmp/portage/dev-util/ltrace-0.7.3.6.1/temp/lt-8hsDabqYQt.ltrace 0 times, expected == 1 >Running /var/tmp/portage/dev-util/ltrace-0.7.3.6.1/work/ltrace-0.7.3/testsuite/ltrace.main/hello-vfork.exp ... >FAIL: _exit in /var/tmp/portage/dev-util/ltrace-0.7.3.6.1/work/ltrace-0.7.3/testsuite/ltrace.main/hello-vfork.ltrace for 0 times, should be 2 >FAIL: vfork resumed in /var/tmp/portage/dev-util/ltrace-0.7.3.6.1/work/ltrace-0.7.3/testsuite/ltrace.main/hello-vfork.ltrace for 0 times, should be 2 >Running /var/tmp/portage/dev-util/ltrace-0.7.3.6.1/work/ltrace-0.7.3/testsuite/ltrace.main/main-internal.exp ... >Running /var/tmp/portage/dev-util/ltrace-0.7.3.6.1/work/ltrace-0.7.3/testsuite/ltrace.main/main-threaded.exp ... >FAIL: print in /var/tmp/portage/dev-util/ltrace-0.7.3.6.1/work/ltrace-0.7.3/testsuite/ltrace.main/main-threaded.ltrace for 0 times, should be 30 >Running /var/tmp/portage/dev-util/ltrace-0.7.3.6.1/work/ltrace-0.7.3/testsuite/ltrace.main/main-vfork.exp ... >FAIL: print in /var/tmp/portage/dev-util/ltrace-0.7.3.6.1/work/ltrace-0.7.3/testsuite/ltrace.main/main-vfork.ltrace for 0 times, should be 20 >FAIL: vfork resumed in /var/tmp/portage/dev-util/ltrace-0.7.3.6.1/work/ltrace-0.7.3/testsuite/ltrace.main/main-vfork.ltrace for 0 times, should be 2 >Running /var/tmp/portage/dev-util/ltrace-0.7.3.6.1/work/ltrace-0.7.3/testsuite/ltrace.main/main.exp ... >FAIL: print in /var/tmp/portage/dev-util/ltrace-0.7.3.6.1/work/ltrace-0.7.3/testsuite/ltrace.main/main.ltrace for 0 times, should be 10 >Running /var/tmp/portage/dev-util/ltrace-0.7.3.6.1/work/ltrace-0.7.3/testsuite/ltrace.main/parameters.exp ... >FAIL: func_intptr(17) in /var/tmp/portage/dev-util/ltrace-0.7.3.6.1/work/ltrace-0.7.3/testsuite/ltrace.main/parameters.ltrace for 0 times, should be 1 >FAIL: func_intptr_ret(42) in /var/tmp/portage/dev-util/ltrace-0.7.3.6.1/work/ltrace-0.7.3/testsuite/ltrace.main/parameters.ltrace for 0 times, should be 1 >FAIL: func_strlen(\"Hello world\") *= *11 in /var/tmp/portage/dev-util/ltrace-0.7.3.6.1/work/ltrace-0.7.3/testsuite/ltrace.main/parameters.ltrace for 0 times, should be 1 >FAIL: func_arg0(\"Hello another world!\") *= *20 in /var/tmp/portage/dev-util/ltrace-0.7.3.6.1/work/ltrace-0.7.3/testsuite/ltrace.main/parameters.ltrace for 0 times, should be 1 >FAIL: func_strfixed(\"Hell\") in /var/tmp/portage/dev-util/ltrace-0.7.3.6.1/work/ltrace-0.7.3/testsuite/ltrace.main/parameters.ltrace for 0 times, should be 1 >FAIL: func_ppp(80) in /var/tmp/portage/dev-util/ltrace-0.7.3.6.1/work/ltrace-0.7.3/testsuite/ltrace.main/parameters.ltrace for 0 times, should be 1 >FAIL: func_stringp(\"Dude\") in /var/tmp/portage/dev-util/ltrace-0.7.3.6.1/work/ltrace-0.7.3/testsuite/ltrace.main/parameters.ltrace for 0 times, should be 1 >FAIL: func_string(\"zero\") in /var/tmp/portage/dev-util/ltrace-0.7.3.6.1/work/ltrace-0.7.3/testsuite/ltrace.main/parameters.ltrace for 0 times, should be 1 >FAIL: func_enum(BLUE) in /var/tmp/portage/dev-util/ltrace-0.7.3.6.1/work/ltrace-0.7.3/testsuite/ltrace.main/parameters.ltrace for 0 times, should be 1 >FAIL: func_short(-8, -9) in /var/tmp/portage/dev-util/ltrace-0.7.3.6.1/work/ltrace-0.7.3/testsuite/ltrace.main/parameters.ltrace for 0 times, should be 1 >FAIL: func_ushort(33, 34) in /var/tmp/portage/dev-util/ltrace-0.7.3.6.1/work/ltrace-0.7.3/testsuite/ltrace.main/parameters.ltrace for 0 times, should be 1 >FAIL: func_float(3.40*, -3.40*).*= 3.40* in /var/tmp/portage/dev-util/ltrace-0.7.3.6.1/work/ltrace-0.7.3/testsuite/ltrace.main/parameters.ltrace for 0 times, should be 1 >FAIL: func_double(3.40*, -3.40*).*= -3.40* in /var/tmp/portage/dev-util/ltrace-0.7.3.6.1/work/ltrace-0.7.3/testsuite/ltrace.main/parameters.ltrace for 0 times, should be 1 >FAIL: func_typedef(BLUE) in /var/tmp/portage/dev-util/ltrace-0.7.3.6.1/work/ltrace-0.7.3/testsuite/ltrace.main/parameters.ltrace for 0 times, should be 1 >FAIL: func_arrayi(. 10, 11, 12, 13\.\.\. ., 8) in /var/tmp/portage/dev-util/ltrace-0.7.3.6.1/work/ltrace-0.7.3/testsuite/ltrace.main/parameters.ltrace for 0 times, should be 1 >FAIL: func_arrayi(. 10, 11 ., 2) in /var/tmp/portage/dev-util/ltrace-0.7.3.6.1/work/ltrace-0.7.3/testsuite/ltrace.main/parameters.ltrace for 0 times, should be 1 >FAIL: func_arrayf(. 10.10*, 11.10*, 12.10*, 13.10*\.\.\. ., 8) in /var/tmp/portage/dev-util/ltrace-0.7.3.6.1/work/ltrace-0.7.3/testsuite/ltrace.main/parameters.ltrace for 0 times, should be 1 >FAIL: func_arrayf(. 10.10*, 11.10* ., 2) in /var/tmp/portage/dev-util/ltrace-0.7.3.6.1/work/ltrace-0.7.3/testsuite/ltrace.main/parameters.ltrace for 0 times, should be 1 >FAIL: func_struct({ 89, 2, 3, . { 1, 10 }, { 3, 30 } ., . { 4, 40 }, { 5, 50 }, { 6, 60 } ., \"123\" }) in /var/tmp/portage/dev-util/ltrace-0.7.3.6.1/work/ltrace-0.7.3/testsuite/ltrace.main/parameters.ltrace for 0 times, should be 1 >FAIL: func_call( <unfinished ...> in /var/tmp/portage/dev-util/ltrace-0.7.3.6.1/work/ltrace-0.7.3/testsuite/ltrace.main/parameters.ltrace for 0 times, should be 1 >FAIL: func_work(\"x\") in /var/tmp/portage/dev-util/ltrace-0.7.3.6.1/work/ltrace-0.7.3/testsuite/ltrace.main/parameters.ltrace for 0 times, should be 1 >FAIL: func_struct_2(17, { \"ABCDE\\\\0\", 0.250* }, 0.50*).*= { 0.250*, 'B', 'C' } in /var/tmp/portage/dev-util/ltrace-0.7.3.6.1/work/ltrace-0.7.3/testsuite/ltrace.main/parameters.ltrace for 0 times, should be 1 >FAIL: <... func_call resumed> \"x\", \"y\") in /var/tmp/portage/dev-util/ltrace-0.7.3.6.1/work/ltrace-0.7.3/testsuite/ltrace.main/parameters.ltrace for 0 times, should be 1 >FAIL: func_struct_large({ 1, 2, 3, 4 }, { 5, 6, 7, 8 }).*= { 6, 8, 10, 12 } in /var/tmp/portage/dev-util/ltrace-0.7.3.6.1/work/ltrace-0.7.3/testsuite/ltrace.main/parameters.ltrace for 0 times, should be 1 >FAIL: func_struct_large2({ '0', '1', 3, 4 }, { '2', '3', 7, 8 }).*= { 'b', 'd', 10, 12 } in /var/tmp/portage/dev-util/ltrace-0.7.3.6.1/work/ltrace-0.7.3/testsuite/ltrace.main/parameters.ltrace for 0 times, should be 1 >FAIL: func_struct_large3({ 3, 4, '0', '1' }, { 7, 8, '2', '3' }).*= { 10, 12, 'b', 'd' } in /var/tmp/portage/dev-util/ltrace-0.7.3.6.1/work/ltrace-0.7.3/testsuite/ltrace.main/parameters.ltrace for 0 times, should be 1 >FAIL: func_many_args(1, 2, 3, 4.00*, '5', 6, 7.00*, '8', 9, 10.00*, 11, 12.00*, 'A', 14, 15, 16, 'B', 18.00*, 19.00*, 20.00*, 21, 22.00*, 23.00*, 24.00*, 25.00*) in /var/tmp/portage/dev-util/ltrace-0.7.3.6.1/work/ltrace-0.7.3/testsuite/ltrace.main/parameters.ltrace for 0 times, should be 1 >FAIL: func_printf(\"sotnuh %d %ld %g %c.n\", 5, 6, 1.500*, 'X') in /var/tmp/portage/dev-util/ltrace-0.7.3.6.1/work/ltrace-0.7.3/testsuite/ltrace.main/parameters.ltrace for 0 times, should be 1 >FAIL: func_printf(\"sotnuh1 %d %ld %hd.n\", 5, 6, 7) in /var/tmp/portage/dev-util/ltrace-0.7.3.6.1/work/ltrace-0.7.3/testsuite/ltrace.main/parameters.ltrace for 0 times, should be 1 >FAIL: func_printf(\"sotnuh2 %s %10s %10s.n\", \"a string\", \"a trimmed \", \"short\") in /var/tmp/portage/dev-util/ltrace-0.7.3.6.1/work/ltrace-0.7.3/testsuite/ltrace.main/parameters.ltrace for 0 times, should be 1 >FAIL: func_printf(\"sotnuh3 %.s.n\", 4, \"a tr\") in /var/tmp/portage/dev-util/ltrace-0.7.3.6.1/work/ltrace-0.7.3/testsuite/ltrace.main/parameters.ltrace for 0 times, should be 1 >FAIL: func_printf(\"many_args%d %d %ld %g %c %d %g .*, 1, 2, 3, 4.00*, '5', 6, 7.00*, '8', 9, 10.00*, 11, 12.00*, 'A', 14, 15, 16, 'B', 18.00*, 19.00*, 20.00*, 21, 22.00*, 23.00*, 24.00*, 25.00*) in /var/tmp/portage/dev-util/ltrace-0.7.3.6.1/work/ltrace-0.7.3/testsuite/ltrace.main/parameters.ltrace for 0 times, should be 1 >FAIL: func_sprintf(nil, \"test %d %d %d %d.n\", 1, 2, 3, 4) in /var/tmp/portage/dev-util/ltrace-0.7.3.6.1/work/ltrace-0.7.3/testsuite/ltrace.main/parameters.ltrace for 0 times, should be 1 >FAIL: func_lens(026, 027, 0x18, 0x19) in /var/tmp/portage/dev-util/ltrace-0.7.3.6.1/work/ltrace-0.7.3/testsuite/ltrace.main/parameters.ltrace for 0 times, should be 1 >FAIL: func_bool(1, true).*= false in /var/tmp/portage/dev-util/ltrace-0.7.3.6.1/work/ltrace-0.7.3/testsuite/ltrace.main/parameters.ltrace for 0 times, should be 1 >FAIL: func_bool(2, false).*= true in /var/tmp/portage/dev-util/ltrace-0.7.3.6.1/work/ltrace-0.7.3/testsuite/ltrace.main/parameters.ltrace for 0 times, should be 1 >FAIL: func_hide(2, 5, 7) in /var/tmp/portage/dev-util/ltrace-0.7.3.6.1/work/ltrace-0.7.3/testsuite/ltrace.main/parameters.ltrace for 0 times, should be 1 >FAIL: func_hide_struct({ 2, 5, 7 }) in /var/tmp/portage/dev-util/ltrace-0.7.3.6.1/work/ltrace-0.7.3/testsuite/ltrace.main/parameters.ltrace for 0 times, should be 1 >FAIL: func_short_enums(. A, B, A, A .).*= . A, B, A, A . in /var/tmp/portage/dev-util/ltrace-0.7.3.6.1/work/ltrace-0.7.3/testsuite/ltrace.main/parameters.ltrace for 0 times, should be 1 >FAIL: func_negative_enum(A, A, A, A, A, A).*= A in /var/tmp/portage/dev-util/ltrace-0.7.3.6.1/work/ltrace-0.7.3/testsuite/ltrace.main/parameters.ltrace for 0 times, should be 1 >FAIL: func_charp_string(\"null-terminated string\") in /var/tmp/portage/dev-util/ltrace-0.7.3.6.1/work/ltrace-0.7.3/testsuite/ltrace.main/parameters.ltrace for 0 times, should be 1 >FAIL: func_dbl_eqv({ 2.500* }, { { 1.50* } }, { { { 0.50* } } }, { { { { -0.50* } } } }).*= { 4.00* } in /var/tmp/portage/dev-util/ltrace-0.7.3.6.1/work/ltrace-0.7.3/testsuite/ltrace.main/parameters.ltrace for 0 times, should be 1 >FAIL: func_flt_eqv({ 2.500* }, { { 1.50* } }, { { { 0.50* } } }, { { { { -0.50* } } } }).*= { 4.00* } in /var/tmp/portage/dev-util/ltrace-0.7.3.6.1/work/ltrace-0.7.3/testsuite/ltrace.main/parameters.ltrace for 0 times, should be 1 >FAIL: func_struct_empty({ *}).*= { *} in /var/tmp/portage/dev-util/ltrace-0.7.3.6.1/work/ltrace-0.7.3/testsuite/ltrace.main/parameters.ltrace for 0 times, should be 1 >FAIL: func_struct_size1({ '5' }).*= { '5' } in /var/tmp/portage/dev-util/ltrace-0.7.3.6.1/work/ltrace-0.7.3/testsuite/ltrace.main/parameters.ltrace for 0 times, should be 1 >FAIL: func_struct_size2({ 5 }).*= { 5 } in /var/tmp/portage/dev-util/ltrace-0.7.3.6.1/work/ltrace-0.7.3/testsuite/ltrace.main/parameters.ltrace for 0 times, should be 1 >FAIL: func_struct_size4({ 5 }).*= { 5 } in /var/tmp/portage/dev-util/ltrace-0.7.3.6.1/work/ltrace-0.7.3/testsuite/ltrace.main/parameters.ltrace for 0 times, should be 1 >FAIL: func_struct_size8({ 5, 6 }).*= { 5, 6 } in /var/tmp/portage/dev-util/ltrace-0.7.3.6.1/work/ltrace-0.7.3/testsuite/ltrace.main/parameters.ltrace for 0 times, should be 1 >FAIL: func_hfa_f2({ 1.000*, { 2.000* } }).*= { 1.000*, { 2.000* } } in /var/tmp/portage/dev-util/ltrace-0.7.3.6.1/work/ltrace-0.7.3/testsuite/ltrace.main/parameters.ltrace for 0 times, should be 1 >FAIL: func_hfa_f3({ 3.000*, { 1.000*, { 2.000* } } }).*= { 3.000*, { 1.000*, { 2.000* } } } in /var/tmp/portage/dev-util/ltrace-0.7.3.6.1/work/ltrace-0.7.3/testsuite/ltrace.main/parameters.ltrace for 0 times, should be 1 >FAIL: func_hfa_f4({ 4.000*, { 3.000*, { 1.000*, { 2.000* } } } }).*= { 4.000*, { 3.000*, { 1.000*, { 2.000* } } } } in /var/tmp/portage/dev-util/ltrace-0.7.3.6.1/work/ltrace-0.7.3/testsuite/ltrace.main/parameters.ltrace for 0 times, should be 1 >FAIL: func_hfa_f5({ 5.000*, { 4.000*, { 3.000*, { 1.000*, { 2.000* } } } } }).*= { 5.000*, { 4.000*, { 3.000*, { 1.000*, { 2.000* } } } } } in /var/tmp/portage/dev-util/ltrace-0.7.3.6.1/work/ltrace-0.7.3/testsuite/ltrace.main/parameters.ltrace for 0 times, should be 1 >FAIL: func_hfa_f6({ 6.000*, { 5.000*, { 4.000*, { 3.000*, { 1.000*, { 2.000* } } } } } }).*= { 6.000*, { 5.000*, { 4.000*, { 3.000*, { 1.000*, { 2.000* } } } } } } in /var/tmp/portage/dev-util/ltrace-0.7.3.6.1/work/ltrace-0.7.3/testsuite/ltrace.main/parameters.ltrace for 0 times, should be 1 >FAIL: func_hfa_f7({ 7.000*, { 6.000*, { 5.000*, { 4.000*, { 3.000*, { 1.000*, { 2.000* } } } } } } }).*= { 7.000*, { 6.000*, { 5.000*, { 4.000*, { 3.000*, { 1.000*, { 2.000* } } } } } } } in /var/tmp/portage/dev-util/ltrace-0.7.3.6.1/work/ltrace-0.7.3/testsuite/ltrace.main/parameters.ltrace for 0 times, should be 1 >FAIL: func_hfa_f8({ 8.000*, { 7.000*, { 6.000*, { 5.000*, { 4.000*, { 3.000*, { 1.000*, { 2.000* } } } } } } } }).*= { 8.000*, { 7.000*, { 6.000*, { 5.000*, { 4.000*, { 3.000*, { 1.000*, { 2.000* } } } } } } } } in /var/tmp/portage/dev-util/ltrace-0.7.3.6.1/work/ltrace-0.7.3/testsuite/ltrace.main/parameters.ltrace for 0 times, should be 1 >FAIL: func_hfa_f9({ 9.000*, { 8.000*, { 7.000*, { 6.000*, { 5.000*, { 4.000*, { 3.000*, { 1.000*, { 2.000* } } } } } } } } }).*= { 9.000*, { 8.000*, { 7.000*, { 6.000*, { 5.000*, { 4.000*, { 3.000*, { 1.000*, { 2.000* } } } } } } } } } in /var/tmp/portage/dev-util/ltrace-0.7.3.6.1/work/ltrace-0.7.3/testsuite/ltrace.main/parameters.ltrace for 0 times, should be 1 >FAIL: func_hfa_f10({ 10.000*, { 9.000*, { 8.000*, { 7.000*, { 6.000*, { 5.000*, { 4.000*, { 3.000*, { 1.000*, { 2.000* } } } } } } } } } }).*= { 10.000*, { 9.000*, { 8.000*, { 7.000*, { 6.000*, { 5.000*, { 4.000*, { 3.000*, { 1.000*, { 2.000* } } } } } } } } } } in /var/tmp/portage/dev-util/ltrace-0.7.3.6.1/work/ltrace-0.7.3/testsuite/ltrace.main/parameters.ltrace for 0 times, should be 1 >FAIL: func_hfa_f11({ 11.000*, { 10.000*, { 9.000*, { 8.000*, { 7.000*, { 6.000*, { 5.000*, { 4.000*, { 3.000*, { 1.000*, { 2.000* } } } } } } } } } } }).*= { 11.000*, { 10.000*, { 9.000*, { 8.000*, { 7.000*, { 6.000*, { 5.000*, { 4.000*, { 3.000*, { 1.000*, { 2.000* } } } } } } } } } } } in /var/tmp/portage/dev-util/ltrace-0.7.3.6.1/work/ltrace-0.7.3/testsuite/ltrace.main/parameters.ltrace for 0 times, should be 1 >FAIL: func_hfa_f12({ 12.000*, { 11.000*, { 10.000*, { 9.000*, { 8.000*, { 7.000*, { 6.000*, { 5.000*, { 4.000*, { 3.000*, { 1.000*, { 2.000* } } } } } } } } } } } }).*= { 12.000*, { 11.000*, { 10.000*, { 9.000*, { 8.000*, { 7.000*, { 6.000*, { 5.000*, { 4.000*, { 3.000*, { 1.000*, { 2.000* } } } } } } } } } } } } in /var/tmp/portage/dev-util/ltrace-0.7.3.6.1/work/ltrace-0.7.3/testsuite/ltrace.main/parameters.ltrace for 0 times, should be 1 >FAIL: func_hfa_d2({ 1.000*, { 2.000* } }).*= { 1.000*, { 2.000* } } in /var/tmp/portage/dev-util/ltrace-0.7.3.6.1/work/ltrace-0.7.3/testsuite/ltrace.main/parameters.ltrace for 0 times, should be 1 >FAIL: func_hfa_d3({ 3.000*, { 1.000*, { 2.000* } } }).*= { 3.000*, { 1.000*, { 2.000* } } } in /var/tmp/portage/dev-util/ltrace-0.7.3.6.1/work/ltrace-0.7.3/testsuite/ltrace.main/parameters.ltrace for 0 times, should be 1 >FAIL: func_hfa_d4({ 4.000*, { 3.000*, { 1.000*, { 2.000* } } } }).*= { 4.000*, { 3.000*, { 1.000*, { 2.000* } } } } in /var/tmp/portage/dev-util/ltrace-0.7.3.6.1/work/ltrace-0.7.3/testsuite/ltrace.main/parameters.ltrace for 0 times, should be 1 >FAIL: func_hfa_d5({ 5.000*, { 4.000*, { 3.000*, { 1.000*, { 2.000* } } } } }).*= { 5.000*, { 4.000*, { 3.000*, { 1.000*, { 2.000* } } } } } in /var/tmp/portage/dev-util/ltrace-0.7.3.6.1/work/ltrace-0.7.3/testsuite/ltrace.main/parameters.ltrace for 0 times, should be 1 >FAIL: func_hfa_d6({ 6.000*, { 5.000*, { 4.000*, { 3.000*, { 1.000*, { 2.000* } } } } } }).*= { 6.000*, { 5.000*, { 4.000*, { 3.000*, { 1.000*, { 2.000* } } } } } } in /var/tmp/portage/dev-util/ltrace-0.7.3.6.1/work/ltrace-0.7.3/testsuite/ltrace.main/parameters.ltrace for 0 times, should be 1 >FAIL: func_hfa_d7({ 7.000*, { 6.000*, { 5.000*, { 4.000*, { 3.000*, { 1.000*, { 2.000* } } } } } } }).*= { 7.000*, { 6.000*, { 5.000*, { 4.000*, { 3.000*, { 1.000*, { 2.000* } } } } } } } in /var/tmp/portage/dev-util/ltrace-0.7.3.6.1/work/ltrace-0.7.3/testsuite/ltrace.main/parameters.ltrace for 0 times, should be 1 >FAIL: func_hfa_d8({ 8.000*, { 7.000*, { 6.000*, { 5.000*, { 4.000*, { 3.000*, { 1.000*, { 2.000* } } } } } } } }).*= { 8.000*, { 7.000*, { 6.000*, { 5.000*, { 4.000*, { 3.000*, { 1.000*, { 2.000* } } } } } } } } in /var/tmp/portage/dev-util/ltrace-0.7.3.6.1/work/ltrace-0.7.3/testsuite/ltrace.main/parameters.ltrace for 0 times, should be 1 >FAIL: func_hfa_d9({ 9.000*, { 8.000*, { 7.000*, { 6.000*, { 5.000*, { 4.000*, { 3.000*, { 1.000*, { 2.000* } } } } } } } } }).*= { 9.000*, { 8.000*, { 7.000*, { 6.000*, { 5.000*, { 4.000*, { 3.000*, { 1.000*, { 2.000* } } } } } } } } } in /var/tmp/portage/dev-util/ltrace-0.7.3.6.1/work/ltrace-0.7.3/testsuite/ltrace.main/parameters.ltrace for 0 times, should be 1 >FAIL: func_hfa_d10({ 10.000*, { 9.000*, { 8.000*, { 7.000*, { 6.000*, { 5.000*, { 4.000*, { 3.000*, { 1.000*, { 2.000* } } } } } } } } } }).*= { 10.000*, { 9.000*, { 8.000*, { 7.000*, { 6.000*, { 5.000*, { 4.000*, { 3.000*, { 1.000*, { 2.000* } } } } } } } } } } in /var/tmp/portage/dev-util/ltrace-0.7.3.6.1/work/ltrace-0.7.3/testsuite/ltrace.main/parameters.ltrace for 0 times, should be 1 >FAIL: func_hfa_d11({ 11.000*, { 10.000*, { 9.000*, { 8.000*, { 7.000*, { 6.000*, { 5.000*, { 4.000*, { 3.000*, { 1.000*, { 2.000* } } } } } } } } } } }).*= { 11.000*, { 10.000*, { 9.000*, { 8.000*, { 7.000*, { 6.000*, { 5.000*, { 4.000*, { 3.000*, { 1.000*, { 2.000* } } } } } } } } } } } in /var/tmp/portage/dev-util/ltrace-0.7.3.6.1/work/ltrace-0.7.3/testsuite/ltrace.main/parameters.ltrace for 0 times, should be 1 >FAIL: func_hfa_d12({ 12.000*, { 11.000*, { 10.000*, { 9.000*, { 8.000*, { 7.000*, { 6.000*, { 5.000*, { 4.000*, { 3.000*, { 1.000*, { 2.000* } } } } } } } } } } } }).*= { 12.000*, { 11.000*, { 10.000*, { 9.000*, { 8.000*, { 7.000*, { 6.000*, { 5.000*, { 4.000*, { 3.000*, { 1.000*, { 2.000* } } } } } } } } } } } } in /var/tmp/portage/dev-util/ltrace-0.7.3.6.1/work/ltrace-0.7.3/testsuite/ltrace.main/parameters.ltrace for 0 times, should be 1 >Running /var/tmp/portage/dev-util/ltrace-0.7.3.6.1/work/ltrace-0.7.3/testsuite/ltrace.main/parameters2.exp ... >FAIL: ->ll\({ 4, { 3, { 2, { 1, nil } } } }\) *= <void> appears in /var/tmp/portage/dev-util/ltrace-0.7.3.6.1/temp/lt-pRIi5nvsBm.ltrace 0 times, expected == 1 >FAIL: ->ll\({ 2, { 1, recurse\^ } }\) *= <void> appears in /var/tmp/portage/dev-util/ltrace-0.7.3.6.1/temp/lt-pRIi5nvsBm.ltrace 0 times, expected == 1 >FAIL: ->ll\({ 1, recurse }\) *= <void> appears in /var/tmp/portage/dev-util/ltrace-0.7.3.6.1/temp/lt-pRIi5nvsBm.ltrace 0 times, expected == 1 >FAIL: ->ll\({ 9, { 8, { 7, { 6, { 5, \.\.\. } } } } }\) *= <void> appears in /var/tmp/portage/dev-util/ltrace-0.7.3.6.1/temp/lt-FAwPHN1VTe.ltrace 0 times, expected == 1 >FAIL: fun\(0x123\) *= <void> appears in /var/tmp/portage/dev-util/ltrace-0.7.3.6.1/temp/lt-7F4GFXFvMH.ltrace 0 times, expected == 1 >FAIL: fun\(<>\) *= <void> appears in /var/tmp/portage/dev-util/ltrace-0.7.3.6.1/temp/lt-T6cg5wBuOe.ltrace 0 times, expected == 1 >FAIL: fun\(<0-1,5,8>\) *= <void> appears in /var/tmp/portage/dev-util/ltrace-0.7.3.6.1/temp/lt-T6cg5wBuOe.ltrace 0 times, expected == 1 >FAIL: fun\(~<0>\) *= <void> appears in /var/tmp/portage/dev-util/ltrace-0.7.3.6.1/temp/lt-T6cg5wBuOe.ltrace 0 times, expected == 1 >FAIL: fun\(~<>\) *= <void> appears in /var/tmp/portage/dev-util/ltrace-0.7.3.6.1/temp/lt-T6cg5wBuOe.ltrace 0 times, expected == 1 >FAIL: fun2\(<8-15,255>\) *= <void> appears in /var/tmp/portage/dev-util/ltrace-0.7.3.6.1/temp/lt-T6cg5wBuOe.ltrace 0 times, expected == 1 >FAIL: hex_float\(0x1.8p\+0\) *= 0x1.4p\+1 appears in /var/tmp/portage/dev-util/ltrace-0.7.3.6.1/temp/lt-Klb6dLCde2.ltrace 0 times, expected == 1 >FAIL: hex_double\(0x1.8p\+0\) *= 0x1.4p\+1 appears in /var/tmp/portage/dev-util/ltrace-0.7.3.6.1/temp/lt-Klb6dLCde2.ltrace 0 times, expected == 1 >Running /var/tmp/portage/dev-util/ltrace-0.7.3.6.1/work/ltrace-0.7.3/testsuite/ltrace.main/signals.exp ... >Running /var/tmp/portage/dev-util/ltrace-0.7.3.6.1/work/ltrace-0.7.3/testsuite/ltrace.main/system_calls.exp ... >Running /var/tmp/portage/dev-util/ltrace-0.7.3.6.1/work/ltrace-0.7.3/testsuite/ltrace.minor/count-record.exp ... >FAIL: Fail to find 1 rmdir in /var/tmp/portage/dev-util/ltrace-0.7.3.6.1/work/ltrace-0.7.3/testsuite/ltrace.minor/count-record.ltrace >FAIL: Fail to find 1 fopen in /var/tmp/portage/dev-util/ltrace-0.7.3.6.1/work/ltrace-0.7.3/testsuite/ltrace.minor/count-record.ltrace >FAIL: Fail to find 2 remove in /var/tmp/portage/dev-util/ltrace-0.7.3.6.1/work/ltrace-0.7.3/testsuite/ltrace.minor/count-record.ltrace >FAIL: Fail to find 1 mkdir in /var/tmp/portage/dev-util/ltrace-0.7.3.6.1/work/ltrace-0.7.3/testsuite/ltrace.minor/count-record.ltrace >FAIL: Fail to find 1 fseek in /var/tmp/portage/dev-util/ltrace-0.7.3.6.1/work/ltrace-0.7.3/testsuite/ltrace.minor/count-record.ltrace >FAIL: Fail to find 1 fwrite in /var/tmp/portage/dev-util/ltrace-0.7.3.6.1/work/ltrace-0.7.3/testsuite/ltrace.minor/count-record.ltrace >FAIL: Fail to find 1 fclose in /var/tmp/portage/dev-util/ltrace-0.7.3.6.1/work/ltrace-0.7.3/testsuite/ltrace.minor/count-record.ltrace >FAIL: Fail to find 1 rename in /var/tmp/portage/dev-util/ltrace-0.7.3.6.1/work/ltrace-0.7.3/testsuite/ltrace.minor/count-record.ltrace >FAIL: Fail to find 1 symlink in /var/tmp/portage/dev-util/ltrace-0.7.3.6.1/work/ltrace-0.7.3/testsuite/ltrace.minor/count-record.ltrace >FAIL: Fail to find 1 chdir in /var/tmp/portage/dev-util/ltrace-0.7.3.6.1/work/ltrace-0.7.3/testsuite/ltrace.minor/count-record.ltrace >FAIL: Fail to find 1 access in /var/tmp/portage/dev-util/ltrace-0.7.3.6.1/work/ltrace-0.7.3/testsuite/ltrace.minor/count-record.ltrace >FAIL: Fail to find 1 getcwd in /var/tmp/portage/dev-util/ltrace-0.7.3.6.1/work/ltrace-0.7.3/testsuite/ltrace.minor/count-record.ltrace >FAIL: Fail to find 1 fread in /var/tmp/portage/dev-util/ltrace-0.7.3.6.1/work/ltrace-0.7.3/testsuite/ltrace.minor/count-record.ltrace >Running /var/tmp/portage/dev-util/ltrace-0.7.3.6.1/work/ltrace-0.7.3/testsuite/ltrace.minor/demangle.exp ... >FAIL: Fail to find myclass::myclass in /var/tmp/portage/dev-util/ltrace-0.7.3.6.1/work/ltrace-0.7.3/testsuite/ltrace.minor/demangle.ltrace >FAIL: Fail to find myclass::myclass in /var/tmp/portage/dev-util/ltrace-0.7.3.6.1/work/ltrace-0.7.3/testsuite/ltrace.minor/demangle.ltrace >FAIL: Fail to find myclass::~myclass in /var/tmp/portage/dev-util/ltrace-0.7.3.6.1/work/ltrace-0.7.3/testsuite/ltrace.minor/demangle.ltrace >FAIL: Fail to find myclass::Fi_i in /var/tmp/portage/dev-util/ltrace-0.7.3.6.1/work/ltrace-0.7.3/testsuite/ltrace.minor/demangle.ltrace >FAIL: Fail to find myclass::Fis_i in /var/tmp/portage/dev-util/ltrace-0.7.3.6.1/work/ltrace-0.7.3/testsuite/ltrace.minor/demangle.ltrace >FAIL: Fail to find new in /var/tmp/portage/dev-util/ltrace-0.7.3.6.1/work/ltrace-0.7.3/testsuite/ltrace.minor/demangle.ltrace >FAIL: Fail to find delete in /var/tmp/portage/dev-util/ltrace-0.7.3.6.1/work/ltrace-0.7.3/testsuite/ltrace.minor/demangle.ltrace >FAIL: Fail to find myclass::operator++ in /var/tmp/portage/dev-util/ltrace-0.7.3.6.1/work/ltrace-0.7.3/testsuite/ltrace.minor/demangle.ltrace >FAIL: Fail to find myclass::operator++ in /var/tmp/portage/dev-util/ltrace-0.7.3.6.1/work/ltrace-0.7.3/testsuite/ltrace.minor/demangle.ltrace >FAIL: Fail to find myclass::operator+ in /var/tmp/portage/dev-util/ltrace-0.7.3.6.1/work/ltrace-0.7.3/testsuite/ltrace.minor/demangle.ltrace >FAIL: Fail to find myclass::operator= in /var/tmp/portage/dev-util/ltrace-0.7.3.6.1/work/ltrace-0.7.3/testsuite/ltrace.minor/demangle.ltrace >FAIL: Fail to find nested::nested in /var/tmp/portage/dev-util/ltrace-0.7.3.6.1/work/ltrace-0.7.3/testsuite/ltrace.minor/demangle.ltrace >FAIL: Fail to find nested::~nested in /var/tmp/portage/dev-util/ltrace-0.7.3.6.1/work/ltrace-0.7.3/testsuite/ltrace.minor/demangle.ltrace >FAIL: Fail to find nested::Fi_i in /var/tmp/portage/dev-util/ltrace-0.7.3.6.1/work/ltrace-0.7.3/testsuite/ltrace.minor/demangle.ltrace >Running /var/tmp/portage/dev-util/ltrace-0.7.3.6.1/work/ltrace-0.7.3/testsuite/ltrace.minor/libdl-simple.exp ... >Running /var/tmp/portage/dev-util/ltrace-0.7.3.6.1/work/ltrace-0.7.3/testsuite/ltrace.minor/print-instruction-pointer.exp ... >FAIL: 5.*printf in /var/tmp/portage/dev-util/ltrace-0.7.3.6.1/work/ltrace-0.7.3/testsuite/ltrace.minor/print-instruction-pointer.ltrace for 0 times, should be 1 >FAIL: 5.*printf in /var/tmp/portage/dev-util/ltrace-0.7.3.6.1/work/ltrace-0.7.3/testsuite/ltrace.minor/print-instruction-pointer.ltrace for 0 times, should be 1 >Running /var/tmp/portage/dev-util/ltrace-0.7.3.6.1/work/ltrace-0.7.3/testsuite/ltrace.minor/time-record-T.exp ... >FAIL: Fail to find call sleep! >FAIL: Fail to find nanosleep >Running /var/tmp/portage/dev-util/ltrace-0.7.3.6.1/work/ltrace-0.7.3/testsuite/ltrace.minor/time-record-tt.exp ... >FAIL: Fail to find call sleep! >FAIL: Fail to find nanosleep >Running /var/tmp/portage/dev-util/ltrace-0.7.3.6.1/work/ltrace-0.7.3/testsuite/ltrace.minor/time-record-ttt.exp ... >FAIL: Fail to find call sleep! >FAIL: Fail to find nanosleep >Running /var/tmp/portage/dev-util/ltrace-0.7.3.6.1/work/ltrace-0.7.3/testsuite/ltrace.minor/trace-clone.exp ... >FAIL: clone in /var/tmp/portage/dev-util/ltrace-0.7.3.6.1/work/ltrace-0.7.3/testsuite/ltrace.minor/trace-clone.ltrace for 0 times, should be 1 >Running /var/tmp/portage/dev-util/ltrace-0.7.3.6.1/work/ltrace-0.7.3/testsuite/ltrace.minor/trace-exec.exp ... >FAIL: ^execl\( appears in /var/tmp/portage/dev-util/ltrace-0.7.3.6.1/temp/lt-9GscZ2GE5m.ltrace 0 times, expected == 1 >FAIL: ^puts\(.*\) .*= 14 appears in /var/tmp/portage/dev-util/ltrace-0.7.3.6.1/temp/lt-9GscZ2GE5m.ltrace 0 times, expected == 1 >Running /var/tmp/portage/dev-util/ltrace-0.7.3.6.1/work/ltrace-0.7.3/testsuite/ltrace.minor/trace-fork.exp ... >FAIL: ^[0-9]* fork in /var/tmp/portage/dev-util/ltrace-0.7.3.6.1/work/ltrace-0.7.3/testsuite/ltrace.minor/trace-fork.ltrace for 0 times, should be 1 >FAIL: ^[0-9]* printf in /var/tmp/portage/dev-util/ltrace-0.7.3.6.1/work/ltrace-0.7.3/testsuite/ltrace.minor/trace-fork.ltrace for 0 times, should be 1 >FAIL: ^[0-9]* puts in /var/tmp/portage/dev-util/ltrace-0.7.3.6.1/work/ltrace-0.7.3/testsuite/ltrace.minor/trace-fork.ltrace for 0 times, should be 1 >FAIL: ^[0-9]* wait in /var/tmp/portage/dev-util/ltrace-0.7.3.6.1/work/ltrace-0.7.3/testsuite/ltrace.minor/trace-fork.ltrace for 0 times, should be 1 >FAIL: ^[0-9]* sleep in /var/tmp/portage/dev-util/ltrace-0.7.3.6.1/work/ltrace-0.7.3/testsuite/ltrace.minor/trace-fork.ltrace for 0 times, should be 1 >Running /var/tmp/portage/dev-util/ltrace-0.7.3.6.1/work/ltrace-0.7.3/testsuite/ltrace.torture/ia64-sigill.exp ... >Running /var/tmp/portage/dev-util/ltrace-0.7.3.6.1/work/ltrace-0.7.3/testsuite/ltrace.torture/ppc-lwarx.exp ... >Running /var/tmp/portage/dev-util/ltrace-0.7.3.6.1/work/ltrace-0.7.3/testsuite/ltrace.torture/signals.exp ... >Running /var/tmp/portage/dev-util/ltrace-0.7.3.6.1/work/ltrace-0.7.3/testsuite/ltrace.torture/vfork-thread.exp ... >FAIL: puts in /var/tmp/portage/dev-util/ltrace-0.7.3.6.1/work/ltrace-0.7.3/testsuite/ltrace.torture/vfork-thread.ltrace for 0 times, should be 9 >FAIL: sleep in /var/tmp/portage/dev-util/ltrace-0.7.3.6.1/work/ltrace-0.7.3/testsuite/ltrace.torture/vfork-thread.ltrace for 0 times, should be 7 >FAIL: vfork resumed in /var/tmp/portage/dev-util/ltrace-0.7.3.6.1/work/ltrace-0.7.3/testsuite/ltrace.torture/vfork-thread.ltrace for 0 times, should be 2 >FAIL: _exit in /var/tmp/portage/dev-util/ltrace-0.7.3.6.1/work/ltrace-0.7.3/testsuite/ltrace.torture/vfork-thread.ltrace for 0 times, should be 1 > > === Summary === > ># of expected passes 37 ># of unexpected failures 177 >make[4]: *** [Makefile:498: check-DEJAGNU] Error 1 >make[4]: Leaving directory '/var/tmp/portage/dev-util/ltrace-0.7.3.6.1/work/ltrace-0.7.3/testsuite' >make[3]: *** [Makefile:597: check-am] Error 2 >make[3]: Leaving directory '/var/tmp/portage/dev-util/ltrace-0.7.3.6.1/work/ltrace-0.7.3/testsuite' >make[2]: *** [Makefile:405: check-recursive] Error 1 >make[2]: Leaving directory '/var/tmp/portage/dev-util/ltrace-0.7.3.6.1/work/ltrace-0.7.3/testsuite' >make[1]: *** [Makefile:599: check] Error 2 >make[1]: Leaving directory '/var/tmp/portage/dev-util/ltrace-0.7.3.6.1/work/ltrace-0.7.3/testsuite' >make: *** [Makefile:900: check-recursive] Error 1 > * ERROR: dev-util/ltrace-0.7.3.6.1::gentoo failed (test phase): > * emake failed > * > * If you need support, post the output of `emerge --info '=dev-util/ltrace-0.7.3.6.1::gentoo'`, > * the complete build log and the output of `emerge -pqv '=dev-util/ltrace-0.7.3.6.1::gentoo'`. > * The complete build log is located at '/var/log/emerge-log/build/dev-util/ltrace-0.7.3.6.1:20230214-104858.log'. > * For convenience, a symlink to the build log is located at '/var/tmp/portage/dev-util/ltrace-0.7.3.6.1/temp/build.log'. > * The ebuild environment file is located at '/var/tmp/portage/dev-util/ltrace-0.7.3.6.1/temp/environment'. > * Working directory: '/var/tmp/portage/dev-util/ltrace-0.7.3.6.1/work/ltrace-0.7.3' > * S: '/var/tmp/portage/dev-util/ltrace-0.7.3.6.1/work/ltrace-0.7.3' >
You cannot view the attachment while viewing its details because your browser does not support IFRAMEs.
View the attachment on a separate page
.
View Attachment As Raw
Actions:
View
Attachments on
bug 894386
: 851108