Go to:
Gentoo Home
Documentation
Forums
Lists
Bugs
Planet
Store
Wiki
Get Gentoo!
Gentoo's Bugzilla – Attachment 716166 Details for
Bug 796143
sys-apps/fwupd-1.6.1 fails to detect correct Python version
Home
|
New
–
[Ex]
|
Browse
|
Search
|
Privacy Policy
|
[?]
|
Reports
|
Requests
|
Help
|
New Account
|
Log In
[x]
|
Forgot Password
Login:
[x]
meson-log.txt
meson-log.txt (text/plain), 87.93 KB, created by
nvaert1986
on 2021-06-15 06:39:03 UTC
(
hide
)
Description:
meson-log.txt
Filename:
MIME Type:
Creator:
nvaert1986
Created:
2021-06-15 06:39:03 UTC
Size:
87.93 KB
patch
obsolete
>Build started at 2021-06-15T08:36:28.439251 >Main binary: /usr/bin/python3.9 >Build Options: -Dbuild=all -Dconsolekit=false -Dcurl=true -Ddocs=none -Defi_binary=false -Dsupported_build=true -Dagent=true -Dlibarchive=true -Dbluez=true -Delogind=false -Dgnutls=true -Dgusb=true -Dlzma=true -Dman=true -Dintrospection=true -Dpolkit=true -Dsystemd=true -Dtests=false -Dplugin_amt=true -Dplugin_dell=false -Dplugin_flashrom=true -Dplugin_altos=true -Dplugin_nvme=true -Dplugin_intel_spi=false -Dplugin_synaptics_mst=true -Dplugin_synaptics_rmi=true -Dplugin_thunderbolt=true -Dplugin_tpm=true -Dplugin_uefi_capsule=true -Dplugin_uefi_capsule_splash=true -Dplugin_uefi_pk=true -Dplugin_modem_manager=false -Defi_os_dir=gentoo -Dprefix=/usr -Dlibdir=lib64 -Dlocalstatedir=/var -Dsysconfdir=/etc -Dbuildtype=plain -Dwrap_mode=nodownload -Dbuild.pkg_config_path=/var/tmp/portage/sys-apps/fwupd-1.6.1/temp/pkgconfig:/var/tmp/portage/sys-apps/fwupd-1.6.1/temp/python3.9/pkgconfig:/usr/share/pkgconfig -Dpkg_config_path=/var/tmp/portage/sys-apps/fwupd-1.6.1/temp/pkgconfig:/var/tmp/portage/sys-apps/fwupd-1.6.1/temp/python3.9/pkgconfig:/usr/share/pkgconfig '--native-file /var/tmp/portage/sys-apps/fwupd-1.6.1/temp/meson.x86_64-pc-linux-gnu.amd64.ini' >Python system: Linux >The Meson build system >Version: 0.57.2 >Source dir: /var/tmp/portage/sys-apps/fwupd-1.6.1/work/fwupd-1.6.1 >Build dir: /var/tmp/portage/sys-apps/fwupd-1.6.1/work/fwupd-1.6.1-build >Build type: native build >Project name: fwupd >Project version: 1.6.1 >Sanity testing C compiler: x86_64-pc-linux-gnu-gcc >Is cross compiler: False. >Sanity check compiler command line: x86_64-pc-linux-gnu-gcc /var/tmp/portage/sys-apps/fwupd-1.6.1/work/fwupd-1.6.1-build/meson-private/sanitycheckc.c -o /var/tmp/portage/sys-apps/fwupd-1.6.1/work/fwupd-1.6.1-build/meson-private/sanitycheckc.exe -march=native -O2 -pipe -fomit-frame-pointer -pipe -D_FILE_OFFSET_BITS=64 -Wl,-O1 -Wl,--as-needed >Sanity check compile stdout: > >----- >Sanity check compile stderr: > >----- >Running test binary command: /var/tmp/portage/sys-apps/fwupd-1.6.1/work/fwupd-1.6.1-build/meson-private/sanitycheckc.exe >C compiler for the host machine: x86_64-pc-linux-gnu-gcc (gcc 10.3.0 "x86_64-pc-linux-gnu-gcc (Gentoo 10.3.0 p1) 10.3.0") >C linker for the host machine: x86_64-pc-linux-gnu-gcc ld.bfd 2.35.2 >Sanity testing C compiler: x86_64-pc-linux-gnu-gcc >Is cross compiler: False. >Sanity check compiler command line: x86_64-pc-linux-gnu-gcc /var/tmp/portage/sys-apps/fwupd-1.6.1/work/fwupd-1.6.1-build/meson-private/sanitycheckc.c -o /var/tmp/portage/sys-apps/fwupd-1.6.1/work/fwupd-1.6.1-build/meson-private/sanitycheckc.exe -pipe -D_FILE_OFFSET_BITS=64 >Sanity check compile stdout: > >----- >Sanity check compile stderr: > >----- >Running test binary command: /var/tmp/portage/sys-apps/fwupd-1.6.1/work/fwupd-1.6.1-build/meson-private/sanitycheckc.exe >C compiler for the build machine: x86_64-pc-linux-gnu-gcc (gcc 10.3.0 "x86_64-pc-linux-gnu-gcc (Gentoo 10.3.0 p1) 10.3.0") >C linker for the build machine: x86_64-pc-linux-gnu-gcc ld.bfd 2.35.2 >Build machine cpu family: x86_64 >Build machine cpu: x86_64 >Host machine cpu family: x86_64 >Host machine cpu: x86_64 >Target machine cpu family: x86_64 >Target machine cpu: x86_64 >Program git found: YES (/usr/bin/git) >Running command: /usr/bin/git describe >--- stdout --- > >--- stderr --- >fatal: not a git repository (or any parent up to mount point /var/tmp) >Stopping at filesystem boundary (GIT_DISCOVERY_ACROSS_FILESYSTEM not set). > > >Running compile: >Working directory: /var/tmp/portage/sys-apps/fwupd-1.6.1/work/fwupd-1.6.1-build/meson-private/tmp59dah1af >Command line: x86_64-pc-linux-gnu-gcc /var/tmp/portage/sys-apps/fwupd-1.6.1/work/fwupd-1.6.1-build/meson-private/tmp59dah1af/testfile.c -o /var/tmp/portage/sys-apps/fwupd-1.6.1/work/fwupd-1.6.1-build/meson-private/tmp59dah1af/output.obj -pipe -c -march=native -O2 -fomit-frame-pointer -D_FILE_OFFSET_BITS=64 -O0 -Waggregate-return > >Code: > extern int i; >int i; > >Compiler stdout: > >Compiler stderr: > >Compiler for C supports arguments -Waggregate-return: YES >Running compile: >Working directory: /var/tmp/portage/sys-apps/fwupd-1.6.1/work/fwupd-1.6.1-build/meson-private/tmpk495zyxl >Command line: x86_64-pc-linux-gnu-gcc /var/tmp/portage/sys-apps/fwupd-1.6.1/work/fwupd-1.6.1-build/meson-private/tmpk495zyxl/testfile.c -o /var/tmp/portage/sys-apps/fwupd-1.6.1/work/fwupd-1.6.1-build/meson-private/tmpk495zyxl/output.obj -pipe -c -march=native -O2 -fomit-frame-pointer -D_FILE_OFFSET_BITS=64 -O0 -Wunused > >Code: > extern int i; >int i; > >Compiler stdout: > >Compiler stderr: > >Compiler for C supports arguments -Wunused: YES >Running compile: >Working directory: /var/tmp/portage/sys-apps/fwupd-1.6.1/work/fwupd-1.6.1-build/meson-private/tmpoe8ch4xp >Command line: x86_64-pc-linux-gnu-gcc /var/tmp/portage/sys-apps/fwupd-1.6.1/work/fwupd-1.6.1-build/meson-private/tmpoe8ch4xp/testfile.c -o /var/tmp/portage/sys-apps/fwupd-1.6.1/work/fwupd-1.6.1-build/meson-private/tmpoe8ch4xp/output.obj -pipe -c -march=native -O2 -fomit-frame-pointer -D_FILE_OFFSET_BITS=64 -O0 -Warray-bounds > >Code: > extern int i; >int i; > >Compiler stdout: > >Compiler stderr: > >Compiler for C supports arguments -Warray-bounds: YES >Running compile: >Working directory: /var/tmp/portage/sys-apps/fwupd-1.6.1/work/fwupd-1.6.1-build/meson-private/tmp6nz84m6l >Command line: x86_64-pc-linux-gnu-gcc /var/tmp/portage/sys-apps/fwupd-1.6.1/work/fwupd-1.6.1-build/meson-private/tmp6nz84m6l/testfile.c -o /var/tmp/portage/sys-apps/fwupd-1.6.1/work/fwupd-1.6.1-build/meson-private/tmp6nz84m6l/output.obj -pipe -c -march=native -O2 -fomit-frame-pointer -D_FILE_OFFSET_BITS=64 -O0 -Wcast-align > >Code: > extern int i; >int i; > >Compiler stdout: > >Compiler stderr: > >Compiler for C supports arguments -Wcast-align: YES >Running compile: >Working directory: /var/tmp/portage/sys-apps/fwupd-1.6.1/work/fwupd-1.6.1-build/meson-private/tmplg2_5ieq >Command line: x86_64-pc-linux-gnu-gcc /var/tmp/portage/sys-apps/fwupd-1.6.1/work/fwupd-1.6.1-build/meson-private/tmplg2_5ieq/testfile.c -o /var/tmp/portage/sys-apps/fwupd-1.6.1/work/fwupd-1.6.1-build/meson-private/tmplg2_5ieq/output.obj -pipe -c -march=native -O2 -fomit-frame-pointer -D_FILE_OFFSET_BITS=64 -O0 -Wclobbered > >Code: > extern int i; >int i; > >Compiler stdout: > >Compiler stderr: > >Compiler for C supports arguments -Wclobbered: YES >Running compile: >Working directory: /var/tmp/portage/sys-apps/fwupd-1.6.1/work/fwupd-1.6.1-build/meson-private/tmpkeo69_d7 >Command line: x86_64-pc-linux-gnu-gcc /var/tmp/portage/sys-apps/fwupd-1.6.1/work/fwupd-1.6.1-build/meson-private/tmpkeo69_d7/testfile.c -o /var/tmp/portage/sys-apps/fwupd-1.6.1/work/fwupd-1.6.1-build/meson-private/tmpkeo69_d7/output.obj -pipe -c -march=native -O2 -fomit-frame-pointer -D_FILE_OFFSET_BITS=64 -O0 -Wdeclaration-after-statement > >Code: > extern int i; >int i; > >Compiler stdout: > >Compiler stderr: > >Compiler for C supports arguments -Wdeclaration-after-statement: YES >Running compile: >Working directory: /var/tmp/portage/sys-apps/fwupd-1.6.1/work/fwupd-1.6.1-build/meson-private/tmprkgjrkhl >Command line: x86_64-pc-linux-gnu-gcc /var/tmp/portage/sys-apps/fwupd-1.6.1/work/fwupd-1.6.1-build/meson-private/tmprkgjrkhl/testfile.c -o /var/tmp/portage/sys-apps/fwupd-1.6.1/work/fwupd-1.6.1-build/meson-private/tmprkgjrkhl/output.obj -pipe -c -march=native -O2 -fomit-frame-pointer -D_FILE_OFFSET_BITS=64 -O0 -Wdiscarded-qualifiers > >Code: > extern int i; >int i; > >Compiler stdout: > >Compiler stderr: > >Compiler for C supports arguments -Wdiscarded-qualifiers: YES >Running compile: >Working directory: /var/tmp/portage/sys-apps/fwupd-1.6.1/work/fwupd-1.6.1-build/meson-private/tmpoxu3hmfq >Command line: x86_64-pc-linux-gnu-gcc /var/tmp/portage/sys-apps/fwupd-1.6.1/work/fwupd-1.6.1-build/meson-private/tmpoxu3hmfq/testfile.c -o /var/tmp/portage/sys-apps/fwupd-1.6.1/work/fwupd-1.6.1-build/meson-private/tmpoxu3hmfq/output.obj -pipe -c -march=native -O2 -fomit-frame-pointer -D_FILE_OFFSET_BITS=64 -O0 -Wduplicated-branches > >Code: > extern int i; >int i; > >Compiler stdout: > >Compiler stderr: > >Compiler for C supports arguments -Wduplicated-branches: YES >Running compile: >Working directory: /var/tmp/portage/sys-apps/fwupd-1.6.1/work/fwupd-1.6.1-build/meson-private/tmptfsnu5jl >Command line: x86_64-pc-linux-gnu-gcc /var/tmp/portage/sys-apps/fwupd-1.6.1/work/fwupd-1.6.1-build/meson-private/tmptfsnu5jl/testfile.c -o /var/tmp/portage/sys-apps/fwupd-1.6.1/work/fwupd-1.6.1-build/meson-private/tmptfsnu5jl/output.obj -pipe -c -march=native -O2 -fomit-frame-pointer -D_FILE_OFFSET_BITS=64 -O0 -Wduplicated-cond > >Code: > extern int i; >int i; > >Compiler stdout: > >Compiler stderr: > >Compiler for C supports arguments -Wduplicated-cond: YES >Running compile: >Working directory: /var/tmp/portage/sys-apps/fwupd-1.6.1/work/fwupd-1.6.1-build/meson-private/tmpbr8p29uh >Command line: x86_64-pc-linux-gnu-gcc /var/tmp/portage/sys-apps/fwupd-1.6.1/work/fwupd-1.6.1-build/meson-private/tmpbr8p29uh/testfile.c -o /var/tmp/portage/sys-apps/fwupd-1.6.1/work/fwupd-1.6.1-build/meson-private/tmpbr8p29uh/output.obj -pipe -c -march=native -O2 -fomit-frame-pointer -D_FILE_OFFSET_BITS=64 -O0 -Wempty-body > >Code: > extern int i; >int i; > >Compiler stdout: > >Compiler stderr: > >Compiler for C supports arguments -Wempty-body: YES >Running compile: >Working directory: /var/tmp/portage/sys-apps/fwupd-1.6.1/work/fwupd-1.6.1-build/meson-private/tmptybt1afa >Command line: x86_64-pc-linux-gnu-gcc /var/tmp/portage/sys-apps/fwupd-1.6.1/work/fwupd-1.6.1-build/meson-private/tmptybt1afa/testfile.c -o /var/tmp/portage/sys-apps/fwupd-1.6.1/work/fwupd-1.6.1-build/meson-private/tmptybt1afa/output.obj -pipe -c -march=native -O2 -fomit-frame-pointer -D_FILE_OFFSET_BITS=64 -O0 -Wformat=2 > >Code: > extern int i; >int i; > >Compiler stdout: > >Compiler stderr: > >Compiler for C supports arguments -Wformat=2: YES >Running compile: >Working directory: /var/tmp/portage/sys-apps/fwupd-1.6.1/work/fwupd-1.6.1-build/meson-private/tmp5pcohubt >Command line: x86_64-pc-linux-gnu-gcc /var/tmp/portage/sys-apps/fwupd-1.6.1/work/fwupd-1.6.1-build/meson-private/tmp5pcohubt/testfile.c -o /var/tmp/portage/sys-apps/fwupd-1.6.1/work/fwupd-1.6.1-build/meson-private/tmp5pcohubt/output.obj -pipe -c -march=native -O2 -fomit-frame-pointer -D_FILE_OFFSET_BITS=64 -O0 -Wformat-nonliteral > >Code: > extern int i; >int i; > >Compiler stdout: > >Compiler stderr: > >Compiler for C supports arguments -Wformat-nonliteral: YES >Running compile: >Working directory: /var/tmp/portage/sys-apps/fwupd-1.6.1/work/fwupd-1.6.1-build/meson-private/tmpy0iresz8 >Command line: x86_64-pc-linux-gnu-gcc /var/tmp/portage/sys-apps/fwupd-1.6.1/work/fwupd-1.6.1-build/meson-private/tmpy0iresz8/testfile.c -o /var/tmp/portage/sys-apps/fwupd-1.6.1/work/fwupd-1.6.1-build/meson-private/tmpy0iresz8/output.obj -pipe -c -march=native -O2 -fomit-frame-pointer -D_FILE_OFFSET_BITS=64 -O0 -Wformat-security > >Code: > extern int i; >int i; > >Compiler stdout: > >Compiler stderr: > >Compiler for C supports arguments -Wformat-security: YES >Running compile: >Working directory: /var/tmp/portage/sys-apps/fwupd-1.6.1/work/fwupd-1.6.1-build/meson-private/tmphn1kp2ir >Command line: x86_64-pc-linux-gnu-gcc /var/tmp/portage/sys-apps/fwupd-1.6.1/work/fwupd-1.6.1-build/meson-private/tmphn1kp2ir/testfile.c -o /var/tmp/portage/sys-apps/fwupd-1.6.1/work/fwupd-1.6.1-build/meson-private/tmphn1kp2ir/output.obj -pipe -c -march=native -O2 -fomit-frame-pointer -D_FILE_OFFSET_BITS=64 -O0 -Wformat-signedness > >Code: > extern int i; >int i; > >Compiler stdout: > >Compiler stderr: > >Compiler for C supports arguments -Wformat-signedness: YES >Running compile: >Working directory: /var/tmp/portage/sys-apps/fwupd-1.6.1/work/fwupd-1.6.1-build/meson-private/tmp40yqtzyi >Command line: x86_64-pc-linux-gnu-gcc /var/tmp/portage/sys-apps/fwupd-1.6.1/work/fwupd-1.6.1-build/meson-private/tmp40yqtzyi/testfile.c -o /var/tmp/portage/sys-apps/fwupd-1.6.1/work/fwupd-1.6.1-build/meson-private/tmp40yqtzyi/output.obj -pipe -c -march=native -O2 -fomit-frame-pointer -D_FILE_OFFSET_BITS=64 -O0 -Wignored-qualifiers > >Code: > extern int i; >int i; > >Compiler stdout: > >Compiler stderr: > >Compiler for C supports arguments -Wignored-qualifiers: YES >Running compile: >Working directory: /var/tmp/portage/sys-apps/fwupd-1.6.1/work/fwupd-1.6.1-build/meson-private/tmpd6c2m8dt >Command line: x86_64-pc-linux-gnu-gcc /var/tmp/portage/sys-apps/fwupd-1.6.1/work/fwupd-1.6.1-build/meson-private/tmpd6c2m8dt/testfile.c -o /var/tmp/portage/sys-apps/fwupd-1.6.1/work/fwupd-1.6.1-build/meson-private/tmpd6c2m8dt/output.obj -pipe -c -march=native -O2 -fomit-frame-pointer -D_FILE_OFFSET_BITS=64 -O0 -Wimplicit-function-declaration > >Code: > extern int i; >int i; > >Compiler stdout: > >Compiler stderr: > >Compiler for C supports arguments -Wimplicit-function-declaration: YES >Running compile: >Working directory: /var/tmp/portage/sys-apps/fwupd-1.6.1/work/fwupd-1.6.1-build/meson-private/tmppvnj4rp0 >Command line: x86_64-pc-linux-gnu-gcc /var/tmp/portage/sys-apps/fwupd-1.6.1/work/fwupd-1.6.1-build/meson-private/tmppvnj4rp0/testfile.c -o /var/tmp/portage/sys-apps/fwupd-1.6.1/work/fwupd-1.6.1-build/meson-private/tmppvnj4rp0/output.obj -pipe -c -march=native -O2 -fomit-frame-pointer -D_FILE_OFFSET_BITS=64 -O0 -Winit-self > >Code: > extern int i; >int i; > >Compiler stdout: > >Compiler stderr: > >Compiler for C supports arguments -Winit-self: YES >Running compile: >Working directory: /var/tmp/portage/sys-apps/fwupd-1.6.1/work/fwupd-1.6.1-build/meson-private/tmplke21fvn >Command line: x86_64-pc-linux-gnu-gcc /var/tmp/portage/sys-apps/fwupd-1.6.1/work/fwupd-1.6.1-build/meson-private/tmplke21fvn/testfile.c -o /var/tmp/portage/sys-apps/fwupd-1.6.1/work/fwupd-1.6.1-build/meson-private/tmplke21fvn/output.obj -pipe -c -march=native -O2 -fomit-frame-pointer -D_FILE_OFFSET_BITS=64 -O0 -Wlogical-op > >Code: > extern int i; >int i; > >Compiler stdout: > >Compiler stderr: > >Compiler for C supports arguments -Wlogical-op: YES >Running compile: >Working directory: /var/tmp/portage/sys-apps/fwupd-1.6.1/work/fwupd-1.6.1-build/meson-private/tmprzqf09zs >Command line: x86_64-pc-linux-gnu-gcc /var/tmp/portage/sys-apps/fwupd-1.6.1/work/fwupd-1.6.1-build/meson-private/tmprzqf09zs/testfile.c -o /var/tmp/portage/sys-apps/fwupd-1.6.1/work/fwupd-1.6.1-build/meson-private/tmprzqf09zs/output.obj -pipe -c -march=native -O2 -fomit-frame-pointer -D_FILE_OFFSET_BITS=64 -O0 -Wmaybe-uninitialized > >Code: > extern int i; >int i; > >Compiler stdout: > >Compiler stderr: > >Compiler for C supports arguments -Wmaybe-uninitialized: YES >Running compile: >Working directory: /var/tmp/portage/sys-apps/fwupd-1.6.1/work/fwupd-1.6.1-build/meson-private/tmppple38db >Command line: x86_64-pc-linux-gnu-gcc /var/tmp/portage/sys-apps/fwupd-1.6.1/work/fwupd-1.6.1-build/meson-private/tmppple38db/testfile.c -o /var/tmp/portage/sys-apps/fwupd-1.6.1/work/fwupd-1.6.1-build/meson-private/tmppple38db/output.obj -pipe -c -march=native -O2 -fomit-frame-pointer -D_FILE_OFFSET_BITS=64 -O0 -Wmissing-declarations > >Code: > extern int i; >int i; > >Compiler stdout: > >Compiler stderr: > >Compiler for C supports arguments -Wmissing-declarations: YES >Running compile: >Working directory: /var/tmp/portage/sys-apps/fwupd-1.6.1/work/fwupd-1.6.1-build/meson-private/tmpe62d_w2q >Command line: x86_64-pc-linux-gnu-gcc /var/tmp/portage/sys-apps/fwupd-1.6.1/work/fwupd-1.6.1-build/meson-private/tmpe62d_w2q/testfile.c -o /var/tmp/portage/sys-apps/fwupd-1.6.1/work/fwupd-1.6.1-build/meson-private/tmpe62d_w2q/output.obj -pipe -c -march=native -O2 -fomit-frame-pointer -D_FILE_OFFSET_BITS=64 -O0 -Wmissing-format-attribute > >Code: > extern int i; >int i; > >Compiler stdout: > >Compiler stderr: > >Compiler for C supports arguments -Wmissing-format-attribute: YES >Running compile: >Working directory: /var/tmp/portage/sys-apps/fwupd-1.6.1/work/fwupd-1.6.1-build/meson-private/tmp6mmc7rmt >Command line: x86_64-pc-linux-gnu-gcc /var/tmp/portage/sys-apps/fwupd-1.6.1/work/fwupd-1.6.1-build/meson-private/tmp6mmc7rmt/testfile.c -o /var/tmp/portage/sys-apps/fwupd-1.6.1/work/fwupd-1.6.1-build/meson-private/tmp6mmc7rmt/output.obj -pipe -c -march=native -O2 -fomit-frame-pointer -D_FILE_OFFSET_BITS=64 -O0 -Wmissing-include-dirs > >Code: > extern int i; >int i; > >Compiler stdout: > >Compiler stderr: > >Compiler for C supports arguments -Wmissing-include-dirs: YES >Running compile: >Working directory: /var/tmp/portage/sys-apps/fwupd-1.6.1/work/fwupd-1.6.1-build/meson-private/tmpe5a8_p7c >Command line: x86_64-pc-linux-gnu-gcc /var/tmp/portage/sys-apps/fwupd-1.6.1/work/fwupd-1.6.1-build/meson-private/tmpe5a8_p7c/testfile.c -o /var/tmp/portage/sys-apps/fwupd-1.6.1/work/fwupd-1.6.1-build/meson-private/tmpe5a8_p7c/output.obj -pipe -c -march=native -O2 -fomit-frame-pointer -D_FILE_OFFSET_BITS=64 -O0 -Wmissing-noreturn > >Code: > extern int i; >int i; > >Compiler stdout: > >Compiler stderr: > >Compiler for C supports arguments -Wmissing-noreturn: YES >Running compile: >Working directory: /var/tmp/portage/sys-apps/fwupd-1.6.1/work/fwupd-1.6.1-build/meson-private/tmphga6i6a0 >Command line: x86_64-pc-linux-gnu-gcc /var/tmp/portage/sys-apps/fwupd-1.6.1/work/fwupd-1.6.1-build/meson-private/tmphga6i6a0/testfile.c -o /var/tmp/portage/sys-apps/fwupd-1.6.1/work/fwupd-1.6.1-build/meson-private/tmphga6i6a0/output.obj -pipe -c -march=native -O2 -fomit-frame-pointer -D_FILE_OFFSET_BITS=64 -O0 -Wmissing-parameter-type > >Code: > extern int i; >int i; > >Compiler stdout: > >Compiler stderr: > >Compiler for C supports arguments -Wmissing-parameter-type: YES >Running compile: >Working directory: /var/tmp/portage/sys-apps/fwupd-1.6.1/work/fwupd-1.6.1-build/meson-private/tmpvdnp9o25 >Command line: x86_64-pc-linux-gnu-gcc /var/tmp/portage/sys-apps/fwupd-1.6.1/work/fwupd-1.6.1-build/meson-private/tmpvdnp9o25/testfile.c -o /var/tmp/portage/sys-apps/fwupd-1.6.1/work/fwupd-1.6.1-build/meson-private/tmpvdnp9o25/output.obj -pipe -c -march=native -O2 -fomit-frame-pointer -D_FILE_OFFSET_BITS=64 -O0 -Wmissing-prototypes > >Code: > extern int i; >int i; > >Compiler stdout: > >Compiler stderr: > >Compiler for C supports arguments -Wmissing-prototypes: YES >Running compile: >Working directory: /var/tmp/portage/sys-apps/fwupd-1.6.1/work/fwupd-1.6.1-build/meson-private/tmpobyk7jb2 >Command line: x86_64-pc-linux-gnu-gcc /var/tmp/portage/sys-apps/fwupd-1.6.1/work/fwupd-1.6.1-build/meson-private/tmpobyk7jb2/testfile.c -o /var/tmp/portage/sys-apps/fwupd-1.6.1/work/fwupd-1.6.1-build/meson-private/tmpobyk7jb2/output.obj -pipe -c -march=native -O2 -fomit-frame-pointer -D_FILE_OFFSET_BITS=64 -O0 -Wnested-externs > >Code: > extern int i; >int i; > >Compiler stdout: > >Compiler stderr: > >Compiler for C supports arguments -Wnested-externs: YES >Running compile: >Working directory: /var/tmp/portage/sys-apps/fwupd-1.6.1/work/fwupd-1.6.1-build/meson-private/tmpnk96xxee >Command line: x86_64-pc-linux-gnu-gcc /var/tmp/portage/sys-apps/fwupd-1.6.1/work/fwupd-1.6.1-build/meson-private/tmpnk96xxee/testfile.c -o /var/tmp/portage/sys-apps/fwupd-1.6.1/work/fwupd-1.6.1-build/meson-private/tmpnk96xxee/output.obj -pipe -c -march=native -O2 -fomit-frame-pointer -D_FILE_OFFSET_BITS=64 -O0 -Wcast-function-type -Wno-cast-function-type > >Code: > extern int i; >int i; > >Compiler stdout: > >Compiler stderr: > >Compiler for C supports arguments -Wno-cast-function-type: YES >Running compile: >Working directory: /var/tmp/portage/sys-apps/fwupd-1.6.1/work/fwupd-1.6.1-build/meson-private/tmpbmdkwau7 >Command line: x86_64-pc-linux-gnu-gcc /var/tmp/portage/sys-apps/fwupd-1.6.1/work/fwupd-1.6.1-build/meson-private/tmpbmdkwau7/testfile.c -o /var/tmp/portage/sys-apps/fwupd-1.6.1/work/fwupd-1.6.1-build/meson-private/tmpbmdkwau7/output.obj -pipe -c -march=native -O2 -fomit-frame-pointer -D_FILE_OFFSET_BITS=64 -O0 -Waddress-of-packed-member -Wno-address-of-packed-member > >Code: > extern int i; >int i; > >Compiler stdout: > >Compiler stderr: > >Compiler for C supports arguments -Wno-address-of-packed-member: YES >Running compile: >Working directory: /var/tmp/portage/sys-apps/fwupd-1.6.1/work/fwupd-1.6.1-build/meson-private/tmpsj4ldnpj >Command line: x86_64-pc-linux-gnu-gcc /var/tmp/portage/sys-apps/fwupd-1.6.1/work/fwupd-1.6.1-build/meson-private/tmpsj4ldnpj/testfile.c -o /var/tmp/portage/sys-apps/fwupd-1.6.1/work/fwupd-1.6.1-build/meson-private/tmpsj4ldnpj/output.obj -pipe -c -march=native -O2 -fomit-frame-pointer -D_FILE_OFFSET_BITS=64 -O0 -Wunknown-pragmas -Wno-unknown-pragmas > >Code: > extern int i; >int i; > >Compiler stdout: > >Compiler stderr: > >Compiler for C supports arguments -Wno-unknown-pragmas: YES >Running compile: >Working directory: /var/tmp/portage/sys-apps/fwupd-1.6.1/work/fwupd-1.6.1-build/meson-private/tmpsaanzahq >Command line: x86_64-pc-linux-gnu-gcc /var/tmp/portage/sys-apps/fwupd-1.6.1/work/fwupd-1.6.1-build/meson-private/tmpsaanzahq/testfile.c -o /var/tmp/portage/sys-apps/fwupd-1.6.1/work/fwupd-1.6.1-build/meson-private/tmpsaanzahq/output.obj -pipe -c -march=native -O2 -fomit-frame-pointer -D_FILE_OFFSET_BITS=64 -O0 -Wmissing-field-initializers -Wno-missing-field-initializers > >Code: > extern int i; >int i; > >Compiler stdout: > >Compiler stderr: > >Compiler for C supports arguments -Wno-missing-field-initializers: YES >Running compile: >Working directory: /var/tmp/portage/sys-apps/fwupd-1.6.1/work/fwupd-1.6.1-build/meson-private/tmpvtok8r86 >Command line: x86_64-pc-linux-gnu-gcc /var/tmp/portage/sys-apps/fwupd-1.6.1/work/fwupd-1.6.1-build/meson-private/tmpvtok8r86/testfile.c -o /var/tmp/portage/sys-apps/fwupd-1.6.1/work/fwupd-1.6.1-build/meson-private/tmpvtok8r86/output.obj -pipe -c -march=native -O2 -fomit-frame-pointer -D_FILE_OFFSET_BITS=64 -O0 -Wstrict-aliasing -Wno-strict-aliasing > >Code: > extern int i; >int i; > >Compiler stdout: > >Compiler stderr: > >Compiler for C supports arguments -Wno-strict-aliasing: YES >Running compile: >Working directory: /var/tmp/portage/sys-apps/fwupd-1.6.1/work/fwupd-1.6.1-build/meson-private/tmp7gbxtuk1 >Command line: x86_64-pc-linux-gnu-gcc /var/tmp/portage/sys-apps/fwupd-1.6.1/work/fwupd-1.6.1-build/meson-private/tmp7gbxtuk1/testfile.c -o /var/tmp/portage/sys-apps/fwupd-1.6.1/work/fwupd-1.6.1-build/meson-private/tmp7gbxtuk1/output.obj -pipe -c -march=native -O2 -fomit-frame-pointer -D_FILE_OFFSET_BITS=64 -O0 -Wsuggest-attribute=format -Wno-suggest-attribute=format > >Code: > extern int i; >int i; > >Compiler stdout: > >Compiler stderr: > >Compiler for C supports arguments -Wno-suggest-attribute=format: YES >Running compile: >Working directory: /var/tmp/portage/sys-apps/fwupd-1.6.1/work/fwupd-1.6.1-build/meson-private/tmpvvjyq5eq >Command line: x86_64-pc-linux-gnu-gcc /var/tmp/portage/sys-apps/fwupd-1.6.1/work/fwupd-1.6.1-build/meson-private/tmpvvjyq5eq/testfile.c -o /var/tmp/portage/sys-apps/fwupd-1.6.1/work/fwupd-1.6.1-build/meson-private/tmpvvjyq5eq/output.obj -pipe -c -march=native -O2 -fomit-frame-pointer -D_FILE_OFFSET_BITS=64 -O0 -Wunused-parameter -Wno-unused-parameter > >Code: > extern int i; >int i; > >Compiler stdout: > >Compiler stderr: > >Compiler for C supports arguments -Wno-unused-parameter: YES >Running compile: >Working directory: /var/tmp/portage/sys-apps/fwupd-1.6.1/work/fwupd-1.6.1-build/meson-private/tmp_7gl16d8 >Command line: x86_64-pc-linux-gnu-gcc /var/tmp/portage/sys-apps/fwupd-1.6.1/work/fwupd-1.6.1-build/meson-private/tmp_7gl16d8/testfile.c -o /var/tmp/portage/sys-apps/fwupd-1.6.1/work/fwupd-1.6.1-build/meson-private/tmp_7gl16d8/output.obj -pipe -c -march=native -O2 -fomit-frame-pointer -D_FILE_OFFSET_BITS=64 -O0 -Wold-style-definition > >Code: > extern int i; >int i; > >Compiler stdout: > >Compiler stderr: > >Compiler for C supports arguments -Wold-style-definition: YES >Running compile: >Working directory: /var/tmp/portage/sys-apps/fwupd-1.6.1/work/fwupd-1.6.1-build/meson-private/tmpxb4jysjq >Command line: x86_64-pc-linux-gnu-gcc /var/tmp/portage/sys-apps/fwupd-1.6.1/work/fwupd-1.6.1-build/meson-private/tmpxb4jysjq/testfile.c -o /var/tmp/portage/sys-apps/fwupd-1.6.1/work/fwupd-1.6.1-build/meson-private/tmpxb4jysjq/output.obj -pipe -c -march=native -O2 -fomit-frame-pointer -D_FILE_OFFSET_BITS=64 -O0 -Woverride-init > >Code: > extern int i; >int i; > >Compiler stdout: > >Compiler stderr: > >Compiler for C supports arguments -Woverride-init: YES >Running compile: >Working directory: /var/tmp/portage/sys-apps/fwupd-1.6.1/work/fwupd-1.6.1-build/meson-private/tmp1dffegio >Command line: x86_64-pc-linux-gnu-gcc /var/tmp/portage/sys-apps/fwupd-1.6.1/work/fwupd-1.6.1-build/meson-private/tmp1dffegio/testfile.c -o /var/tmp/portage/sys-apps/fwupd-1.6.1/work/fwupd-1.6.1-build/meson-private/tmp1dffegio/output.obj -pipe -c -march=native -O2 -fomit-frame-pointer -D_FILE_OFFSET_BITS=64 -O0 -Wpointer-arith > >Code: > extern int i; >int i; > >Compiler stdout: > >Compiler stderr: > >Compiler for C supports arguments -Wpointer-arith: YES >Running compile: >Working directory: /var/tmp/portage/sys-apps/fwupd-1.6.1/work/fwupd-1.6.1-build/meson-private/tmp7bpg6wpp >Command line: x86_64-pc-linux-gnu-gcc /var/tmp/portage/sys-apps/fwupd-1.6.1/work/fwupd-1.6.1-build/meson-private/tmp7bpg6wpp/testfile.c -o /var/tmp/portage/sys-apps/fwupd-1.6.1/work/fwupd-1.6.1-build/meson-private/tmp7bpg6wpp/output.obj -pipe -c -march=native -O2 -fomit-frame-pointer -D_FILE_OFFSET_BITS=64 -O0 -Wredundant-decls > >Code: > extern int i; >int i; > >Compiler stdout: > >Compiler stderr: > >Compiler for C supports arguments -Wredundant-decls: YES >Running compile: >Working directory: /var/tmp/portage/sys-apps/fwupd-1.6.1/work/fwupd-1.6.1-build/meson-private/tmpcd624dbz >Command line: x86_64-pc-linux-gnu-gcc /var/tmp/portage/sys-apps/fwupd-1.6.1/work/fwupd-1.6.1-build/meson-private/tmpcd624dbz/testfile.c -o /var/tmp/portage/sys-apps/fwupd-1.6.1/work/fwupd-1.6.1-build/meson-private/tmpcd624dbz/output.obj -pipe -c -march=native -O2 -fomit-frame-pointer -D_FILE_OFFSET_BITS=64 -O0 -Wreturn-type > >Code: > extern int i; >int i; > >Compiler stdout: > >Compiler stderr: > >Compiler for C supports arguments -Wreturn-type: YES >Running compile: >Working directory: /var/tmp/portage/sys-apps/fwupd-1.6.1/work/fwupd-1.6.1-build/meson-private/tmpw3w6bm29 >Command line: x86_64-pc-linux-gnu-gcc /var/tmp/portage/sys-apps/fwupd-1.6.1/work/fwupd-1.6.1-build/meson-private/tmpw3w6bm29/testfile.c -o /var/tmp/portage/sys-apps/fwupd-1.6.1/work/fwupd-1.6.1-build/meson-private/tmpw3w6bm29/output.obj -pipe -c -march=native -O2 -fomit-frame-pointer -D_FILE_OFFSET_BITS=64 -O0 -Wshadow > >Code: > extern int i; >int i; > >Compiler stdout: > >Compiler stderr: > >Compiler for C supports arguments -Wshadow: YES >Running compile: >Working directory: /var/tmp/portage/sys-apps/fwupd-1.6.1/work/fwupd-1.6.1-build/meson-private/tmpjix5m0h9 >Command line: x86_64-pc-linux-gnu-gcc /var/tmp/portage/sys-apps/fwupd-1.6.1/work/fwupd-1.6.1-build/meson-private/tmpjix5m0h9/testfile.c -o /var/tmp/portage/sys-apps/fwupd-1.6.1/work/fwupd-1.6.1-build/meson-private/tmpjix5m0h9/output.obj -pipe -c -march=native -O2 -fomit-frame-pointer -D_FILE_OFFSET_BITS=64 -O0 -Wsign-compare > >Code: > extern int i; >int i; > >Compiler stdout: > >Compiler stderr: > >Compiler for C supports arguments -Wsign-compare: YES >Running compile: >Working directory: /var/tmp/portage/sys-apps/fwupd-1.6.1/work/fwupd-1.6.1-build/meson-private/tmpu0u2hxlv >Command line: x86_64-pc-linux-gnu-gcc /var/tmp/portage/sys-apps/fwupd-1.6.1/work/fwupd-1.6.1-build/meson-private/tmpu0u2hxlv/testfile.c -o /var/tmp/portage/sys-apps/fwupd-1.6.1/work/fwupd-1.6.1-build/meson-private/tmpu0u2hxlv/output.obj -pipe -c -march=native -O2 -fomit-frame-pointer -D_FILE_OFFSET_BITS=64 -O0 -Wstrict-aliasing > >Code: > extern int i; >int i; > >Compiler stdout: > >Compiler stderr: > >Compiler for C supports arguments -Wstrict-aliasing: YES >Running compile: >Working directory: /var/tmp/portage/sys-apps/fwupd-1.6.1/work/fwupd-1.6.1-build/meson-private/tmpvy032p9l >Command line: x86_64-pc-linux-gnu-gcc /var/tmp/portage/sys-apps/fwupd-1.6.1/work/fwupd-1.6.1-build/meson-private/tmpvy032p9l/testfile.c -o /var/tmp/portage/sys-apps/fwupd-1.6.1/work/fwupd-1.6.1-build/meson-private/tmpvy032p9l/output.obj -pipe -c -march=native -O2 -fomit-frame-pointer -D_FILE_OFFSET_BITS=64 -O0 -Wstrict-prototypes > >Code: > extern int i; >int i; > >Compiler stdout: > >Compiler stderr: > >Compiler for C supports arguments -Wstrict-prototypes: YES >Running compile: >Working directory: /var/tmp/portage/sys-apps/fwupd-1.6.1/work/fwupd-1.6.1-build/meson-private/tmpyedxx90a >Command line: x86_64-pc-linux-gnu-gcc /var/tmp/portage/sys-apps/fwupd-1.6.1/work/fwupd-1.6.1-build/meson-private/tmpyedxx90a/testfile.c -o /var/tmp/portage/sys-apps/fwupd-1.6.1/work/fwupd-1.6.1-build/meson-private/tmpyedxx90a/output.obj -pipe -c -march=native -O2 -fomit-frame-pointer -D_FILE_OFFSET_BITS=64 -O0 -Wswitch-default > >Code: > extern int i; >int i; > >Compiler stdout: > >Compiler stderr: > >Compiler for C supports arguments -Wswitch-default: YES >Running compile: >Working directory: /var/tmp/portage/sys-apps/fwupd-1.6.1/work/fwupd-1.6.1-build/meson-private/tmp30y2l00u >Command line: x86_64-pc-linux-gnu-gcc /var/tmp/portage/sys-apps/fwupd-1.6.1/work/fwupd-1.6.1-build/meson-private/tmp30y2l00u/testfile.c -o /var/tmp/portage/sys-apps/fwupd-1.6.1/work/fwupd-1.6.1-build/meson-private/tmp30y2l00u/output.obj -pipe -c -march=native -O2 -fomit-frame-pointer -D_FILE_OFFSET_BITS=64 -O0 -Wtype-limits > >Code: > extern int i; >int i; > >Compiler stdout: > >Compiler stderr: > >Compiler for C supports arguments -Wtype-limits: YES >Running compile: >Working directory: /var/tmp/portage/sys-apps/fwupd-1.6.1/work/fwupd-1.6.1-build/meson-private/tmp_1ls0nt9 >Command line: x86_64-pc-linux-gnu-gcc /var/tmp/portage/sys-apps/fwupd-1.6.1/work/fwupd-1.6.1-build/meson-private/tmp_1ls0nt9/testfile.c -o /var/tmp/portage/sys-apps/fwupd-1.6.1/work/fwupd-1.6.1-build/meson-private/tmp_1ls0nt9/output.obj -pipe -c -march=native -O2 -fomit-frame-pointer -D_FILE_OFFSET_BITS=64 -O0 -Wundef > >Code: > extern int i; >int i; > >Compiler stdout: > >Compiler stderr: > >Compiler for C supports arguments -Wundef: YES >Running compile: >Working directory: /var/tmp/portage/sys-apps/fwupd-1.6.1/work/fwupd-1.6.1-build/meson-private/tmp8fyobfdn >Command line: x86_64-pc-linux-gnu-gcc /var/tmp/portage/sys-apps/fwupd-1.6.1/work/fwupd-1.6.1-build/meson-private/tmp8fyobfdn/testfile.c -o /var/tmp/portage/sys-apps/fwupd-1.6.1/work/fwupd-1.6.1-build/meson-private/tmp8fyobfdn/output.obj -pipe -c -march=native -O2 -fomit-frame-pointer -D_FILE_OFFSET_BITS=64 -O0 -Wuninitialized > >Code: > extern int i; >int i; > >Compiler stdout: > >Compiler stderr: > >Compiler for C supports arguments -Wuninitialized: YES >Running compile: >Working directory: /var/tmp/portage/sys-apps/fwupd-1.6.1/work/fwupd-1.6.1-build/meson-private/tmpge64afc2 >Command line: x86_64-pc-linux-gnu-gcc /var/tmp/portage/sys-apps/fwupd-1.6.1/work/fwupd-1.6.1-build/meson-private/tmpge64afc2/testfile.c -o /var/tmp/portage/sys-apps/fwupd-1.6.1/work/fwupd-1.6.1-build/meson-private/tmpge64afc2/output.obj -pipe -c -march=native -O2 -fomit-frame-pointer -D_FILE_OFFSET_BITS=64 -O0 -Wunused-but-set-variable > >Code: > extern int i; >int i; > >Compiler stdout: > >Compiler stderr: > >Compiler for C supports arguments -Wunused-but-set-variable: YES >Running compile: >Working directory: /var/tmp/portage/sys-apps/fwupd-1.6.1/work/fwupd-1.6.1-build/meson-private/tmps0y4i606 >Command line: x86_64-pc-linux-gnu-gcc /var/tmp/portage/sys-apps/fwupd-1.6.1/work/fwupd-1.6.1-build/meson-private/tmps0y4i606/testfile.c -o /var/tmp/portage/sys-apps/fwupd-1.6.1/work/fwupd-1.6.1-build/meson-private/tmps0y4i606/output.obj -pipe -c -march=native -O2 -fomit-frame-pointer -D_FILE_OFFSET_BITS=64 -O0 -Wunused-variable > >Code: > extern int i; >int i; > >Compiler stdout: > >Compiler stderr: > >Compiler for C supports arguments -Wunused-variable: YES >Running compile: >Working directory: /var/tmp/portage/sys-apps/fwupd-1.6.1/work/fwupd-1.6.1-build/meson-private/tmpj03gs69i >Command line: x86_64-pc-linux-gnu-gcc /var/tmp/portage/sys-apps/fwupd-1.6.1/work/fwupd-1.6.1-build/meson-private/tmpj03gs69i/testfile.c -o /var/tmp/portage/sys-apps/fwupd-1.6.1/work/fwupd-1.6.1-build/meson-private/tmpj03gs69i/output.obj -pipe -c -march=native -O2 -fomit-frame-pointer -D_FILE_OFFSET_BITS=64 -O0 -Wvla > >Code: > extern int i; >int i; > >Compiler stdout: > >Compiler stderr: > >Compiler for C supports arguments -Wvla: YES >Running compile: >Working directory: /var/tmp/portage/sys-apps/fwupd-1.6.1/work/fwupd-1.6.1-build/meson-private/tmp0pxk980e >Command line: x86_64-pc-linux-gnu-gcc /var/tmp/portage/sys-apps/fwupd-1.6.1/work/fwupd-1.6.1-build/meson-private/tmp0pxk980e/testfile.c -o /var/tmp/portage/sys-apps/fwupd-1.6.1/work/fwupd-1.6.1-build/meson-private/tmp0pxk980e/output.obj -pipe -c -march=native -O2 -fomit-frame-pointer -D_FILE_OFFSET_BITS=64 -O0 -Wwrite-strings > >Code: > extern int i; >int i; > >Compiler stdout: > >Compiler stderr: > >Compiler for C supports arguments -Wwrite-strings: YES >Program honggfuzz found: NO >Running compile: >Working directory: /var/tmp/portage/sys-apps/fwupd-1.6.1/work/fwupd-1.6.1-build/meson-private/tmps97e_s61 >Command line: x86_64-pc-linux-gnu-gcc /var/tmp/portage/sys-apps/fwupd-1.6.1/work/fwupd-1.6.1-build/meson-private/tmps97e_s61/testfile.c -o /var/tmp/portage/sys-apps/fwupd-1.6.1/work/fwupd-1.6.1-build/meson-private/tmps97e_s61/output.exe -pipe -march=native -O2 -fomit-frame-pointer -D_FILE_OFFSET_BITS=64 -O0 -std=c99 -Wl,-O1 -Wl,--as-needed > >Code: > > #define HF_ITER meson_disable_define_of_HF_ITER > > #include <limits.h> > #undef HF_ITER > > #ifdef __cplusplus > extern "C" > #endif > char HF_ITER (void); > > #if defined __stub_HF_ITER || defined __stub___HF_ITER > fail fail fail this function is not going to work > #endif > > int main(void) { > return HF_ITER (); > } >Compiler stdout: > >Compiler stderr: > /usr/lib/gcc/x86_64-pc-linux-gnu/10.3.0/../../../../x86_64-pc-linux-gnu/bin/ld: /var/tmp/portage/sys-apps/fwupd-1.6.1/temp/ccCL5OAU.o: in function `main': >testfile.c:(.text+0x5): undefined reference to `HF_ITER' >collect2: error: ld returned 1 exit status > >Running compile: >Working directory: /var/tmp/portage/sys-apps/fwupd-1.6.1/work/fwupd-1.6.1-build/meson-private/tmp8bru7n6y >Command line: x86_64-pc-linux-gnu-gcc /var/tmp/portage/sys-apps/fwupd-1.6.1/work/fwupd-1.6.1-build/meson-private/tmp8bru7n6y/testfile.c -o /var/tmp/portage/sys-apps/fwupd-1.6.1/work/fwupd-1.6.1-build/meson-private/tmp8bru7n6y/output.exe -pipe -march=native -O2 -fomit-frame-pointer -D_FILE_OFFSET_BITS=64 -O0 -std=c99 -Wl,-O1 -Wl,--as-needed > >Code: > > int main(void) { > > /* With some toolchains (MSYS2/mingw for example) the compiler > * provides various builtins which are not really implemented and > * fall back to the stdlib where they aren't provided and fail at > * build/link time. In case the user provides a header, including > * the header didn't lead to the function being defined, and the > * function we are checking isn't a builtin itself we assume the > * builtin is not functional and we just error out. */ > #if !1 && !defined(HF_ITER) && !0 > #error "No definition for __builtin_HF_ITER found in the prefix" > #endif > > #ifdef __has_builtin > #if !__has_builtin(__builtin_HF_ITER) > #error "__builtin_HF_ITER not found" > #endif > #elif ! defined(HF_ITER) > __builtin_HF_ITER; > #endif > return 0; > } >Compiler stdout: > >Compiler stderr: > /var/tmp/portage/sys-apps/fwupd-1.6.1/work/fwupd-1.6.1-build/meson-private/tmp8bru7n6y/testfile.c: In function 'main': >/var/tmp/portage/sys-apps/fwupd-1.6.1/work/fwupd-1.6.1-build/meson-private/tmp8bru7n6y/testfile.c:17:18: error: #error "__builtin_HF_ITER not found" > 17 | #error "__builtin_HF_ITER not found" > | ^~~~~ > >Checking for function "HF_ITER" : NO >Running compile: >Working directory: /var/tmp/portage/sys-apps/fwupd-1.6.1/work/fwupd-1.6.1-build/meson-private/tmpskbn8skp >Command line: x86_64-pc-linux-gnu-gcc /var/tmp/portage/sys-apps/fwupd-1.6.1/work/fwupd-1.6.1-build/meson-private/tmpskbn8skp/testfile.c -o /var/tmp/portage/sys-apps/fwupd-1.6.1/work/fwupd-1.6.1-build/meson-private/tmpskbn8skp/output.exe -pipe -march=native -O2 -fomit-frame-pointer -D_FILE_OFFSET_BITS=64 -O0 -Wl,--fatal-warnings -Wl,-z,relro -Wl,-O1 -Wl,--as-needed > >Code: > int main(void) { return 0; } > >Compiler stdout: > >Compiler stderr: > >Compiler for C supports link arguments -Wl,-z,relro: YES >Running compile: >Working directory: /var/tmp/portage/sys-apps/fwupd-1.6.1/work/fwupd-1.6.1-build/meson-private/tmpmcndl87t >Command line: x86_64-pc-linux-gnu-gcc /var/tmp/portage/sys-apps/fwupd-1.6.1/work/fwupd-1.6.1-build/meson-private/tmpmcndl87t/testfile.c -o /var/tmp/portage/sys-apps/fwupd-1.6.1/work/fwupd-1.6.1-build/meson-private/tmpmcndl87t/output.exe -pipe -march=native -O2 -fomit-frame-pointer -D_FILE_OFFSET_BITS=64 -O0 -Wl,--fatal-warnings -Wl,-z,defs -Wl,-O1 -Wl,--as-needed > >Code: > int main(void) { return 0; } > >Compiler stdout: > >Compiler stderr: > >Compiler for C supports link arguments -Wl,-z,defs: YES >Running compile: >Working directory: /var/tmp/portage/sys-apps/fwupd-1.6.1/work/fwupd-1.6.1-build/meson-private/tmpejybuo5m >Command line: x86_64-pc-linux-gnu-gcc /var/tmp/portage/sys-apps/fwupd-1.6.1/work/fwupd-1.6.1-build/meson-private/tmpejybuo5m/testfile.c -o /var/tmp/portage/sys-apps/fwupd-1.6.1/work/fwupd-1.6.1-build/meson-private/tmpejybuo5m/output.exe -pipe -march=native -O2 -fomit-frame-pointer -D_FILE_OFFSET_BITS=64 -O0 -Wl,--fatal-warnings -Wl,-z,now -Wl,-O1 -Wl,--as-needed > >Code: > int main(void) { return 0; } > >Compiler stdout: > >Compiler stderr: > >Compiler for C supports link arguments -Wl,-z,now: YES >Running compile: >Working directory: /var/tmp/portage/sys-apps/fwupd-1.6.1/work/fwupd-1.6.1-build/meson-private/tmp81lo35c5 >Command line: x86_64-pc-linux-gnu-gcc /var/tmp/portage/sys-apps/fwupd-1.6.1/work/fwupd-1.6.1-build/meson-private/tmp81lo35c5/testfile.c -o /var/tmp/portage/sys-apps/fwupd-1.6.1/work/fwupd-1.6.1-build/meson-private/tmp81lo35c5/output.exe -pipe -march=native -O2 -fomit-frame-pointer -D_FILE_OFFSET_BITS=64 -O0 -Wl,--fatal-warnings -Wl,-z,ibt,-z,shstk -Wl,-O1 -Wl,--as-needed > >Code: > int main(void) { return 0; } > >Compiler stdout: > >Compiler stderr: > >Compiler for C supports link arguments -Wl,-z,ibt,-z,shstk: YES >Program diff found: YES (/usr/bin/diff) >Pkg-config binary for MachineChoice.HOST is not cached. >Pkg-config binary for 1 specified from cross file, native file, or env var as ['x86_64-pc-linux-gnu-pkg-config'] >Found pkg-config: /usr/bin/x86_64-pc-linux-gnu-pkg-config (1.6.3) >Determining dependency 'gio-2.0' with pkg-config executable '/usr/bin/x86_64-pc-linux-gnu-pkg-config' >PKG_CONFIG_PATH: /var/tmp/portage/sys-apps/fwupd-1.6.1/temp/pkgconfig:/var/tmp/portage/sys-apps/fwupd-1.6.1/temp/python3.9/pkgconfig:/usr/share/pkgconfig >PKG_CONFIG_LIBDIR: /usr/lib64/pkgconfig >Called `/usr/bin/x86_64-pc-linux-gnu-pkg-config --modversion gio-2.0` -> 0 >2.68.2 >PKG_CONFIG_PATH: /var/tmp/portage/sys-apps/fwupd-1.6.1/temp/pkgconfig:/var/tmp/portage/sys-apps/fwupd-1.6.1/temp/python3.9/pkgconfig:/usr/share/pkgconfig >PKG_CONFIG_LIBDIR: /usr/lib64/pkgconfig >Called `/usr/bin/x86_64-pc-linux-gnu-pkg-config --cflags gio-2.0` -> 0 >-I/usr/include/glib-2.0 -I/usr/lib64/glib-2.0/include -I/usr/lib64/libffi/include -pthread -I/usr/include/libmount -I/usr/include/blkid >PKG_CONFIG_PATH: /var/tmp/portage/sys-apps/fwupd-1.6.1/temp/pkgconfig:/var/tmp/portage/sys-apps/fwupd-1.6.1/temp/python3.9/pkgconfig:/usr/share/pkgconfig >PKG_CONFIG_LIBDIR: /usr/lib64/pkgconfig >Called `/usr/bin/x86_64-pc-linux-gnu-pkg-config --libs gio-2.0` -> 0 >-L/usr/lib64 -lgio-2.0 -lgobject-2.0 -lglib-2.0 >PKG_CONFIG_PATH: /var/tmp/portage/sys-apps/fwupd-1.6.1/temp/pkgconfig:/var/tmp/portage/sys-apps/fwupd-1.6.1/temp/python3.9/pkgconfig:/usr/share/pkgconfig >PKG_CONFIG_LIBDIR: /usr/lib64/pkgconfig >Called `/usr/bin/x86_64-pc-linux-gnu-pkg-config --libs gio-2.0` -> 0 >-lgio-2.0 -lgobject-2.0 -lglib-2.0 >Running compile: >Working directory: /var/tmp/portage/sys-apps/fwupd-1.6.1/work/fwupd-1.6.1-build/meson-private/tmp4lk4zujx >Command line: x86_64-pc-linux-gnu-gcc /var/tmp/portage/sys-apps/fwupd-1.6.1/work/fwupd-1.6.1-build/meson-private/tmp4lk4zujx/testfile.c -o /var/tmp/portage/sys-apps/fwupd-1.6.1/work/fwupd-1.6.1-build/meson-private/tmp4lk4zujx/output.exe -pipe -march=native -O2 -fomit-frame-pointer -D_FILE_OFFSET_BITS=64 -O0 -Wl,-O1 -Wl,--as-needed > >Code: > #include<stdio.h> > > int main(void) { > printf("%ld\n", (long)(sizeof(void *))); > return 0; > }; >Compiler stdout: > >Compiler stderr: > >Program stdout: > >8 > >Program stderr: > > >Running compile: >Working directory: /var/tmp/portage/sys-apps/fwupd-1.6.1/work/fwupd-1.6.1-build/meson-private/tmp4c_2f_cw >Command line: x86_64-pc-linux-gnu-gcc /var/tmp/portage/sys-apps/fwupd-1.6.1/work/fwupd-1.6.1-build/meson-private/tmp4c_2f_cw/testfile.c -o /var/tmp/portage/sys-apps/fwupd-1.6.1/work/fwupd-1.6.1-build/meson-private/tmp4c_2f_cw/output.obj -pipe -c -march=native -O2 -fomit-frame-pointer -D_FILE_OFFSET_BITS=64 -O0 --print-search-dirs > >Code: > >Compiler stdout: > install: /usr/lib/gcc/x86_64-pc-linux-gnu/10.3.0/ >programs: =/usr/libexec/gcc/x86_64-pc-linux-gnu/10.3.0/:/usr/libexec/gcc/x86_64-pc-linux-gnu/10.3.0/:/usr/libexec/gcc/x86_64-pc-linux-gnu/:/usr/lib/gcc/x86_64-pc-linux-gnu/10.3.0/:/usr/lib/gcc/x86_64-pc-linux-gnu/:/usr/lib/gcc/x86_64-pc-linux-gnu/10.3.0/../../../../x86_64-pc-linux-gnu/bin/x86_64-pc-linux-gnu/10.3.0/:/usr/lib/gcc/x86_64-pc-linux-gnu/10.3.0/../../../../x86_64-pc-linux-gnu/bin/ >libraries: =/usr/lib/gcc/x86_64-pc-linux-gnu/10.3.0/:/usr/lib/gcc/x86_64-pc-linux-gnu/10.3.0/../../../../x86_64-pc-linux-gnu/lib/x86_64-pc-linux-gnu/10.3.0/:/usr/lib/gcc/x86_64-pc-linux-gnu/10.3.0/../../../../x86_64-pc-linux-gnu/lib/../lib64/:/usr/lib/gcc/x86_64-pc-linux-gnu/10.3.0/../../../x86_64-pc-linux-gnu/10.3.0/:/usr/lib/gcc/x86_64-pc-linux-gnu/10.3.0/../../../../lib64/:/lib/x86_64-pc-linux-gnu/10.3.0/:/lib/../lib64/:/usr/lib/x86_64-pc-linux-gnu/10.3.0/:/usr/lib/../lib64/:/usr/lib/gcc/x86_64-pc-linux-gnu/10.3.0/../../../../x86_64-pc-linux-gnu/lib/:/usr/lib/gcc/x86_64-pc-linux-gnu/10.3.0/../../../:/lib/:/usr/lib/ > >Compiler stderr: > >Run-time dependency gio-2.0 found: YES 2.68.2 >Pkg-config binary for MachineChoice.HOST is cached. >Determining dependency 'gio-unix-2.0' with pkg-config executable '/usr/bin/x86_64-pc-linux-gnu-pkg-config' >PKG_CONFIG_PATH: /var/tmp/portage/sys-apps/fwupd-1.6.1/temp/pkgconfig:/var/tmp/portage/sys-apps/fwupd-1.6.1/temp/python3.9/pkgconfig:/usr/share/pkgconfig >PKG_CONFIG_LIBDIR: /usr/lib64/pkgconfig >Called `/usr/bin/x86_64-pc-linux-gnu-pkg-config --modversion gio-unix-2.0` -> 0 >2.68.2 >PKG_CONFIG_PATH: /var/tmp/portage/sys-apps/fwupd-1.6.1/temp/pkgconfig:/var/tmp/portage/sys-apps/fwupd-1.6.1/temp/python3.9/pkgconfig:/usr/share/pkgconfig >PKG_CONFIG_LIBDIR: /usr/lib64/pkgconfig >Called `/usr/bin/x86_64-pc-linux-gnu-pkg-config --cflags gio-unix-2.0` -> 0 >-I/usr/include/gio-unix-2.0 -I/usr/include/glib-2.0 -I/usr/lib64/glib-2.0/include -I/usr/lib64/libffi/include -pthread -I/usr/include/libmount -I/usr/include/blkid >PKG_CONFIG_PATH: /var/tmp/portage/sys-apps/fwupd-1.6.1/temp/pkgconfig:/var/tmp/portage/sys-apps/fwupd-1.6.1/temp/python3.9/pkgconfig:/usr/share/pkgconfig >PKG_CONFIG_LIBDIR: /usr/lib64/pkgconfig >Called `/usr/bin/x86_64-pc-linux-gnu-pkg-config --libs gio-unix-2.0` -> 0 >-L/usr/lib64 -lgio-2.0 -lgobject-2.0 -lglib-2.0 >PKG_CONFIG_PATH: /var/tmp/portage/sys-apps/fwupd-1.6.1/temp/pkgconfig:/var/tmp/portage/sys-apps/fwupd-1.6.1/temp/python3.9/pkgconfig:/usr/share/pkgconfig >PKG_CONFIG_LIBDIR: /usr/lib64/pkgconfig >Called `/usr/bin/x86_64-pc-linux-gnu-pkg-config --libs gio-unix-2.0` -> 0 >-lgio-2.0 -lgobject-2.0 -lglib-2.0 >Run-time dependency gio-unix-2.0 found: YES 2.68.2 >Pkg-config binary for MachineChoice.HOST is cached. >Determining dependency 'gmodule-2.0' with pkg-config executable '/usr/bin/x86_64-pc-linux-gnu-pkg-config' >PKG_CONFIG_PATH: /var/tmp/portage/sys-apps/fwupd-1.6.1/temp/pkgconfig:/var/tmp/portage/sys-apps/fwupd-1.6.1/temp/python3.9/pkgconfig:/usr/share/pkgconfig >PKG_CONFIG_LIBDIR: /usr/lib64/pkgconfig >Called `/usr/bin/x86_64-pc-linux-gnu-pkg-config --modversion gmodule-2.0` -> 0 >2.68.2 >PKG_CONFIG_PATH: /var/tmp/portage/sys-apps/fwupd-1.6.1/temp/pkgconfig:/var/tmp/portage/sys-apps/fwupd-1.6.1/temp/python3.9/pkgconfig:/usr/share/pkgconfig >PKG_CONFIG_LIBDIR: /usr/lib64/pkgconfig >Called `/usr/bin/x86_64-pc-linux-gnu-pkg-config --cflags gmodule-2.0` -> 0 >-pthread -I/usr/include/glib-2.0 -I/usr/lib64/glib-2.0/include >PKG_CONFIG_PATH: /var/tmp/portage/sys-apps/fwupd-1.6.1/temp/pkgconfig:/var/tmp/portage/sys-apps/fwupd-1.6.1/temp/python3.9/pkgconfig:/usr/share/pkgconfig >PKG_CONFIG_LIBDIR: /usr/lib64/pkgconfig >Called `/usr/bin/x86_64-pc-linux-gnu-pkg-config --libs gmodule-2.0` -> 0 >-Wl,--export-dynamic -L/usr/lib64 -lgmodule-2.0 -pthread -lglib-2.0 -lglib-2.0 >PKG_CONFIG_PATH: /var/tmp/portage/sys-apps/fwupd-1.6.1/temp/pkgconfig:/var/tmp/portage/sys-apps/fwupd-1.6.1/temp/python3.9/pkgconfig:/usr/share/pkgconfig >PKG_CONFIG_LIBDIR: /usr/lib64/pkgconfig >Called `/usr/bin/x86_64-pc-linux-gnu-pkg-config --libs gmodule-2.0` -> 0 >-Wl,--export-dynamic -lgmodule-2.0 -pthread -lglib-2.0 -lglib-2.0 >Run-time dependency gmodule-2.0 found: YES 2.68.2 >Pkg-config binary for MachineChoice.HOST is cached. >Determining dependency 'gudev-1.0' with pkg-config executable '/usr/bin/x86_64-pc-linux-gnu-pkg-config' >PKG_CONFIG_PATH: /var/tmp/portage/sys-apps/fwupd-1.6.1/temp/pkgconfig:/var/tmp/portage/sys-apps/fwupd-1.6.1/temp/python3.9/pkgconfig:/usr/share/pkgconfig >PKG_CONFIG_LIBDIR: /usr/lib64/pkgconfig >Called `/usr/bin/x86_64-pc-linux-gnu-pkg-config --modversion gudev-1.0` -> 0 >234 >PKG_CONFIG_PATH: /var/tmp/portage/sys-apps/fwupd-1.6.1/temp/pkgconfig:/var/tmp/portage/sys-apps/fwupd-1.6.1/temp/python3.9/pkgconfig:/usr/share/pkgconfig >PKG_CONFIG_LIBDIR: /usr/lib64/pkgconfig >Called `/usr/bin/x86_64-pc-linux-gnu-pkg-config --cflags gudev-1.0` -> 0 >-I/usr/include/gudev-1.0 -I/usr/include/glib-2.0 -I/usr/lib64/glib-2.0/include -I/usr/lib64/libffi/include >PKG_CONFIG_PATH: /var/tmp/portage/sys-apps/fwupd-1.6.1/temp/pkgconfig:/var/tmp/portage/sys-apps/fwupd-1.6.1/temp/python3.9/pkgconfig:/usr/share/pkgconfig >PKG_CONFIG_LIBDIR: /usr/lib64/pkgconfig >Called `/usr/bin/x86_64-pc-linux-gnu-pkg-config --libs gudev-1.0` -> 0 >-L/usr/lib64 -lgudev-1.0 -lgobject-2.0 -lglib-2.0 >PKG_CONFIG_PATH: /var/tmp/portage/sys-apps/fwupd-1.6.1/temp/pkgconfig:/var/tmp/portage/sys-apps/fwupd-1.6.1/temp/python3.9/pkgconfig:/usr/share/pkgconfig >PKG_CONFIG_LIBDIR: /usr/lib64/pkgconfig >Called `/usr/bin/x86_64-pc-linux-gnu-pkg-config --libs gudev-1.0` -> 0 >-lgudev-1.0 -lgobject-2.0 -lglib-2.0 >Run-time dependency gudev-1.0 found: YES 234 >Pkg-config binary for MachineChoice.HOST is cached. >Determining dependency 'xmlb' with pkg-config executable '/usr/bin/x86_64-pc-linux-gnu-pkg-config' >PKG_CONFIG_PATH: /var/tmp/portage/sys-apps/fwupd-1.6.1/temp/pkgconfig:/var/tmp/portage/sys-apps/fwupd-1.6.1/temp/python3.9/pkgconfig:/usr/share/pkgconfig >PKG_CONFIG_LIBDIR: /usr/lib64/pkgconfig >Called `/usr/bin/x86_64-pc-linux-gnu-pkg-config --modversion xmlb` -> 0 >0.1.15 >PKG_CONFIG_PATH: /var/tmp/portage/sys-apps/fwupd-1.6.1/temp/pkgconfig:/var/tmp/portage/sys-apps/fwupd-1.6.1/temp/python3.9/pkgconfig:/usr/share/pkgconfig >PKG_CONFIG_LIBDIR: /usr/lib64/pkgconfig >Called `/usr/bin/x86_64-pc-linux-gnu-pkg-config --cflags xmlb` -> 0 >-I/usr/include/libxmlb-1 -I/usr/include/glib-2.0 -I/usr/lib64/glib-2.0/include -I/usr/lib64/libffi/include -pthread -I/usr/include/libmount -I/usr/include/blkid >PKG_CONFIG_PATH: /var/tmp/portage/sys-apps/fwupd-1.6.1/temp/pkgconfig:/var/tmp/portage/sys-apps/fwupd-1.6.1/temp/python3.9/pkgconfig:/usr/share/pkgconfig >PKG_CONFIG_LIBDIR: /usr/lib64/pkgconfig >Called `/usr/bin/x86_64-pc-linux-gnu-pkg-config --libs xmlb` -> 0 >-L/usr/lib64 -lxmlb -lgio-2.0 -lgobject-2.0 -lglib-2.0 >PKG_CONFIG_PATH: /var/tmp/portage/sys-apps/fwupd-1.6.1/temp/pkgconfig:/var/tmp/portage/sys-apps/fwupd-1.6.1/temp/python3.9/pkgconfig:/usr/share/pkgconfig >PKG_CONFIG_LIBDIR: /usr/lib64/pkgconfig >Called `/usr/bin/x86_64-pc-linux-gnu-pkg-config --libs xmlb` -> 0 >-lxmlb -lgio-2.0 -lgobject-2.0 -lglib-2.0 >Run-time dependency xmlb found: YES 0.1.15 >Pkg-config binary for MachineChoice.HOST is cached. >Determining dependency 'gusb' with pkg-config executable '/usr/bin/x86_64-pc-linux-gnu-pkg-config' >PKG_CONFIG_PATH: /var/tmp/portage/sys-apps/fwupd-1.6.1/temp/pkgconfig:/var/tmp/portage/sys-apps/fwupd-1.6.1/temp/python3.9/pkgconfig:/usr/share/pkgconfig >PKG_CONFIG_LIBDIR: /usr/lib64/pkgconfig >Called `/usr/bin/x86_64-pc-linux-gnu-pkg-config --modversion gusb` -> 0 >0.3.7 >PKG_CONFIG_PATH: /var/tmp/portage/sys-apps/fwupd-1.6.1/temp/pkgconfig:/var/tmp/portage/sys-apps/fwupd-1.6.1/temp/python3.9/pkgconfig:/usr/share/pkgconfig >PKG_CONFIG_LIBDIR: /usr/lib64/pkgconfig >Called `/usr/bin/x86_64-pc-linux-gnu-pkg-config --cflags gusb` -> 0 >-I/usr/include/gusb-1 -I/usr/include/glib-2.0 -I/usr/lib64/glib-2.0/include -I/usr/lib64/libffi/include -pthread -I/usr/include/libmount -I/usr/include/blkid -I/usr/include/libusb-1.0 >PKG_CONFIG_PATH: /var/tmp/portage/sys-apps/fwupd-1.6.1/temp/pkgconfig:/var/tmp/portage/sys-apps/fwupd-1.6.1/temp/python3.9/pkgconfig:/usr/share/pkgconfig >PKG_CONFIG_LIBDIR: /usr/lib64/pkgconfig >Called `/usr/bin/x86_64-pc-linux-gnu-pkg-config --libs gusb` -> 0 >-L/usr/lib64 -lgusb -lgio-2.0 -lgobject-2.0 -lglib-2.0 -lusb-1.0 >PKG_CONFIG_PATH: /var/tmp/portage/sys-apps/fwupd-1.6.1/temp/pkgconfig:/var/tmp/portage/sys-apps/fwupd-1.6.1/temp/python3.9/pkgconfig:/usr/share/pkgconfig >PKG_CONFIG_LIBDIR: /usr/lib64/pkgconfig >Called `/usr/bin/x86_64-pc-linux-gnu-pkg-config --libs gusb` -> 0 >-lgusb -lgio-2.0 -lgobject-2.0 -lglib-2.0 -lusb-1.0 >Run-time dependency gusb found: YES 0.3.7 >Pkg-config binary for MachineChoice.HOST is cached. >Determining dependency 'sqlite3' with pkg-config executable '/usr/bin/x86_64-pc-linux-gnu-pkg-config' >PKG_CONFIG_PATH: /var/tmp/portage/sys-apps/fwupd-1.6.1/temp/pkgconfig:/var/tmp/portage/sys-apps/fwupd-1.6.1/temp/python3.9/pkgconfig:/usr/share/pkgconfig >PKG_CONFIG_LIBDIR: /usr/lib64/pkgconfig >Called `/usr/bin/x86_64-pc-linux-gnu-pkg-config --modversion sqlite3` -> 0 >3.34.1 >PKG_CONFIG_PATH: /var/tmp/portage/sys-apps/fwupd-1.6.1/temp/pkgconfig:/var/tmp/portage/sys-apps/fwupd-1.6.1/temp/python3.9/pkgconfig:/usr/share/pkgconfig >PKG_CONFIG_LIBDIR: /usr/lib64/pkgconfig >Called `/usr/bin/x86_64-pc-linux-gnu-pkg-config --cflags sqlite3` -> 0 > >PKG_CONFIG_PATH: /var/tmp/portage/sys-apps/fwupd-1.6.1/temp/pkgconfig:/var/tmp/portage/sys-apps/fwupd-1.6.1/temp/python3.9/pkgconfig:/usr/share/pkgconfig >PKG_CONFIG_LIBDIR: /usr/lib64/pkgconfig >Called `/usr/bin/x86_64-pc-linux-gnu-pkg-config --libs sqlite3` -> 0 >-L/usr/lib64 -lsqlite3 >PKG_CONFIG_PATH: /var/tmp/portage/sys-apps/fwupd-1.6.1/temp/pkgconfig:/var/tmp/portage/sys-apps/fwupd-1.6.1/temp/python3.9/pkgconfig:/usr/share/pkgconfig >PKG_CONFIG_LIBDIR: /usr/lib64/pkgconfig >Called `/usr/bin/x86_64-pc-linux-gnu-pkg-config --libs sqlite3` -> 0 >-lsqlite3 >Run-time dependency sqlite3 found: YES 3.34.1 >Pkg-config binary for MachineChoice.HOST is cached. >Determining dependency 'libarchive' with pkg-config executable '/usr/bin/x86_64-pc-linux-gnu-pkg-config' >PKG_CONFIG_PATH: /var/tmp/portage/sys-apps/fwupd-1.6.1/temp/pkgconfig:/var/tmp/portage/sys-apps/fwupd-1.6.1/temp/python3.9/pkgconfig:/usr/share/pkgconfig >PKG_CONFIG_LIBDIR: /usr/lib64/pkgconfig >Called `/usr/bin/x86_64-pc-linux-gnu-pkg-config --modversion libarchive` -> 0 >3.5.1 >PKG_CONFIG_PATH: /var/tmp/portage/sys-apps/fwupd-1.6.1/temp/pkgconfig:/var/tmp/portage/sys-apps/fwupd-1.6.1/temp/python3.9/pkgconfig:/usr/share/pkgconfig >PKG_CONFIG_LIBDIR: /usr/lib64/pkgconfig >Called `/usr/bin/x86_64-pc-linux-gnu-pkg-config --cflags libarchive` -> 0 > >PKG_CONFIG_PATH: /var/tmp/portage/sys-apps/fwupd-1.6.1/temp/pkgconfig:/var/tmp/portage/sys-apps/fwupd-1.6.1/temp/python3.9/pkgconfig:/usr/share/pkgconfig >PKG_CONFIG_LIBDIR: /usr/lib64/pkgconfig >Called `/usr/bin/x86_64-pc-linux-gnu-pkg-config --libs libarchive` -> 0 >-L/usr/lib64 -larchive >PKG_CONFIG_PATH: /var/tmp/portage/sys-apps/fwupd-1.6.1/temp/pkgconfig:/var/tmp/portage/sys-apps/fwupd-1.6.1/temp/python3.9/pkgconfig:/usr/share/pkgconfig >PKG_CONFIG_LIBDIR: /usr/lib64/pkgconfig >Called `/usr/bin/x86_64-pc-linux-gnu-pkg-config --libs libarchive` -> 0 >-larchive >Run-time dependency libarchive found: YES 3.5.1 >Pkg-config binary for MachineChoice.HOST is cached. >Determining dependency 'jcat' with pkg-config executable '/usr/bin/x86_64-pc-linux-gnu-pkg-config' >PKG_CONFIG_PATH: /var/tmp/portage/sys-apps/fwupd-1.6.1/temp/pkgconfig:/var/tmp/portage/sys-apps/fwupd-1.6.1/temp/python3.9/pkgconfig:/usr/share/pkgconfig >PKG_CONFIG_LIBDIR: /usr/lib64/pkgconfig >Called `/usr/bin/x86_64-pc-linux-gnu-pkg-config --modversion jcat` -> 0 >0.1.6 >PKG_CONFIG_PATH: /var/tmp/portage/sys-apps/fwupd-1.6.1/temp/pkgconfig:/var/tmp/portage/sys-apps/fwupd-1.6.1/temp/python3.9/pkgconfig:/usr/share/pkgconfig >PKG_CONFIG_LIBDIR: /usr/lib64/pkgconfig >Called `/usr/bin/x86_64-pc-linux-gnu-pkg-config --cflags jcat` -> 0 >-I/usr/include/libjcat-1 -I/usr/include/glib-2.0 -I/usr/lib64/glib-2.0/include -I/usr/lib64/libffi/include -I/usr/include/libmount -I/usr/include/blkid -I/usr/include/json-glib-1.0 -pthread -I/usr/include/p11-kit-1 >PKG_CONFIG_PATH: /var/tmp/portage/sys-apps/fwupd-1.6.1/temp/pkgconfig:/var/tmp/portage/sys-apps/fwupd-1.6.1/temp/python3.9/pkgconfig:/usr/share/pkgconfig >PKG_CONFIG_LIBDIR: /usr/lib64/pkgconfig >Called `/usr/bin/x86_64-pc-linux-gnu-pkg-config --libs jcat` -> 0 >-L/usr/lib64 -ljcat -ljson-glib-1.0 -lgio-2.0 -lgobject-2.0 -lglib-2.0 >PKG_CONFIG_PATH: /var/tmp/portage/sys-apps/fwupd-1.6.1/temp/pkgconfig:/var/tmp/portage/sys-apps/fwupd-1.6.1/temp/python3.9/pkgconfig:/usr/share/pkgconfig >PKG_CONFIG_LIBDIR: /usr/lib64/pkgconfig >Called `/usr/bin/x86_64-pc-linux-gnu-pkg-config --libs jcat` -> 0 >-ljcat -ljson-glib-1.0 -lgio-2.0 -lgobject-2.0 -lglib-2.0 >Run-time dependency jcat found: YES 0.1.6 >Pkg-config binary for MachineChoice.HOST is cached. >Determining dependency 'json-glib-1.0' with pkg-config executable '/usr/bin/x86_64-pc-linux-gnu-pkg-config' >PKG_CONFIG_PATH: /var/tmp/portage/sys-apps/fwupd-1.6.1/temp/pkgconfig:/var/tmp/portage/sys-apps/fwupd-1.6.1/temp/python3.9/pkgconfig:/usr/share/pkgconfig >PKG_CONFIG_LIBDIR: /usr/lib64/pkgconfig >Called `/usr/bin/x86_64-pc-linux-gnu-pkg-config --modversion json-glib-1.0` -> 0 >1.6.2 >PKG_CONFIG_PATH: /var/tmp/portage/sys-apps/fwupd-1.6.1/temp/pkgconfig:/var/tmp/portage/sys-apps/fwupd-1.6.1/temp/python3.9/pkgconfig:/usr/share/pkgconfig >PKG_CONFIG_LIBDIR: /usr/lib64/pkgconfig >Called `/usr/bin/x86_64-pc-linux-gnu-pkg-config --cflags json-glib-1.0` -> 0 >-I/usr/include/json-glib-1.0 -I/usr/include/glib-2.0 -I/usr/lib64/glib-2.0/include -I/usr/lib64/libffi/include -pthread -I/usr/include/libmount -I/usr/include/blkid >PKG_CONFIG_PATH: /var/tmp/portage/sys-apps/fwupd-1.6.1/temp/pkgconfig:/var/tmp/portage/sys-apps/fwupd-1.6.1/temp/python3.9/pkgconfig:/usr/share/pkgconfig >PKG_CONFIG_LIBDIR: /usr/lib64/pkgconfig >Called `/usr/bin/x86_64-pc-linux-gnu-pkg-config --libs json-glib-1.0` -> 0 >-L/usr/lib64 -ljson-glib-1.0 -lgio-2.0 -lgobject-2.0 -lglib-2.0 >PKG_CONFIG_PATH: /var/tmp/portage/sys-apps/fwupd-1.6.1/temp/pkgconfig:/var/tmp/portage/sys-apps/fwupd-1.6.1/temp/python3.9/pkgconfig:/usr/share/pkgconfig >PKG_CONFIG_LIBDIR: /usr/lib64/pkgconfig >Called `/usr/bin/x86_64-pc-linux-gnu-pkg-config --libs json-glib-1.0` -> 0 >-ljson-glib-1.0 -lgio-2.0 -lgobject-2.0 -lglib-2.0 >Run-time dependency json-glib-1.0 found: YES 1.6.2 >Pkg-config binary for MachineChoice.HOST is cached. >Determining dependency 'valgrind' with pkg-config executable '/usr/bin/x86_64-pc-linux-gnu-pkg-config' >PKG_CONFIG_PATH: /var/tmp/portage/sys-apps/fwupd-1.6.1/temp/pkgconfig:/var/tmp/portage/sys-apps/fwupd-1.6.1/temp/python3.9/pkgconfig:/usr/share/pkgconfig >PKG_CONFIG_LIBDIR: /usr/lib64/pkgconfig >Called `/usr/bin/x86_64-pc-linux-gnu-pkg-config --modversion valgrind` -> 1 > >Run-time dependency valgrind found: NO (tried pkgconfig) >Pkg-config binary for MachineChoice.HOST is cached. >Determining dependency 'libcurl' with pkg-config executable '/usr/bin/x86_64-pc-linux-gnu-pkg-config' >PKG_CONFIG_PATH: /var/tmp/portage/sys-apps/fwupd-1.6.1/temp/pkgconfig:/var/tmp/portage/sys-apps/fwupd-1.6.1/temp/python3.9/pkgconfig:/usr/share/pkgconfig >PKG_CONFIG_LIBDIR: /usr/lib64/pkgconfig >Called `/usr/bin/x86_64-pc-linux-gnu-pkg-config --modversion libcurl` -> 0 >7.77.0 >PKG_CONFIG_PATH: /var/tmp/portage/sys-apps/fwupd-1.6.1/temp/pkgconfig:/var/tmp/portage/sys-apps/fwupd-1.6.1/temp/python3.9/pkgconfig:/usr/share/pkgconfig >PKG_CONFIG_LIBDIR: /usr/lib64/pkgconfig >Called `/usr/bin/x86_64-pc-linux-gnu-pkg-config --cflags libcurl` -> 0 > >PKG_CONFIG_PATH: /var/tmp/portage/sys-apps/fwupd-1.6.1/temp/pkgconfig:/var/tmp/portage/sys-apps/fwupd-1.6.1/temp/python3.9/pkgconfig:/usr/share/pkgconfig >PKG_CONFIG_LIBDIR: /usr/lib64/pkgconfig >Called `/usr/bin/x86_64-pc-linux-gnu-pkg-config --libs libcurl` -> 0 >-L/usr/lib64 -lcurl >PKG_CONFIG_PATH: /var/tmp/portage/sys-apps/fwupd-1.6.1/temp/pkgconfig:/var/tmp/portage/sys-apps/fwupd-1.6.1/temp/python3.9/pkgconfig:/usr/share/pkgconfig >PKG_CONFIG_LIBDIR: /usr/lib64/pkgconfig >Called `/usr/bin/x86_64-pc-linux-gnu-pkg-config --libs libcurl` -> 0 >-lcurl >Run-time dependency libcurl found: YES 7.77.0 >Pkg-config binary for MachineChoice.HOST is cached. >Determining dependency 'polkit-gobject-1' with pkg-config executable '/usr/bin/x86_64-pc-linux-gnu-pkg-config' >PKG_CONFIG_PATH: /var/tmp/portage/sys-apps/fwupd-1.6.1/temp/pkgconfig:/var/tmp/portage/sys-apps/fwupd-1.6.1/temp/python3.9/pkgconfig:/usr/share/pkgconfig >PKG_CONFIG_LIBDIR: /usr/lib64/pkgconfig >Called `/usr/bin/x86_64-pc-linux-gnu-pkg-config --modversion polkit-gobject-1` -> 0 >0.119 >PKG_CONFIG_PATH: /var/tmp/portage/sys-apps/fwupd-1.6.1/temp/pkgconfig:/var/tmp/portage/sys-apps/fwupd-1.6.1/temp/python3.9/pkgconfig:/usr/share/pkgconfig >PKG_CONFIG_LIBDIR: /usr/lib64/pkgconfig >Called `/usr/bin/x86_64-pc-linux-gnu-pkg-config --cflags polkit-gobject-1` -> 0 >-I/usr/include/polkit-1 -I/usr/include/glib-2.0 -I/usr/lib64/glib-2.0/include -I/usr/lib64/libffi/include -pthread -I/usr/include/libmount -I/usr/include/blkid >PKG_CONFIG_PATH: /var/tmp/portage/sys-apps/fwupd-1.6.1/temp/pkgconfig:/var/tmp/portage/sys-apps/fwupd-1.6.1/temp/python3.9/pkgconfig:/usr/share/pkgconfig >PKG_CONFIG_LIBDIR: /usr/lib64/pkgconfig >Called `/usr/bin/x86_64-pc-linux-gnu-pkg-config --libs polkit-gobject-1` -> 0 >-L/usr/lib64 -lpolkit-gobject-1 -lgio-2.0 -lgobject-2.0 -lglib-2.0 >PKG_CONFIG_PATH: /var/tmp/portage/sys-apps/fwupd-1.6.1/temp/pkgconfig:/var/tmp/portage/sys-apps/fwupd-1.6.1/temp/python3.9/pkgconfig:/usr/share/pkgconfig >PKG_CONFIG_LIBDIR: /usr/lib64/pkgconfig >Called `/usr/bin/x86_64-pc-linux-gnu-pkg-config --libs polkit-gobject-1` -> 0 >-lpolkit-gobject-1 -lgio-2.0 -lgobject-2.0 -lglib-2.0 >Run-time dependency polkit-gobject-1 found: YES 0.119 >PKG_CONFIG_PATH: /var/tmp/portage/sys-apps/fwupd-1.6.1/temp/pkgconfig:/var/tmp/portage/sys-apps/fwupd-1.6.1/temp/python3.9/pkgconfig:/usr/share/pkgconfig >PKG_CONFIG_LIBDIR: /usr/lib64/pkgconfig >Called `/usr/bin/x86_64-pc-linux-gnu-pkg-config --variable=actiondir polkit-gobject-1` -> 0 >/usr/share/polkit-1/actions/ >Got pkgconfig variable actiondir : /usr/share/polkit-1/actions/ >Pkg-config binary for MachineChoice.HOST is cached. >Determining dependency 'udev' with pkg-config executable '/usr/bin/x86_64-pc-linux-gnu-pkg-config' >PKG_CONFIG_PATH: /var/tmp/portage/sys-apps/fwupd-1.6.1/temp/pkgconfig:/var/tmp/portage/sys-apps/fwupd-1.6.1/temp/python3.9/pkgconfig:/usr/share/pkgconfig >PKG_CONFIG_LIBDIR: /usr/lib64/pkgconfig >Called `/usr/bin/x86_64-pc-linux-gnu-pkg-config --modversion udev` -> 0 >248 >PKG_CONFIG_PATH: /var/tmp/portage/sys-apps/fwupd-1.6.1/temp/pkgconfig:/var/tmp/portage/sys-apps/fwupd-1.6.1/temp/python3.9/pkgconfig:/usr/share/pkgconfig >PKG_CONFIG_LIBDIR: /usr/lib64/pkgconfig >Called `/usr/bin/x86_64-pc-linux-gnu-pkg-config --cflags udev` -> 0 > >PKG_CONFIG_PATH: /var/tmp/portage/sys-apps/fwupd-1.6.1/temp/pkgconfig:/var/tmp/portage/sys-apps/fwupd-1.6.1/temp/python3.9/pkgconfig:/usr/share/pkgconfig >PKG_CONFIG_LIBDIR: /usr/lib64/pkgconfig >Called `/usr/bin/x86_64-pc-linux-gnu-pkg-config --libs udev` -> 0 > >PKG_CONFIG_PATH: /var/tmp/portage/sys-apps/fwupd-1.6.1/temp/pkgconfig:/var/tmp/portage/sys-apps/fwupd-1.6.1/temp/python3.9/pkgconfig:/usr/share/pkgconfig >PKG_CONFIG_LIBDIR: /usr/lib64/pkgconfig >Called `/usr/bin/x86_64-pc-linux-gnu-pkg-config --libs udev` -> 0 > >Run-time dependency udev found: YES 248 >PKG_CONFIG_PATH: /var/tmp/portage/sys-apps/fwupd-1.6.1/temp/pkgconfig:/var/tmp/portage/sys-apps/fwupd-1.6.1/temp/python3.9/pkgconfig:/usr/share/pkgconfig >PKG_CONFIG_LIBDIR: /usr/lib64/pkgconfig >Called `/usr/bin/x86_64-pc-linux-gnu-pkg-config --variable=udevdir udev` -> 0 >/lib/udev >Got pkgconfig variable udevdir : /lib/udev >Running compile: >Working directory: /var/tmp/portage/sys-apps/fwupd-1.6.1/work/fwupd-1.6.1-build/meson-private/tmpkxwpdaxc >Command line: x86_64-pc-linux-gnu-gcc /var/tmp/portage/sys-apps/fwupd-1.6.1/work/fwupd-1.6.1-build/meson-private/tmpkxwpdaxc/testfile.c -o /var/tmp/portage/sys-apps/fwupd-1.6.1/work/fwupd-1.6.1-build/meson-private/tmpkxwpdaxc/output.exe -pipe -march=native -O2 -fomit-frame-pointer -D_FILE_OFFSET_BITS=64 -O0 -Wl,--start-group -lm -Wl,--end-group -Wl,--allow-shlib-undefined -Wl,-O1 -Wl,--as-needed > >Code: > int main(void) { return 0; } > >Compiler stdout: > >Compiler stderr: > >Library m found: YES >Pkg-config binary for MachineChoice.HOST is cached. >Determining dependency 'libgcab-1.0' with pkg-config executable '/usr/bin/x86_64-pc-linux-gnu-pkg-config' >PKG_CONFIG_PATH: /var/tmp/portage/sys-apps/fwupd-1.6.1/temp/pkgconfig:/var/tmp/portage/sys-apps/fwupd-1.6.1/temp/python3.9/pkgconfig:/usr/share/pkgconfig >PKG_CONFIG_LIBDIR: /usr/lib64/pkgconfig >Called `/usr/bin/x86_64-pc-linux-gnu-pkg-config --modversion libgcab-1.0` -> 0 >1.4 >PKG_CONFIG_PATH: /var/tmp/portage/sys-apps/fwupd-1.6.1/temp/pkgconfig:/var/tmp/portage/sys-apps/fwupd-1.6.1/temp/python3.9/pkgconfig:/usr/share/pkgconfig >PKG_CONFIG_LIBDIR: /usr/lib64/pkgconfig >Called `/usr/bin/x86_64-pc-linux-gnu-pkg-config --cflags libgcab-1.0` -> 0 >-I/usr/include/libgcab-1.0 -I/usr/include/glib-2.0 -I/usr/lib64/glib-2.0/include -I/usr/lib64/libffi/include -pthread -I/usr/include/libmount -I/usr/include/blkid >PKG_CONFIG_PATH: /var/tmp/portage/sys-apps/fwupd-1.6.1/temp/pkgconfig:/var/tmp/portage/sys-apps/fwupd-1.6.1/temp/python3.9/pkgconfig:/usr/share/pkgconfig >PKG_CONFIG_LIBDIR: /usr/lib64/pkgconfig >Called `/usr/bin/x86_64-pc-linux-gnu-pkg-config --libs libgcab-1.0` -> 0 >-L/usr/lib64 -lgcab-1.0 -lgio-2.0 -lgobject-2.0 -lglib-2.0 >PKG_CONFIG_PATH: /var/tmp/portage/sys-apps/fwupd-1.6.1/temp/pkgconfig:/var/tmp/portage/sys-apps/fwupd-1.6.1/temp/python3.9/pkgconfig:/usr/share/pkgconfig >PKG_CONFIG_LIBDIR: /usr/lib64/pkgconfig >Called `/usr/bin/x86_64-pc-linux-gnu-pkg-config --libs libgcab-1.0` -> 0 >-lgcab-1.0 -lgio-2.0 -lgobject-2.0 -lglib-2.0 >Run-time dependency libgcab-1.0 found: YES 1.4 >Program gcab found: YES (/usr/bin/gcab) >Pkg-config binary for MachineChoice.HOST is cached. >Determining dependency 'bash-completion' with pkg-config executable '/usr/bin/x86_64-pc-linux-gnu-pkg-config' >PKG_CONFIG_PATH: /var/tmp/portage/sys-apps/fwupd-1.6.1/temp/pkgconfig:/var/tmp/portage/sys-apps/fwupd-1.6.1/temp/python3.9/pkgconfig:/usr/share/pkgconfig >PKG_CONFIG_LIBDIR: /usr/lib64/pkgconfig >Called `/usr/bin/x86_64-pc-linux-gnu-pkg-config --modversion bash-completion` -> 0 >2.11 >PKG_CONFIG_PATH: /var/tmp/portage/sys-apps/fwupd-1.6.1/temp/pkgconfig:/var/tmp/portage/sys-apps/fwupd-1.6.1/temp/python3.9/pkgconfig:/usr/share/pkgconfig >PKG_CONFIG_LIBDIR: /usr/lib64/pkgconfig >Called `/usr/bin/x86_64-pc-linux-gnu-pkg-config --cflags bash-completion` -> 0 > >PKG_CONFIG_PATH: /var/tmp/portage/sys-apps/fwupd-1.6.1/temp/pkgconfig:/var/tmp/portage/sys-apps/fwupd-1.6.1/temp/python3.9/pkgconfig:/usr/share/pkgconfig >PKG_CONFIG_LIBDIR: /usr/lib64/pkgconfig >Called `/usr/bin/x86_64-pc-linux-gnu-pkg-config --libs bash-completion` -> 0 > >PKG_CONFIG_PATH: /var/tmp/portage/sys-apps/fwupd-1.6.1/temp/pkgconfig:/var/tmp/portage/sys-apps/fwupd-1.6.1/temp/python3.9/pkgconfig:/usr/share/pkgconfig >PKG_CONFIG_LIBDIR: /usr/lib64/pkgconfig >Called `/usr/bin/x86_64-pc-linux-gnu-pkg-config --libs bash-completion` -> 0 > >Run-time dependency bash-completion found: YES 2.11 >Program python3.8 found: YES (/usr/bin/python3.8) >Pkg-config binary for MachineChoice.HOST is cached. >Determining dependency 'gnutls' with pkg-config executable '/usr/bin/x86_64-pc-linux-gnu-pkg-config' >PKG_CONFIG_PATH: /var/tmp/portage/sys-apps/fwupd-1.6.1/temp/pkgconfig:/var/tmp/portage/sys-apps/fwupd-1.6.1/temp/python3.9/pkgconfig:/usr/share/pkgconfig >PKG_CONFIG_LIBDIR: /usr/lib64/pkgconfig >Called `/usr/bin/x86_64-pc-linux-gnu-pkg-config --modversion gnutls` -> 0 >3.7.1 >PKG_CONFIG_PATH: /var/tmp/portage/sys-apps/fwupd-1.6.1/temp/pkgconfig:/var/tmp/portage/sys-apps/fwupd-1.6.1/temp/python3.9/pkgconfig:/usr/share/pkgconfig >PKG_CONFIG_LIBDIR: /usr/lib64/pkgconfig >Called `/usr/bin/x86_64-pc-linux-gnu-pkg-config --cflags gnutls` -> 0 >-I/usr/include/p11-kit-1 >PKG_CONFIG_PATH: /var/tmp/portage/sys-apps/fwupd-1.6.1/temp/pkgconfig:/var/tmp/portage/sys-apps/fwupd-1.6.1/temp/python3.9/pkgconfig:/usr/share/pkgconfig >PKG_CONFIG_LIBDIR: /usr/lib64/pkgconfig >Called `/usr/bin/x86_64-pc-linux-gnu-pkg-config --libs gnutls` -> 0 >-L/usr/lib64 -lgnutls >PKG_CONFIG_PATH: /var/tmp/portage/sys-apps/fwupd-1.6.1/temp/pkgconfig:/var/tmp/portage/sys-apps/fwupd-1.6.1/temp/python3.9/pkgconfig:/usr/share/pkgconfig >PKG_CONFIG_LIBDIR: /usr/lib64/pkgconfig >Called `/usr/bin/x86_64-pc-linux-gnu-pkg-config --libs gnutls` -> 0 >-lgnutls >Run-time dependency gnutls found: YES 3.7.1 >Pkg-config binary for MachineChoice.HOST is cached. >Determining dependency 'liblzma' with pkg-config executable '/usr/bin/x86_64-pc-linux-gnu-pkg-config' >PKG_CONFIG_PATH: /var/tmp/portage/sys-apps/fwupd-1.6.1/temp/pkgconfig:/var/tmp/portage/sys-apps/fwupd-1.6.1/temp/python3.9/pkgconfig:/usr/share/pkgconfig >PKG_CONFIG_LIBDIR: /usr/lib64/pkgconfig >Called `/usr/bin/x86_64-pc-linux-gnu-pkg-config --modversion liblzma` -> 0 >5.2.5 >PKG_CONFIG_PATH: /var/tmp/portage/sys-apps/fwupd-1.6.1/temp/pkgconfig:/var/tmp/portage/sys-apps/fwupd-1.6.1/temp/python3.9/pkgconfig:/usr/share/pkgconfig >PKG_CONFIG_LIBDIR: /usr/lib64/pkgconfig >Called `/usr/bin/x86_64-pc-linux-gnu-pkg-config --cflags liblzma` -> 0 > >PKG_CONFIG_PATH: /var/tmp/portage/sys-apps/fwupd-1.6.1/temp/pkgconfig:/var/tmp/portage/sys-apps/fwupd-1.6.1/temp/python3.9/pkgconfig:/usr/share/pkgconfig >PKG_CONFIG_LIBDIR: /usr/lib64/pkgconfig >Called `/usr/bin/x86_64-pc-linux-gnu-pkg-config --libs liblzma` -> 0 >-L/usr/lib64 -llzma >PKG_CONFIG_PATH: /var/tmp/portage/sys-apps/fwupd-1.6.1/temp/pkgconfig:/var/tmp/portage/sys-apps/fwupd-1.6.1/temp/python3.9/pkgconfig:/usr/share/pkgconfig >PKG_CONFIG_LIBDIR: /usr/lib64/pkgconfig >Called `/usr/bin/x86_64-pc-linux-gnu-pkg-config --libs liblzma` -> 0 >-llzma >Run-time dependency liblzma found: YES 5.2.5 >Pkg-config binary for MachineChoice.HOST is cached. >Determining dependency 'libelf' with pkg-config executable '/usr/bin/x86_64-pc-linux-gnu-pkg-config' >PKG_CONFIG_PATH: /var/tmp/portage/sys-apps/fwupd-1.6.1/temp/pkgconfig:/var/tmp/portage/sys-apps/fwupd-1.6.1/temp/python3.9/pkgconfig:/usr/share/pkgconfig >PKG_CONFIG_LIBDIR: /usr/lib64/pkgconfig >Called `/usr/bin/x86_64-pc-linux-gnu-pkg-config --modversion libelf` -> 0 >0.184 >PKG_CONFIG_PATH: /var/tmp/portage/sys-apps/fwupd-1.6.1/temp/pkgconfig:/var/tmp/portage/sys-apps/fwupd-1.6.1/temp/python3.9/pkgconfig:/usr/share/pkgconfig >PKG_CONFIG_LIBDIR: /usr/lib64/pkgconfig >Called `/usr/bin/x86_64-pc-linux-gnu-pkg-config --cflags libelf` -> 0 > >PKG_CONFIG_PATH: /var/tmp/portage/sys-apps/fwupd-1.6.1/temp/pkgconfig:/var/tmp/portage/sys-apps/fwupd-1.6.1/temp/python3.9/pkgconfig:/usr/share/pkgconfig >PKG_CONFIG_LIBDIR: /usr/lib64/pkgconfig >Called `/usr/bin/x86_64-pc-linux-gnu-pkg-config --libs libelf` -> 0 >-L/usr/lib64 -lelf >PKG_CONFIG_PATH: /var/tmp/portage/sys-apps/fwupd-1.6.1/temp/pkgconfig:/var/tmp/portage/sys-apps/fwupd-1.6.1/temp/python3.9/pkgconfig:/usr/share/pkgconfig >PKG_CONFIG_LIBDIR: /usr/lib64/pkgconfig >Called `/usr/bin/x86_64-pc-linux-gnu-pkg-config --libs libelf` -> 0 >-lelf >Run-time dependency libelf found: YES 0.184 >Running compile: >Working directory: /var/tmp/portage/sys-apps/fwupd-1.6.1/work/fwupd-1.6.1-build/meson-private/tmp7dzahjzc >Command line: x86_64-pc-linux-gnu-gcc /var/tmp/portage/sys-apps/fwupd-1.6.1/work/fwupd-1.6.1-build/meson-private/tmp7dzahjzc/testfile.c -pipe -E -P -march=native -O2 -fomit-frame-pointer -D_FILE_OFFSET_BITS=64 -P -O0 -std=c99 > >Code: > > #ifdef __has_include > #if !__has_include("sys/utsname.h") > #error "Header 'sys/utsname.h' could not be found" > #endif > #else > #include <sys/utsname.h> > #endif >Compiler stdout: > >Compiler stderr: > >Has header "sys/utsname.h" : YES >Running compile: >Working directory: /var/tmp/portage/sys-apps/fwupd-1.6.1/work/fwupd-1.6.1-build/meson-private/tmp750gfvbe >Command line: x86_64-pc-linux-gnu-gcc /var/tmp/portage/sys-apps/fwupd-1.6.1/work/fwupd-1.6.1-build/meson-private/tmp750gfvbe/testfile.c -pipe -E -P -march=native -O2 -fomit-frame-pointer -D_FILE_OFFSET_BITS=64 -P -O0 -std=c99 > >Code: > > #ifdef __has_include > #if !__has_include("sys/ioctl.h") > #error "Header 'sys/ioctl.h' could not be found" > #endif > #else > #include <sys/ioctl.h> > #endif >Compiler stdout: > >Compiler stderr: > >Has header "sys/ioctl.h" : YES >Running compile: >Working directory: /var/tmp/portage/sys-apps/fwupd-1.6.1/work/fwupd-1.6.1-build/meson-private/tmpmk1quo7m >Command line: x86_64-pc-linux-gnu-gcc /var/tmp/portage/sys-apps/fwupd-1.6.1/work/fwupd-1.6.1-build/meson-private/tmpmk1quo7m/testfile.c -pipe -E -P -march=native -O2 -fomit-frame-pointer -D_FILE_OFFSET_BITS=64 -P -O0 -std=c99 > >Code: > > #ifdef __has_include > #if !__has_include("errno.h") > #error "Header 'errno.h' could not be found" > #endif > #else > #include <errno.h> > #endif >Compiler stdout: > >Compiler stderr: > >Has header "errno.h" : YES >Running compile: >Working directory: /var/tmp/portage/sys-apps/fwupd-1.6.1/work/fwupd-1.6.1-build/meson-private/tmpx056sd1t >Command line: x86_64-pc-linux-gnu-gcc /var/tmp/portage/sys-apps/fwupd-1.6.1/work/fwupd-1.6.1-build/meson-private/tmpx056sd1t/testfile.c -pipe -E -P -march=native -O2 -fomit-frame-pointer -D_FILE_OFFSET_BITS=64 -P -O0 -std=c99 > >Code: > > #ifdef __has_include > #if !__has_include("sys/socket.h") > #error "Header 'sys/socket.h' could not be found" > #endif > #else > #include <sys/socket.h> > #endif >Compiler stdout: > >Compiler stderr: > >Has header "sys/socket.h" : YES >Running compile: >Working directory: /var/tmp/portage/sys-apps/fwupd-1.6.1/work/fwupd-1.6.1-build/meson-private/tmpxy5ybz5x >Command line: x86_64-pc-linux-gnu-gcc /var/tmp/portage/sys-apps/fwupd-1.6.1/work/fwupd-1.6.1-build/meson-private/tmpxy5ybz5x/testfile.c -pipe -E -P -march=native -O2 -fomit-frame-pointer -D_FILE_OFFSET_BITS=64 -P -O0 -std=c99 > >Code: > > #ifdef __has_include > #if !__has_include("linux/ethtool.h") > #error "Header 'linux/ethtool.h' could not be found" > #endif > #else > #include <linux/ethtool.h> > #endif >Compiler stdout: > >Compiler stderr: > >Has header "linux/ethtool.h" : YES >Running compile: >Working directory: /var/tmp/portage/sys-apps/fwupd-1.6.1/work/fwupd-1.6.1-build/meson-private/tmp8l_iepun >Command line: x86_64-pc-linux-gnu-gcc /var/tmp/portage/sys-apps/fwupd-1.6.1/work/fwupd-1.6.1-build/meson-private/tmp8l_iepun/testfile.c -pipe -E -P -march=native -O2 -fomit-frame-pointer -D_FILE_OFFSET_BITS=64 -P -O0 -std=c99 > >Code: > > #ifdef __has_include > #if !__has_include("linux/hidraw.h") > #error "Header 'linux/hidraw.h' could not be found" > #endif > #else > #include <linux/hidraw.h> > #endif >Compiler stdout: > >Compiler stderr: > >Has header "linux/hidraw.h" : YES >Running compile: >Working directory: /var/tmp/portage/sys-apps/fwupd-1.6.1/work/fwupd-1.6.1-build/meson-private/tmpoj2br_tr >Command line: x86_64-pc-linux-gnu-gcc /var/tmp/portage/sys-apps/fwupd-1.6.1/work/fwupd-1.6.1-build/meson-private/tmpoj2br_tr/testfile.c -pipe -E -P -march=native -O2 -fomit-frame-pointer -D_FILE_OFFSET_BITS=64 -P -O0 -std=c99 > >Code: > > #ifdef __has_include > #if !__has_include("sys/mman.h") > #error "Header 'sys/mman.h' could not be found" > #endif > #else > #include <sys/mman.h> > #endif >Compiler stdout: > >Compiler stderr: > >Has header "sys/mman.h" : YES >Running compile: >Working directory: /var/tmp/portage/sys-apps/fwupd-1.6.1/work/fwupd-1.6.1-build/meson-private/tmp1qxsewxe >Command line: x86_64-pc-linux-gnu-gcc /var/tmp/portage/sys-apps/fwupd-1.6.1/work/fwupd-1.6.1-build/meson-private/tmp1qxsewxe/testfile.c -pipe -E -P -march=native -O2 -fomit-frame-pointer -D_FILE_OFFSET_BITS=64 -P -O0 -std=c99 > >Code: > > #ifdef __has_include > #if !__has_include("poll.h") > #error "Header 'poll.h' could not be found" > #endif > #else > #include <poll.h> > #endif >Compiler stdout: > >Compiler stderr: > >Has header "poll.h" : YES >Running compile: >Working directory: /var/tmp/portage/sys-apps/fwupd-1.6.1/work/fwupd-1.6.1-build/meson-private/tmp4stbucix >Command line: x86_64-pc-linux-gnu-gcc /var/tmp/portage/sys-apps/fwupd-1.6.1/work/fwupd-1.6.1-build/meson-private/tmp4stbucix/testfile.c -pipe -E -P -march=native -O2 -fomit-frame-pointer -D_FILE_OFFSET_BITS=64 -P -O0 -std=c99 > >Code: > > #ifdef __has_include > #if !__has_include("fnmatch.h") > #error "Header 'fnmatch.h' could not be found" > #endif > #else > #include <fnmatch.h> > #endif >Compiler stdout: > >Compiler stderr: > >Has header "fnmatch.h" : YES >Running compile: >Working directory: /var/tmp/portage/sys-apps/fwupd-1.6.1/work/fwupd-1.6.1-build/meson-private/tmpmausrqv7 >Command line: x86_64-pc-linux-gnu-gcc /var/tmp/portage/sys-apps/fwupd-1.6.1/work/fwupd-1.6.1-build/meson-private/tmpmausrqv7/testfile.c -pipe -E -P -march=native -O2 -fomit-frame-pointer -D_FILE_OFFSET_BITS=64 -P -O0 -std=c99 > >Code: > > #ifdef __has_include > #if !__has_include("kenv.h") > #error "Header 'kenv.h' could not be found" > #endif > #else > #include <kenv.h> > #endif >Compiler stdout: > >Compiler stderr: > /var/tmp/portage/sys-apps/fwupd-1.6.1/work/fwupd-1.6.1-build/meson-private/tmpmausrqv7/testfile.c:4:12: error: #error "Header 'kenv.h' could not be found" > 4 | #error "Header 'kenv.h' could not be found" > | ^~~~~ > >Has header "kenv.h" : NO >Running compile: >Working directory: /var/tmp/portage/sys-apps/fwupd-1.6.1/work/fwupd-1.6.1-build/meson-private/tmp5btnp_2l >Command line: x86_64-pc-linux-gnu-gcc /var/tmp/portage/sys-apps/fwupd-1.6.1/work/fwupd-1.6.1-build/meson-private/tmp5btnp_2l/testfile.c -pipe -E -P -march=native -O2 -fomit-frame-pointer -D_FILE_OFFSET_BITS=64 -P -O0 -std=c99 > >Code: > > #ifdef __has_include > #if !__has_include("malloc.h") > #error "Header 'malloc.h' could not be found" > #endif > #else > #include <malloc.h> > #endif >Compiler stdout: > >Compiler stderr: > >Has header "malloc.h" : YES >Running compile: >Working directory: /var/tmp/portage/sys-apps/fwupd-1.6.1/work/fwupd-1.6.1-build/meson-private/tmpyxpyeu4v >Command line: x86_64-pc-linux-gnu-gcc /var/tmp/portage/sys-apps/fwupd-1.6.1/work/fwupd-1.6.1-build/meson-private/tmpyxpyeu4v/testfile.c -o /var/tmp/portage/sys-apps/fwupd-1.6.1/work/fwupd-1.6.1-build/meson-private/tmpyxpyeu4v/output.exe -pipe -march=native -O2 -fomit-frame-pointer -D_FILE_OFFSET_BITS=64 -O0 -std=c99 -Wl,-O1 -Wl,--as-needed > >Code: > #include <malloc.h> >#include <limits.h> > > #if defined __stub_malloc_trim || defined __stub___malloc_trim > fail fail fail this function is not going to work > #endif > >int main(void) { > void *a = (void*) &malloc_trim; > long long b = (long long) a; > return (int) b; > } >Compiler stdout: > >Compiler stderr: > >Checking for function "malloc_trim" : YES >Running compile: >Working directory: /var/tmp/portage/sys-apps/fwupd-1.6.1/work/fwupd-1.6.1-build/meson-private/tmplyc8qsgt >Command line: x86_64-pc-linux-gnu-gcc /var/tmp/portage/sys-apps/fwupd-1.6.1/work/fwupd-1.6.1-build/meson-private/tmplyc8qsgt/testfile.c -pipe -E -P -march=native -O2 -fomit-frame-pointer -D_FILE_OFFSET_BITS=64 -P -O0 -std=c99 > >Code: > > #ifdef __has_include > #if !__has_include("cpuid.h") > #error "Header 'cpuid.h' could not be found" > #endif > #else > #include <cpuid.h> > #endif >Compiler stdout: > >Compiler stderr: > >Has header "cpuid.h" : YES >Running compile: >Working directory: /var/tmp/portage/sys-apps/fwupd-1.6.1/work/fwupd-1.6.1-build/meson-private/tmpbr3vkrur >Command line: x86_64-pc-linux-gnu-gcc /var/tmp/portage/sys-apps/fwupd-1.6.1/work/fwupd-1.6.1-build/meson-private/tmpbr3vkrur/testfile.c -o /var/tmp/portage/sys-apps/fwupd-1.6.1/work/fwupd-1.6.1-build/meson-private/tmpbr3vkrur/output.obj -pipe -c -march=native -O2 -fomit-frame-pointer -D_FILE_OFFSET_BITS=64 -O0 -std=c99 > >Code: > > #include <cpuid.h> > int main(void) { > /* If it's not defined as a macro, try to use as a symbol */ > #ifndef __get_cpuid_count > __get_cpuid_count; > #endif > return 0; > } >Compiler stdout: > >Compiler stderr: > >Header <cpuid.h> has symbol "__get_cpuid_count" : YES >Running compile: >Working directory: /var/tmp/portage/sys-apps/fwupd-1.6.1/work/fwupd-1.6.1-build/meson-private/tmp7gqscwlp >Command line: x86_64-pc-linux-gnu-gcc /var/tmp/portage/sys-apps/fwupd-1.6.1/work/fwupd-1.6.1-build/meson-private/tmp7gqscwlp/testfile.c -o /var/tmp/portage/sys-apps/fwupd-1.6.1/work/fwupd-1.6.1-build/meson-private/tmp7gqscwlp/output.exe -pipe -march=native -O2 -fomit-frame-pointer -D_FILE_OFFSET_BITS=64 -O0 -std=c99 -Wl,-O1 -Wl,--as-needed > >Code: > > #define getuid meson_disable_define_of_getuid > > #include <limits.h> > #undef getuid > > #ifdef __cplusplus > extern "C" > #endif > char getuid (void); > > #if defined __stub_getuid || defined __stub___getuid > fail fail fail this function is not going to work > #endif > > int main(void) { > return getuid (); > } >Compiler stdout: > >Compiler stderr: > >Checking for function "getuid" : YES >Running compile: >Working directory: /var/tmp/portage/sys-apps/fwupd-1.6.1/work/fwupd-1.6.1-build/meson-private/tmpqe6ro8mo >Command line: x86_64-pc-linux-gnu-gcc /var/tmp/portage/sys-apps/fwupd-1.6.1/work/fwupd-1.6.1-build/meson-private/tmpqe6ro8mo/testfile.c -o /var/tmp/portage/sys-apps/fwupd-1.6.1/work/fwupd-1.6.1-build/meson-private/tmpqe6ro8mo/output.exe -pipe -march=native -O2 -fomit-frame-pointer -D_FILE_OFFSET_BITS=64 -O0 -std=c99 -Wl,-O1 -Wl,--as-needed > >Code: > > #define realpath meson_disable_define_of_realpath > > #include <limits.h> > #undef realpath > > #ifdef __cplusplus > extern "C" > #endif > char realpath (void); > > #if defined __stub_realpath || defined __stub___realpath > fail fail fail this function is not going to work > #endif > > int main(void) { > return realpath (); > } >Compiler stdout: > >Compiler stderr: > >Checking for function "realpath" : YES >Running compile: >Working directory: /var/tmp/portage/sys-apps/fwupd-1.6.1/work/fwupd-1.6.1-build/meson-private/tmpwegwwlni >Command line: x86_64-pc-linux-gnu-gcc /var/tmp/portage/sys-apps/fwupd-1.6.1/work/fwupd-1.6.1-build/meson-private/tmpwegwwlni/testfile.c -o /var/tmp/portage/sys-apps/fwupd-1.6.1/work/fwupd-1.6.1-build/meson-private/tmpwegwwlni/output.exe -pipe -march=native -O2 -fomit-frame-pointer -D_FILE_OFFSET_BITS=64 -O0 -std=c99 -Wl,-O1 -Wl,--as-needed > >Code: > > #define memmem meson_disable_define_of_memmem > > #include <limits.h> > #undef memmem > > #ifdef __cplusplus > extern "C" > #endif > char memmem (void); > > #if defined __stub_memmem || defined __stub___memmem > fail fail fail this function is not going to work > #endif > > int main(void) { > return memmem (); > } >Compiler stdout: > >Compiler stderr: > >Checking for function "memmem" : YES >Running compile: >Working directory: /var/tmp/portage/sys-apps/fwupd-1.6.1/work/fwupd-1.6.1-build/meson-private/tmpdkdypnqb >Command line: x86_64-pc-linux-gnu-gcc /var/tmp/portage/sys-apps/fwupd-1.6.1/work/fwupd-1.6.1-build/meson-private/tmpdkdypnqb/testfile.c -o /var/tmp/portage/sys-apps/fwupd-1.6.1/work/fwupd-1.6.1-build/meson-private/tmpdkdypnqb/output.exe -pipe -march=native -O2 -fomit-frame-pointer -D_FILE_OFFSET_BITS=64 -O0 -std=c99 -Wl,-O1 -Wl,--as-needed > >Code: > > #define sigaction meson_disable_define_of_sigaction > > #include <limits.h> > #undef sigaction > > #ifdef __cplusplus > extern "C" > #endif > char sigaction (void); > > #if defined __stub_sigaction || defined __stub___sigaction > fail fail fail this function is not going to work > #endif > > int main(void) { > return sigaction (); > } >Compiler stdout: > >Compiler stderr: > >Checking for function "sigaction" : YES >Running compile: >Working directory: /var/tmp/portage/sys-apps/fwupd-1.6.1/work/fwupd-1.6.1-build/meson-private/tmpf5hwjwjh >Command line: x86_64-pc-linux-gnu-gcc /var/tmp/portage/sys-apps/fwupd-1.6.1/work/fwupd-1.6.1-build/meson-private/tmpf5hwjwjh/testfile.c -o /var/tmp/portage/sys-apps/fwupd-1.6.1/work/fwupd-1.6.1-build/meson-private/tmpf5hwjwjh/output.exe -pipe -march=native -O2 -fomit-frame-pointer -D_FILE_OFFSET_BITS=64 -O0 -std=c99 -Wl,-O1 -Wl,--as-needed > >Code: > > #define memfd_create meson_disable_define_of_memfd_create > > #include <limits.h> > #undef memfd_create > > #ifdef __cplusplus > extern "C" > #endif > char memfd_create (void); > > #if defined __stub_memfd_create || defined __stub___memfd_create > fail fail fail this function is not going to work > #endif > > int main(void) { > return memfd_create (); > } >Compiler stdout: > >Compiler stderr: > >Checking for function "memfd_create" : YES >Running compile: >Working directory: /var/tmp/portage/sys-apps/fwupd-1.6.1/work/fwupd-1.6.1-build/meson-private/tmp4p3h5mbj >Command line: x86_64-pc-linux-gnu-gcc /var/tmp/portage/sys-apps/fwupd-1.6.1/work/fwupd-1.6.1-build/meson-private/tmp4p3h5mbj/testfile.c -o /var/tmp/portage/sys-apps/fwupd-1.6.1/work/fwupd-1.6.1-build/meson-private/tmp4p3h5mbj/output.obj -pipe -c -march=native -O2 -fomit-frame-pointer -D_FILE_OFFSET_BITS=64 -O0 -std=c99 > >Code: > > #include <locale.h> > int main(void) { > /* If it's not defined as a macro, try to use as a symbol */ > #ifndef LC_MESSAGES > LC_MESSAGES; > #endif > return 0; > } >Compiler stdout: > >Compiler stderr: > >Header <locale.h> has symbol "LC_MESSAGES" : YES >Running compile: >Working directory: /var/tmp/portage/sys-apps/fwupd-1.6.1/work/fwupd-1.6.1-build/meson-private/tmpiptv0pl4 >Command line: x86_64-pc-linux-gnu-gcc /var/tmp/portage/sys-apps/fwupd-1.6.1/work/fwupd-1.6.1-build/meson-private/tmpiptv0pl4/testfile.c -o /var/tmp/portage/sys-apps/fwupd-1.6.1/work/fwupd-1.6.1-build/meson-private/tmpiptv0pl4/output.obj -pipe -c -march=native -O2 -fomit-frame-pointer -D_FILE_OFFSET_BITS=64 -O0 -std=c99 > >Code: > > #include <fcntl.h> > int main(void) { > /* If it's not defined as a macro, try to use as a symbol */ > #ifndef F_WRLCK > F_WRLCK; > #endif > return 0; > } >Compiler stdout: > >Compiler stderr: > >Header <fcntl.h> has symbol "F_WRLCK" : YES >Running compile: >Working directory: /var/tmp/portage/sys-apps/fwupd-1.6.1/work/fwupd-1.6.1-build/meson-private/tmpj937dgno >Command line: x86_64-pc-linux-gnu-gcc /var/tmp/portage/sys-apps/fwupd-1.6.1/work/fwupd-1.6.1-build/meson-private/tmpj937dgno/testfile.c -o /var/tmp/portage/sys-apps/fwupd-1.6.1/work/fwupd-1.6.1-build/meson-private/tmpj937dgno/output.obj -pipe -c -march=native -O2 -fomit-frame-pointer -D_FILE_OFFSET_BITS=64 -O0 -std=c99 > >Code: > > #include <fcntl.h> > int main(void) { > /* If it's not defined as a macro, try to use as a symbol */ > #ifndef F_OFD_SETLK > F_OFD_SETLK; > #endif > return 0; > } >Compiler stdout: > >Compiler stderr: > /var/tmp/portage/sys-apps/fwupd-1.6.1/work/fwupd-1.6.1-build/meson-private/tmpj937dgno/testfile.c: In function 'main': >/var/tmp/portage/sys-apps/fwupd-1.6.1/work/fwupd-1.6.1-build/meson-private/tmpj937dgno/testfile.c:6:17: error: 'F_OFD_SETLK' undeclared (first use in this function); did you mean 'F_SETLK'? > 6 | F_OFD_SETLK; > | ^~~~~~~~~~~ > | F_SETLK >/var/tmp/portage/sys-apps/fwupd-1.6.1/work/fwupd-1.6.1-build/meson-private/tmpj937dgno/testfile.c:6:17: note: each undeclared identifier is reported only once for each function it appears in > >Header <fcntl.h> has symbol "F_OFD_SETLK" : NO >Running compile: >Working directory: /var/tmp/portage/sys-apps/fwupd-1.6.1/work/fwupd-1.6.1-build/meson-private/tmp5yudkous >Command line: x86_64-pc-linux-gnu-gcc /var/tmp/portage/sys-apps/fwupd-1.6.1/work/fwupd-1.6.1-build/meson-private/tmp5yudkous/testfile.c -o /var/tmp/portage/sys-apps/fwupd-1.6.1/work/fwupd-1.6.1-build/meson-private/tmp5yudkous/output.exe -pipe -march=native -O2 -fomit-frame-pointer -D_FILE_OFFSET_BITS=64 -O0 -std=c99 -D_XOPEN_SOURCE -Wl,-O1 -Wl,--as-needed > >Code: > > #define pwrite meson_disable_define_of_pwrite > > #include <limits.h> > #undef pwrite > > #ifdef __cplusplus > extern "C" > #endif > char pwrite (void); > > #if defined __stub_pwrite || defined __stub___pwrite > fail fail fail this function is not going to work > #endif > > int main(void) { > return pwrite (); > } >Compiler stdout: > >Compiler stderr: > >Checking for function "pwrite" : YES >Pkg-config binary for MachineChoice.HOST is cached. >Determining dependency 'tss2-esys' with pkg-config executable '/usr/bin/x86_64-pc-linux-gnu-pkg-config' >PKG_CONFIG_PATH: /var/tmp/portage/sys-apps/fwupd-1.6.1/temp/pkgconfig:/var/tmp/portage/sys-apps/fwupd-1.6.1/temp/python3.9/pkgconfig:/usr/share/pkgconfig >PKG_CONFIG_LIBDIR: /usr/lib64/pkgconfig >Called `/usr/bin/x86_64-pc-linux-gnu-pkg-config --modversion tss2-esys` -> 0 >2.4.5 >PKG_CONFIG_PATH: /var/tmp/portage/sys-apps/fwupd-1.6.1/temp/pkgconfig:/var/tmp/portage/sys-apps/fwupd-1.6.1/temp/python3.9/pkgconfig:/usr/share/pkgconfig >PKG_CONFIG_LIBDIR: /usr/lib64/pkgconfig >Called `/usr/bin/x86_64-pc-linux-gnu-pkg-config --cflags tss2-esys` -> 0 > >PKG_CONFIG_PATH: /var/tmp/portage/sys-apps/fwupd-1.6.1/temp/pkgconfig:/var/tmp/portage/sys-apps/fwupd-1.6.1/temp/python3.9/pkgconfig:/usr/share/pkgconfig >PKG_CONFIG_LIBDIR: /usr/lib64/pkgconfig >Called `/usr/bin/x86_64-pc-linux-gnu-pkg-config --libs tss2-esys` -> 0 >-ltss2-esys -L/usr/lib64 >PKG_CONFIG_PATH: /var/tmp/portage/sys-apps/fwupd-1.6.1/temp/pkgconfig:/var/tmp/portage/sys-apps/fwupd-1.6.1/temp/python3.9/pkgconfig:/usr/share/pkgconfig >PKG_CONFIG_LIBDIR: /usr/lib64/pkgconfig >Called `/usr/bin/x86_64-pc-linux-gnu-pkg-config --libs tss2-esys` -> 0 >-ltss2-esys >Run-time dependency tss2-esys found: YES 2.4.5 >Pkg-config binary for MachineChoice.HOST is cached. >Determining dependency 'efiboot' with pkg-config executable '/usr/bin/x86_64-pc-linux-gnu-pkg-config' >PKG_CONFIG_PATH: /var/tmp/portage/sys-apps/fwupd-1.6.1/temp/pkgconfig:/var/tmp/portage/sys-apps/fwupd-1.6.1/temp/python3.9/pkgconfig:/usr/share/pkgconfig >PKG_CONFIG_LIBDIR: /usr/lib64/pkgconfig >Called `/usr/bin/x86_64-pc-linux-gnu-pkg-config --modversion efiboot` -> 0 >37 >PKG_CONFIG_PATH: /var/tmp/portage/sys-apps/fwupd-1.6.1/temp/pkgconfig:/var/tmp/portage/sys-apps/fwupd-1.6.1/temp/python3.9/pkgconfig:/usr/share/pkgconfig >PKG_CONFIG_LIBDIR: /usr/lib64/pkgconfig >Called `/usr/bin/x86_64-pc-linux-gnu-pkg-config --cflags efiboot` -> 0 >-I/usr/include/efivar >PKG_CONFIG_PATH: /var/tmp/portage/sys-apps/fwupd-1.6.1/temp/pkgconfig:/var/tmp/portage/sys-apps/fwupd-1.6.1/temp/python3.9/pkgconfig:/usr/share/pkgconfig >PKG_CONFIG_LIBDIR: /usr/lib64/pkgconfig >Called `/usr/bin/x86_64-pc-linux-gnu-pkg-config --libs efiboot` -> 0 >-L/usr/lib64 -lefiboot >PKG_CONFIG_PATH: /var/tmp/portage/sys-apps/fwupd-1.6.1/temp/pkgconfig:/var/tmp/portage/sys-apps/fwupd-1.6.1/temp/python3.9/pkgconfig:/usr/share/pkgconfig >PKG_CONFIG_LIBDIR: /usr/lib64/pkgconfig >Called `/usr/bin/x86_64-pc-linux-gnu-pkg-config --libs efiboot` -> 0 >-lefiboot >Run-time dependency efiboot found: YES 37 >Running command: /usr/bin/python3.8 po/test-deps >--- stdout --- >Error: missing dependency python gobject introspection (python3-gi) > >--- stderr --- >Traceback (most recent call last): > File "po/test-deps", line 17, in <module> > gi.require_version("Pango", "1.0") >NameError: name 'gi' is not defined > > > >meson.build:402:6: ERROR: Problem encountered: Error: missing dependency python gobject introspection (python3-gi) >
You cannot view the attachment while viewing its details because your browser does not support IFRAMEs.
View the attachment on a separate page
.
View Attachment As Raw
Actions:
View
Attachments on
bug 796143
: 716166 |
716181
|
716256