Go to:
Gentoo Home
Documentation
Forums
Lists
Bugs
Planet
Store
Wiki
Get Gentoo!
Gentoo's Bugzilla – Attachment 699216 Details for
Bug 782094
dev-haskell/quickcheck-2.13.2 - Test/.../Random.hs: error:
Home
|
New
–
[Ex]
|
Browse
|
Search
|
Privacy Policy
|
[?]
|
Reports
|
Requests
|
Help
|
New Account
|
Log In
[x]
|
Forgot Password
Login:
[x]
dev-haskell:quickcheck-2.13.2:20210411-092135.log
dev-haskell:quickcheck-2.13.2:20210411-092135.log (text/plain), 9.29 KB, created by
Toralf Förster
on 2021-04-11 12:12:22 UTC
(
hide
)
Description:
dev-haskell:quickcheck-2.13.2:20210411-092135.log
Filename:
MIME Type:
Creator:
Toralf Förster
Created:
2021-04-11 12:12:22 UTC
Size:
9.29 KB
patch
obsolete
> * Package: dev-haskell/quickcheck-2.13.2 > * Repository: gentoo > * Maintainer: haskell@gentoo.org > * USE: abi_x86_64 amd64 elibc_glibc kernel_linux template-haskell userland_GNU > * FEATURES: network-sandbox preserve-libs sandbox userpriv usersandbox > >>>> Unpacking source... >>>> Unpacking QuickCheck-2.13.2.tar.gz to /var/tmp/portage/dev-haskell/quickcheck-2.13.2/work >>>> Source unpacked in /var/tmp/portage/dev-haskell/quickcheck-2.13.2/work >>>> Preparing source in /var/tmp/portage/dev-haskell/quickcheck-2.13.2/work/QuickCheck-2.13.2 ... >>>> Source prepared. >>>> Configuring source in /var/tmp/portage/dev-haskell/quickcheck-2.13.2/work/QuickCheck-2.13.2 ... > * Using cabal-3.2.1.0. > * Prepending /usr/lib64/ghc-8.10.4 to LD_LIBRARY_PATH >/usr/bin/ghc -package Cabal-3.2.1.0 --make /var/tmp/portage/dev-haskell/quickcheck-2.13.2/work/QuickCheck-2.13.2/Setup.lhs -j1 +RTS -A256M -qb0 -RTS -threaded -dynamic -o setup >[1 of 1] Compiling Main ( /var/tmp/portage/dev-haskell/quickcheck-2.13.2/work/QuickCheck-2.13.2/Setup.lhs, /var/tmp/portage/dev-haskell/quickcheck-2.13.2/work/QuickCheck-2.13.2/Setup.o ) >Linking setup ... >./setup configure --ghc --prefix=/usr --with-compiler=/usr/bin/ghc --with-hc-pkg=/usr/bin/ghc-pkg --prefix=/usr --libdir=/usr/lib64 --libsubdir=quickcheck-2.13.2/ghc-8.10.4 --datadir=/usr/share/ --datasubdir=quickcheck-2.13.2/ghc-8.10.4 --disable-tests --ghc-options=-j1 +RTS -A256M -qb0 -RTS --with-ar=x86_64-pc-linux-gnu-ar --ghc-option=-optc-O2 --ghc-option=-optc-pipe --ghc-option=-optc-march=native --ghc-option=-optc-fno-diagnostics-color --ghc-option=-optl-Wl,-O1 --ghc-option=-optl-Wl,--as-needed --ghc-option=-optl-Wl,--defsym=__gentoo_check_ldflags__=0 --disable-executable-stripping --docdir=/usr/share/doc/quickcheck-2.13.2 --verbose --enable-shared --enable-executable-dynamic --sysconfdir=/etc --disable-library-stripping --flag=-base3 --flag=base4 --flags=templatehaskell >Using Parsec parser >Configuring QuickCheck-2.13.2... >Flags chosen: templatehaskell=True >Dependency base >=4.3 && <5: using base-4.14.1.0 >Dependency containers >=0.4.2.1: using containers-0.6.2.1 >Dependency deepseq >=1.1.0.0: using deepseq-1.4.4.0 >Dependency random >=1.0.1.0 && <1.2: using random-1.1 >Dependency splitmix >=0.0.2: using splitmix-0.0.4 >Dependency template-haskell >=2.4: using template-haskell-2.16.0.0 >Dependency transformers >=0.3: using transformers-0.5.6.2 >Source component graph: component lib >Configured component graph: > component QuickCheck-2.13.2-H2Yz1GKRVje4dvHwlZ63MD > include base-4.14.1.0 > include containers-0.6.2.1 > include deepseq-1.4.4.0 > include random-1.1-IcUwfYF3CGOHS82o6ktbLi > include splitmix-0.0.4-6fkkGtkFj85J3CrnPcld3S > include template-haskell-2.16.0.0 > include transformers-0.5.6.2 >Linked component graph: > unit QuickCheck-2.13.2-H2Yz1GKRVje4dvHwlZ63MD > include base-4.14.1.0 > include containers-0.6.2.1 > include deepseq-1.4.4.0 > include random-1.1-IcUwfYF3CGOHS82o6ktbLi > include splitmix-0.0.4-6fkkGtkFj85J3CrnPcld3S > include template-haskell-2.16.0.0 > include transformers-0.5.6.2 > Test.QuickCheck=QuickCheck-2.13.2-H2Yz1GKRVje4dvHwlZ63MD:Test.QuickCheck,Test.QuickCheck.All=QuickCheck-2.13.2-H2Yz1GKRVje4dvHwlZ63MD:Test.QuickCheck.All,Test.QuickCheck.Arbitrary=QuickCheck-2.13.2-H2Yz1GKRVje4dvHwlZ63MD:Test.QuickCheck.Arbitrary,Test.QuickCheck.Exception=QuickCheck-2.13.2-H2Yz1GKRVje4dvHwlZ63MD:Test.QuickCheck.Exception,Test.QuickCheck.Features=QuickCheck-2.13.2-H2Yz1GKRVje4dvHwlZ63MD:Test.QuickCheck.Features,Test.QuickCheck.Function=QuickCheck-2.13.2-H2Yz1GKRVje4dvHwlZ63MD:Test.QuickCheck.Function,Test.QuickCheck.Gen=QuickCheck-2.13.2-H2Yz1GKRVje4dvHwlZ63MD:Test.QuickCheck.Gen,Test.QuickCheck.Gen.Unsafe=QuickCheck-2.13.2-H2Yz1GKRVje4dvHwlZ63MD:Test.QuickCheck.Gen.Unsafe,Test.QuickCheck.Modifiers=QuickCheck-2.13.2-H2Yz1GKRVje4dvHwlZ63MD:Test.QuickCheck.Modifiers,Test.QuickCheck.Monadic=QuickCheck-2.13.2-H2Yz1GKRVje4dvHwlZ63MD:Test.QuickCheck.Monadic,Test.QuickCheck.Poly=QuickCheck-2.13.2-H2Yz1GKRVje4dvHwlZ63MD:Test.QuickCheck.Poly,Test.QuickCheck.Property=QuickCheck-2.13.2-H2Yz1GKRVje4dvHwlZ63MD:Test.QuickCheck.Property,Test.QuickCheck.Random=QuickCheck-2.13.2-H2Yz1GKRVje4dvHwlZ63MD:Test.QuickCheck.Random,Test.QuickCheck.State=QuickCheck-2.13.2-H2Yz1GKRVje4dvHwlZ63MD:Test.QuickCheck.State,Test.QuickCheck.Test=QuickCheck-2.13.2-H2Yz1GKRVje4dvHwlZ63MD:Test.QuickCheck.Test,Test.QuickCheck.Text=QuickCheck-2.13.2-H2Yz1GKRVje4dvHwlZ63MD:Test.QuickCheck.Text >Ready component graph: > definite QuickCheck-2.13.2-H2Yz1GKRVje4dvHwlZ63MD > depends base-4.14.1.0 > depends containers-0.6.2.1 > depends deepseq-1.4.4.0 > depends random-1.1-IcUwfYF3CGOHS82o6ktbLi > depends splitmix-0.0.4-6fkkGtkFj85J3CrnPcld3S > depends template-haskell-2.16.0.0 > depends transformers-0.5.6.2 >Using Cabal-3.2.1.0 compiled by ghc-8.10 >Using compiler: ghc-8.10.4 >Using install prefix: /usr >Executables installed in: /usr/bin >Libraries installed in: /usr/lib64/quickcheck-2.13.2/ghc-8.10.4 >Dynamic Libraries installed in: /usr/lib64/x86_64-linux-ghc-8.10.4 >Private executables installed in: >/usr/libexec/x86_64-linux-ghc-8.10.4/QuickCheck-2.13.2 >Data files installed in: /usr/share/quickcheck-2.13.2/ghc-8.10.4 >Documentation installed in: /usr/share/doc/quickcheck-2.13.2 >Configuration files installed in: /etc >Using alex version 3.2.5 found on system at: /usr/bin/alex >Using ar given by user at: /usr/bin/x86_64-pc-linux-gnu-ar >No c2hs found >No cpphs found >No doctest found >Using gcc version 10.3.0 found on system at: /usr/bin/x86_64-pc-linux-gnu-gcc >Using ghc version 8.10.4 given by user at: /usr/bin/ghc >Using ghc-pkg version 8.10.4 given by user at: /usr/bin/ghc-pkg >No ghcjs found >No ghcjs-pkg found >No greencard found >Using haddock version 2.24.0 found on system at: /usr/bin/haddock-ghc-8.10.4 >Using happy version 1.19.12 found on system at: /usr/bin/happy >Using haskell-suite found on system at: haskell-suite-dummy-location >Using haskell-suite-pkg found on system at: haskell-suite-pkg-dummy-location >No hmake found >Using hpc version 0.68 found on system at: /usr/bin/hpc >Using hsc2hs version 0.68.7 found on system at: /usr/bin/hsc2hs >No hscolour found >No jhc found >Using ld found on system at: /usr/bin/x86_64-pc-linux-gnu-ld >Using pkg-config version 0.29.2 found on system at: /usr/bin/pkg-config >Using runghc version 8.10.4 found on system at: /usr/bin/runghc >Using strip version 2.35 found on system at: /usr/bin/strip >Using tar found on system at: /bin/tar >No uhc found >>>> Source configured. >>>> Compiling source in /var/tmp/portage/dev-haskell/quickcheck-2.13.2/work/QuickCheck-2.13.2 ... >./setup build >Preprocessing library for QuickCheck-2.13.2.. >Building library for QuickCheck-2.13.2.. >[ 1 of 16] Compiling Test.QuickCheck.Exception ( Test/QuickCheck/Exception.hs, dist/build/Test/QuickCheck/Exception.o, dist/build/Test/QuickCheck/Exception.dyn_o ) >[ 2 of 16] Compiling Test.QuickCheck.Random ( Test/QuickCheck/Random.hs, dist/build/Test/QuickCheck/Random.o, dist/build/Test/QuickCheck/Random.dyn_o ) > >Test/QuickCheck/Random.hs:31:10: error: > ⢠No instance for (RandomGen SMGen) arising from a use of âsplitâ > ⢠In the expression: split g > In the expression: > case split g of { (g1, g2) -> (QCGen g1, QCGen g2) } > In an equation for âsplitâ: > split (QCGen g) > = case split g of { (g1, g2) -> (QCGen g1, QCGen g2) } > | >31 | case split g of > | ^^^^^^^ > >Test/QuickCheck/Random.hs:33:24: error: > ⢠No instance for (RandomGen SMGen) > arising from a use of âgenRangeâ > ⢠In the expression: genRange g > In an equation for âgenRangeâ: genRange (QCGen g) = genRange g > In the instance declaration for âRandomGen QCGenâ > | >33 | genRange (QCGen g) = genRange g > | ^^^^^^^^^^ > >Test/QuickCheck/Random.hs:35:10: error: > ⢠No instance for (RandomGen SMGen) arising from a use of ânextâ > ⢠In the expression: next g > In the expression: case next g of { (x, g') -> (x, QCGen g') } > In an equation for ânextâ: > next (QCGen g) = case next g of { (x, g') -> (x, QCGen g') } > | >35 | case next g of > | ^^^^^^ > * ERROR: dev-haskell/quickcheck-2.13.2::gentoo failed (compile phase): > * setup build failed > * > * Call stack: > * ebuild.sh, line 125: Called src_compile > * environment, line 1952: Called haskell-cabal_src_compile > * environment, line 1546: Called cabal_src_compile > * environment, line 707: Called cabal-build > * environment, line 483: Called die > * The specific snippet of code: > * ./setup "$@" || die "setup build failed" > * > * If you need support, post the output of `emerge --info '=dev-haskell/quickcheck-2.13.2::gentoo'`, > * the complete build log and the output of `emerge -pqv '=dev-haskell/quickcheck-2.13.2::gentoo'`. > * The complete build log is located at '/var/log/portage/dev-haskell:quickcheck-2.13.2:20210411-092135.log'. > * For convenience, a symlink to the build log is located at '/var/tmp/portage/dev-haskell/quickcheck-2.13.2/temp/build.log'. > * The ebuild environment file is located at '/var/tmp/portage/dev-haskell/quickcheck-2.13.2/temp/environment'. > * Working directory: '/var/tmp/portage/dev-haskell/quickcheck-2.13.2/work/QuickCheck-2.13.2' > * S: '/var/tmp/portage/dev-haskell/quickcheck-2.13.2/work/QuickCheck-2.13.2' >
You cannot view the attachment while viewing its details because your browser does not support IFRAMEs.
View the attachment on a separate page
.
View Attachment As Raw
Actions:
View
Attachments on
bug 782094
:
699213
| 699216 |
699219
|
699222
|
699225
|
699228
|
706275