Go to:
Gentoo Home
Documentation
Forums
Lists
Bugs
Planet
Store
Wiki
Get Gentoo!
Gentoo's Bugzilla – Attachment 661536 Details for
Bug 743697
dev-python/pyenchant-3.2.2-r1 fails tests
Home
|
New
–
[Ex]
|
Browse
|
Search
|
Privacy Policy
|
[?]
|
Reports
|
Requests
|
Help
|
New Account
|
Log In
[x]
|
Forgot Password
Login:
[x]
build.log
build.log (text/plain), 24.21 KB, created by
Agostino Sarubbo
on 2020-09-20 07:21:43 UTC
(
hide
)
Description:
build.log
Filename:
MIME Type:
Creator:
Agostino Sarubbo
Created:
2020-09-20 07:21:43 UTC
Size:
24.21 KB
patch
obsolete
> * Package: dev-python/pyenchant-3.1.0 > * Repository: gentoo > * Maintainer: python@gentoo.org > * USE: abi_x86_64 amd64 elibc_glibc kernel_linux python_targets_pypy3 python_targets_python3_6 python_targets_python3_7 python_targets_python3_8 python_targets_python3_9 test userland_GNU > * FEATURES: network-sandbox preserve-libs sandbox test userpriv usersandbox > > >@@@@@ PLEASE PAY ATTENTION HERE!!! @@@@@ >This information may help you to understand if this is a duplicate or if this bug exists after you pushed a fix; >This ebuild was merged at the following commit: >https://github.com/gentoo-mirror/gentoo/commit/bba3e0a76e00bf543245ed43a445c5340a4eb1e8 (Sat Sep 19 23:35:33 UTC 2020) >@@@@@ END @@@@@ > > > >emerge --info: >Portage 3.0.7 (python 3.8.5-final-0, default/linux/amd64/17.1, gcc-10.2.0, glibc-2.32-r1, 5.4.0-1021-aws x86_64) >================================================================= >System uname: Linux-5.4.0-1021-aws-x86_64-Intel-R-_Xeon-R-_Platinum_8175M_CPU_@_2.50GHz-with-glibc2.2.5 >KiB Mem: 64359960 total, 19215496 free >KiB Swap: 0 total, 0 free >Timestamp of repository gentoo: Sat, 19 Sep 2020 23:35:32 +0000 >sh bash 5.0_p18 >ld GNU ld (Gentoo 2.34 p6) 2.34.0 >app-shells/bash: 5.0_p18::gentoo >dev-lang/perl: 5.30.3-r1::gentoo >dev-lang/python: 2.7.18-r3::gentoo, 3.6.12::gentoo, 3.7.9::gentoo, 3.8.5::gentoo, 3.9.0_rc2::gentoo >dev-util/cmake: 3.18.2::gentoo >sys-apps/baselayout: 2.7::gentoo >sys-apps/openrc: 0.42.1::gentoo >sys-apps/sandbox: 2.20::gentoo >sys-devel/autoconf: 2.13-r1::gentoo, 2.69-r5::gentoo >sys-devel/automake: 1.16.2::gentoo >sys-devel/binutils: 2.34-r2::gentoo >sys-devel/gcc: 10.2.0-r1::gentoo >sys-devel/gcc-config: 2.3.2::gentoo >sys-devel/libtool: 2.4.6-r6::gentoo >sys-devel/make: 4.3::gentoo >sys-kernel/linux-headers: 5.8::gentoo (virtual/os-headers) >sys-libs/glibc: 2.32-r1::gentoo >Repositories: > >gentoo > location: /usr/portage > sync-type: rsync > sync-uri: rsync://rsync.gentoo.org/gentoo-portage > priority: -1000 > sync-rsync-extra-opts: > sync-rsync-verify-metamanifest: yes > sync-rsync-verify-max-age: 24 > sync-rsync-verify-jobs: 1 > >ACCEPT_KEYWORDS="amd64 ~amd64" >ACCEPT_LICENSE="* LGPL-2.1" >CBUILD="x86_64-pc-linux-gnu" >CC="x86_64-pc-linux-gnu-clang" >CFLAGS="-O2 -pipe -march=native -frecord-gcc-switches -fno-diagnostics-color" >CHOST="x86_64-pc-linux-gnu" >CONFIG_PROTECT="/etc /usr/share/gnupg/qualified.txt" >CONFIG_PROTECT_MASK="/etc/ca-certificates.conf /etc/env.d /etc/gconf /etc/gentoo-release /etc/revdep-rebuild /etc/sandbox.d /etc/terminfo" >CXX="x86_64-pc-linux-gnu-clang++" >CXXFLAGS="-O2 -pipe -march=native -frecord-gcc-switches -fno-diagnostics-color" >DISTDIR="/var/tmp/portage/dev-python/pyenchant-3.1.0/distdir" >EMERGE_DEFAULT_OPTS="--with-bdeps=y -1 -b -k" >ENV_UNSET="CARGO_HOME DBUS_SESSION_BUS_ADDRESS DISPLAY GOBIN GOPATH PERL5LIB PERL5OPT PERLPREFIX PERL_CORE PERL_MB_OPT PERL_MM_OPT XAUTHORITY XDG_CACHE_HOME XDG_CONFIG_HOME XDG_DATA_HOME XDG_RUNTIME_DIR" >FCFLAGS="-O2 -pipe -march=native -frecord-gcc-switches -fno-diagnostics-color" >FEATURES="assume-digests binpkg-docompress binpkg-dostrip binpkg-logs buildpkg config-protect-if-modified distlocks ebuild-locks fixlafiles ipc-sandbox merge-sync multilib-strict network-sandbox news parallel-fetch pid-sandbox preserve-libs protect-owned qa-unresolved-soname-deps sandbox sfperms sign split-log strict test unknown-features-warn unmerge-logs unmerge-orphans userfetch userpriv usersandbox usersync xattr" >FFLAGS="-O2 -pipe -march=native -frecord-gcc-switches -fno-diagnostics-color" >GENTOO_MIRRORS="http://distfiles.gentoo.org" >LANG="C.UTF-8" >LDFLAGS="-Wl,-O1 -Wl,--as-needed -Wl,--defsym=__gentoo_check_ldflags__=0 -fuse-ld=lld" >MAKEOPTS="-j16 V=1" >PKGDIR="/root/.packages" >PORTAGE_CONFIGROOT="/" >PORTAGE_RSYNC_OPTS="--recursive --links --safe-links --perms --times --omit-dir-times --compress --force --whole-file --delete --stats --human-readable --timeout=180 --exclude=/distfiles --exclude=/local --exclude=/packages --exclude=/.git" >PORTAGE_TMPDIR="/var/tmp" >USE="acl amd64 berkdb bzip2 cli crypt dri elogind fortran gdbm iconv ipv6 jumbo-build libglvnd libtirpc multilib native-symlinks ncurses nls nptl openmp pam pcre readline seccomp split-usr ssl tcpd test unicode xattr zlib" ABI_X86="64" ELIBC="glibc" KERNEL="linux" PYTHON_TARGETS="pypy3 python3_6 python3_7 python3_8 python3_9" USERLAND="GNU" >Unset: CPPFLAGS, CTARGET, INSTALL_MASK, LC_ALL, LINGUAS, PORTAGE_BINHOST, PORTAGE_BUNZIP2_COMMAND, PORTAGE_COMPRESS, PORTAGE_COMPRESS_FLAGS, PORTAGE_RSYNC_EXTRA_OPTS > > > >>>> Unpacking source... >>>> Unpacking pyenchant-3.1.0.gh.tar.gz to /var/tmp/portage/dev-python/pyenchant-3.1.0/work >>>> Source unpacked in /var/tmp/portage/dev-python/pyenchant-3.1.0/work >>>> Preparing source in /var/tmp/portage/dev-python/pyenchant-3.1.0/work/pyenchant-3.1.0 ... >>>> Source prepared. >>>> Configuring source in /var/tmp/portage/dev-python/pyenchant-3.1.0/work/pyenchant-3.1.0 ... >>>> Source configured. >>>> Compiling source in /var/tmp/portage/dev-python/pyenchant-3.1.0/work/pyenchant-3.1.0 ... > * pypy3: running distutils-r1_run_phase distutils-r1_python_compile >pypy3 setup.py build -j 16 >running build >running build_py >creating /var/tmp/portage/dev-python/pyenchant-3.1.0/work/pyenchant-3.1.0-pypy3/lib/enchant >copying enchant/__init__.py -> /var/tmp/portage/dev-python/pyenchant-3.1.0/work/pyenchant-3.1.0-pypy3/lib/enchant >copying enchant/pypwl.py -> /var/tmp/portage/dev-python/pyenchant-3.1.0/work/pyenchant-3.1.0-pypy3/lib/enchant >copying enchant/utils.py -> /var/tmp/portage/dev-python/pyenchant-3.1.0/work/pyenchant-3.1.0-pypy3/lib/enchant >copying enchant/errors.py -> /var/tmp/portage/dev-python/pyenchant-3.1.0/work/pyenchant-3.1.0-pypy3/lib/enchant >copying enchant/_enchant.py -> /var/tmp/portage/dev-python/pyenchant-3.1.0/work/pyenchant-3.1.0-pypy3/lib/enchant >creating /var/tmp/portage/dev-python/pyenchant-3.1.0/work/pyenchant-3.1.0-pypy3/lib/enchant/tokenize >copying enchant/tokenize/__init__.py -> /var/tmp/portage/dev-python/pyenchant-3.1.0/work/pyenchant-3.1.0-pypy3/lib/enchant/tokenize >copying enchant/tokenize/en.py -> /var/tmp/portage/dev-python/pyenchant-3.1.0/work/pyenchant-3.1.0-pypy3/lib/enchant/tokenize >creating /var/tmp/portage/dev-python/pyenchant-3.1.0/work/pyenchant-3.1.0-pypy3/lib/enchant/checker >copying enchant/checker/__init__.py -> /var/tmp/portage/dev-python/pyenchant-3.1.0/work/pyenchant-3.1.0-pypy3/lib/enchant/checker >copying enchant/checker/CmdLineChecker.py -> /var/tmp/portage/dev-python/pyenchant-3.1.0/work/pyenchant-3.1.0-pypy3/lib/enchant/checker >copying enchant/checker/wxSpellCheckerDialog.py -> /var/tmp/portage/dev-python/pyenchant-3.1.0/work/pyenchant-3.1.0-pypy3/lib/enchant/checker >copying enchant/checker/GtkSpellCheckerDialog.py -> /var/tmp/portage/dev-python/pyenchant-3.1.0/work/pyenchant-3.1.0-pypy3/lib/enchant/checker >running egg_info >creating pyenchant.egg-info >writing pyenchant.egg-info/PKG-INFO >writing dependency_links to pyenchant.egg-info/dependency_links.txt >writing top-level names to pyenchant.egg-info/top_level.txt >writing manifest file 'pyenchant.egg-info/SOURCES.txt' >reading manifest file 'pyenchant.egg-info/SOURCES.txt' >reading manifest template 'MANIFEST.in' >warning: no directories found matching 'enchant/data/' >writing manifest file 'pyenchant.egg-info/SOURCES.txt' >warning: build_py: byte-compiling is disabled, skipping. > > * python3_6: running distutils-r1_run_phase distutils-r1_python_compile >python3.6 setup.py build -j 16 >running build >running build_py >creating /var/tmp/portage/dev-python/pyenchant-3.1.0/work/pyenchant-3.1.0-python3_6/lib/enchant >copying enchant/__init__.py -> /var/tmp/portage/dev-python/pyenchant-3.1.0/work/pyenchant-3.1.0-python3_6/lib/enchant >copying enchant/pypwl.py -> /var/tmp/portage/dev-python/pyenchant-3.1.0/work/pyenchant-3.1.0-python3_6/lib/enchant >copying enchant/utils.py -> /var/tmp/portage/dev-python/pyenchant-3.1.0/work/pyenchant-3.1.0-python3_6/lib/enchant >copying enchant/errors.py -> /var/tmp/portage/dev-python/pyenchant-3.1.0/work/pyenchant-3.1.0-python3_6/lib/enchant >copying enchant/_enchant.py -> /var/tmp/portage/dev-python/pyenchant-3.1.0/work/pyenchant-3.1.0-python3_6/lib/enchant >creating /var/tmp/portage/dev-python/pyenchant-3.1.0/work/pyenchant-3.1.0-python3_6/lib/enchant/tokenize >copying enchant/tokenize/__init__.py -> /var/tmp/portage/dev-python/pyenchant-3.1.0/work/pyenchant-3.1.0-python3_6/lib/enchant/tokenize >copying enchant/tokenize/en.py -> /var/tmp/portage/dev-python/pyenchant-3.1.0/work/pyenchant-3.1.0-python3_6/lib/enchant/tokenize >creating /var/tmp/portage/dev-python/pyenchant-3.1.0/work/pyenchant-3.1.0-python3_6/lib/enchant/checker >copying enchant/checker/__init__.py -> /var/tmp/portage/dev-python/pyenchant-3.1.0/work/pyenchant-3.1.0-python3_6/lib/enchant/checker >copying enchant/checker/CmdLineChecker.py -> /var/tmp/portage/dev-python/pyenchant-3.1.0/work/pyenchant-3.1.0-python3_6/lib/enchant/checker >copying enchant/checker/wxSpellCheckerDialog.py -> /var/tmp/portage/dev-python/pyenchant-3.1.0/work/pyenchant-3.1.0-python3_6/lib/enchant/checker >copying enchant/checker/GtkSpellCheckerDialog.py -> /var/tmp/portage/dev-python/pyenchant-3.1.0/work/pyenchant-3.1.0-python3_6/lib/enchant/checker >running egg_info >writing pyenchant.egg-info/PKG-INFO >writing dependency_links to pyenchant.egg-info/dependency_links.txt >writing top-level names to pyenchant.egg-info/top_level.txt >reading manifest file 'pyenchant.egg-info/SOURCES.txt' >reading manifest template 'MANIFEST.in' >warning: no directories found matching 'enchant/data/' >writing manifest file 'pyenchant.egg-info/SOURCES.txt' >warning: build_py: byte-compiling is disabled, skipping. > > * python3_7: running distutils-r1_run_phase distutils-r1_python_compile >python3.7 setup.py build -j 16 >running build >running build_py >creating /var/tmp/portage/dev-python/pyenchant-3.1.0/work/pyenchant-3.1.0-python3_7/lib/enchant >copying enchant/__init__.py -> /var/tmp/portage/dev-python/pyenchant-3.1.0/work/pyenchant-3.1.0-python3_7/lib/enchant >copying enchant/pypwl.py -> /var/tmp/portage/dev-python/pyenchant-3.1.0/work/pyenchant-3.1.0-python3_7/lib/enchant >copying enchant/utils.py -> /var/tmp/portage/dev-python/pyenchant-3.1.0/work/pyenchant-3.1.0-python3_7/lib/enchant >copying enchant/errors.py -> /var/tmp/portage/dev-python/pyenchant-3.1.0/work/pyenchant-3.1.0-python3_7/lib/enchant >copying enchant/_enchant.py -> /var/tmp/portage/dev-python/pyenchant-3.1.0/work/pyenchant-3.1.0-python3_7/lib/enchant >creating /var/tmp/portage/dev-python/pyenchant-3.1.0/work/pyenchant-3.1.0-python3_7/lib/enchant/tokenize >copying enchant/tokenize/__init__.py -> /var/tmp/portage/dev-python/pyenchant-3.1.0/work/pyenchant-3.1.0-python3_7/lib/enchant/tokenize >copying enchant/tokenize/en.py -> /var/tmp/portage/dev-python/pyenchant-3.1.0/work/pyenchant-3.1.0-python3_7/lib/enchant/tokenize >creating /var/tmp/portage/dev-python/pyenchant-3.1.0/work/pyenchant-3.1.0-python3_7/lib/enchant/checker >copying enchant/checker/__init__.py -> /var/tmp/portage/dev-python/pyenchant-3.1.0/work/pyenchant-3.1.0-python3_7/lib/enchant/checker >copying enchant/checker/CmdLineChecker.py -> /var/tmp/portage/dev-python/pyenchant-3.1.0/work/pyenchant-3.1.0-python3_7/lib/enchant/checker >copying enchant/checker/wxSpellCheckerDialog.py -> /var/tmp/portage/dev-python/pyenchant-3.1.0/work/pyenchant-3.1.0-python3_7/lib/enchant/checker >copying enchant/checker/GtkSpellCheckerDialog.py -> /var/tmp/portage/dev-python/pyenchant-3.1.0/work/pyenchant-3.1.0-python3_7/lib/enchant/checker >running egg_info >writing pyenchant.egg-info/PKG-INFO >writing dependency_links to pyenchant.egg-info/dependency_links.txt >writing top-level names to pyenchant.egg-info/top_level.txt >reading manifest file 'pyenchant.egg-info/SOURCES.txt' >reading manifest template 'MANIFEST.in' >warning: no directories found matching 'enchant/data/' >writing manifest file 'pyenchant.egg-info/SOURCES.txt' >warning: build_py: byte-compiling is disabled, skipping. > > * python3_8: running distutils-r1_run_phase distutils-r1_python_compile >python3.8 setup.py build -j 16 >running build >running build_py >creating /var/tmp/portage/dev-python/pyenchant-3.1.0/work/pyenchant-3.1.0-python3_8/lib/enchant >copying enchant/__init__.py -> /var/tmp/portage/dev-python/pyenchant-3.1.0/work/pyenchant-3.1.0-python3_8/lib/enchant >copying enchant/pypwl.py -> /var/tmp/portage/dev-python/pyenchant-3.1.0/work/pyenchant-3.1.0-python3_8/lib/enchant >copying enchant/utils.py -> /var/tmp/portage/dev-python/pyenchant-3.1.0/work/pyenchant-3.1.0-python3_8/lib/enchant >copying enchant/errors.py -> /var/tmp/portage/dev-python/pyenchant-3.1.0/work/pyenchant-3.1.0-python3_8/lib/enchant >copying enchant/_enchant.py -> /var/tmp/portage/dev-python/pyenchant-3.1.0/work/pyenchant-3.1.0-python3_8/lib/enchant >creating /var/tmp/portage/dev-python/pyenchant-3.1.0/work/pyenchant-3.1.0-python3_8/lib/enchant/tokenize >copying enchant/tokenize/__init__.py -> /var/tmp/portage/dev-python/pyenchant-3.1.0/work/pyenchant-3.1.0-python3_8/lib/enchant/tokenize >copying enchant/tokenize/en.py -> /var/tmp/portage/dev-python/pyenchant-3.1.0/work/pyenchant-3.1.0-python3_8/lib/enchant/tokenize >creating /var/tmp/portage/dev-python/pyenchant-3.1.0/work/pyenchant-3.1.0-python3_8/lib/enchant/checker >copying enchant/checker/__init__.py -> /var/tmp/portage/dev-python/pyenchant-3.1.0/work/pyenchant-3.1.0-python3_8/lib/enchant/checker >copying enchant/checker/CmdLineChecker.py -> /var/tmp/portage/dev-python/pyenchant-3.1.0/work/pyenchant-3.1.0-python3_8/lib/enchant/checker >copying enchant/checker/wxSpellCheckerDialog.py -> /var/tmp/portage/dev-python/pyenchant-3.1.0/work/pyenchant-3.1.0-python3_8/lib/enchant/checker >copying enchant/checker/GtkSpellCheckerDialog.py -> /var/tmp/portage/dev-python/pyenchant-3.1.0/work/pyenchant-3.1.0-python3_8/lib/enchant/checker >running egg_info >writing pyenchant.egg-info/PKG-INFO >writing dependency_links to pyenchant.egg-info/dependency_links.txt >writing top-level names to pyenchant.egg-info/top_level.txt >reading manifest file 'pyenchant.egg-info/SOURCES.txt' >reading manifest template 'MANIFEST.in' >warning: no directories found matching 'enchant/data/' >writing manifest file 'pyenchant.egg-info/SOURCES.txt' >warning: build_py: byte-compiling is disabled, skipping. > > * python3_9: running distutils-r1_run_phase distutils-r1_python_compile >python3.9 setup.py build -j 16 >running build >running build_py >creating /var/tmp/portage/dev-python/pyenchant-3.1.0/work/pyenchant-3.1.0-python3_9/lib/enchant >copying enchant/__init__.py -> /var/tmp/portage/dev-python/pyenchant-3.1.0/work/pyenchant-3.1.0-python3_9/lib/enchant >copying enchant/pypwl.py -> /var/tmp/portage/dev-python/pyenchant-3.1.0/work/pyenchant-3.1.0-python3_9/lib/enchant >copying enchant/utils.py -> /var/tmp/portage/dev-python/pyenchant-3.1.0/work/pyenchant-3.1.0-python3_9/lib/enchant >copying enchant/errors.py -> /var/tmp/portage/dev-python/pyenchant-3.1.0/work/pyenchant-3.1.0-python3_9/lib/enchant >copying enchant/_enchant.py -> /var/tmp/portage/dev-python/pyenchant-3.1.0/work/pyenchant-3.1.0-python3_9/lib/enchant >creating /var/tmp/portage/dev-python/pyenchant-3.1.0/work/pyenchant-3.1.0-python3_9/lib/enchant/tokenize >copying enchant/tokenize/__init__.py -> /var/tmp/portage/dev-python/pyenchant-3.1.0/work/pyenchant-3.1.0-python3_9/lib/enchant/tokenize >copying enchant/tokenize/en.py -> /var/tmp/portage/dev-python/pyenchant-3.1.0/work/pyenchant-3.1.0-python3_9/lib/enchant/tokenize >creating /var/tmp/portage/dev-python/pyenchant-3.1.0/work/pyenchant-3.1.0-python3_9/lib/enchant/checker >copying enchant/checker/__init__.py -> /var/tmp/portage/dev-python/pyenchant-3.1.0/work/pyenchant-3.1.0-python3_9/lib/enchant/checker >copying enchant/checker/CmdLineChecker.py -> /var/tmp/portage/dev-python/pyenchant-3.1.0/work/pyenchant-3.1.0-python3_9/lib/enchant/checker >copying enchant/checker/wxSpellCheckerDialog.py -> /var/tmp/portage/dev-python/pyenchant-3.1.0/work/pyenchant-3.1.0-python3_9/lib/enchant/checker >copying enchant/checker/GtkSpellCheckerDialog.py -> /var/tmp/portage/dev-python/pyenchant-3.1.0/work/pyenchant-3.1.0-python3_9/lib/enchant/checker >running egg_info >writing pyenchant.egg-info/PKG-INFO >writing dependency_links to pyenchant.egg-info/dependency_links.txt >writing top-level names to pyenchant.egg-info/top_level.txt >reading manifest file 'pyenchant.egg-info/SOURCES.txt' >reading manifest template 'MANIFEST.in' >warning: no directories found matching 'enchant/data/' >writing manifest file 'pyenchant.egg-info/SOURCES.txt' >warning: build_py: byte-compiling is disabled, skipping. > >>>> Source compiled. >>>> Test phase: dev-python/pyenchant-3.1.0 > * pypy3: running distutils-r1_run_phase python_test >============================= test session starts ============================== >platform linux -- Python 3.6.9[pypy-7.3.1-final], pytest-6.0.2, py-1.9.0, pluggy-0.13.1 -- /usr/bin/pypy3 >cachedir: .pytest_cache >rootdir: /var/tmp/portage/dev-python/pyenchant-3.1.0/work/pyenchant-3.1.0 >collecting ... collected 53 items > >tests/test_broker.py::test_all_langs_are_available FAILED [ 1%] >tests/test_broker.py::test_provs_are_available FAILED [ 3%] >tests/test_broker.py::test_prov_ordering PASSED [ 5%] >tests/test_broker.py::test_unicode_tag PASSED [ 7%] >tests/test_broker.py::test_get_set_param PASSED [ 9%] >tests/test_checker.py::test_basic PASSED [ 11%] >tests/test_checker.py::test_filters PASSED [ 13%] >tests/test_checker.py::test_chunkers PASSED [ 15%] >tests/test_checker.py::test_chunkers_and_filters PASSED [ 16%] >tests/test_checker.py::test_unicode PASSED [ 18%] >tests/test_checker.py::test_chararray PASSED [ 20%] >tests/test_checker.py::test_pwl PASSED [ 22%] >tests/test_checker.py::test_bug2785373 PASSED [ 24%] >tests/test_checker.py::test_default_language PASSED [ 26%] >tests/test_checker.py::test_replace_with_shorter_string PASSED [ 28%] >tests/test_checker.py::test_replace_with_empty_string PASSED [ 30%] >tests/test_dict.py::test_has_en_us PASSED [ 32%] >tests/test_dict.py::test_check PASSED [ 33%] >tests/test_dict.py::test_broker PASSED [ 35%] >tests/test_dict.py::test_tag PASSED [ 37%] >tests/test_dict.py::test_suggest PASSED [ 39%] >tests/test_dict.py::test_suggest_hang_1 PASSED [ 41%] >tests/test_dict.py::test_unicode1 PASSED [ 43%] >tests/test_dict.py::test_session PASSED [ 45%] >tests/test_dict.py::test_add_remove PASSED [ 47%] >tests/test_dict.py::test_default_lang PASSED [ 49%] >tests/test_dict.py::test_pickling PASSED [ 50%] >tests/test_misc.py::test_get_version PASSED [ 52%] >tests/test_misc.py::test_get_user_config_dir PASSED [ 54%] >tests/test_multiprocessing.py::test_can_use_multiprocessing PASSED [ 56%] >tests/test_pwl.py::test_check PASSED [ 58%] >tests/test_pwl.py::test_unicodefn PASSED [ 60%] >tests/test_pwl.py::test_add PASSED [ 62%] >tests/test_pwl.py::test_suggestions PASSED [ 64%] >tests/test_pwl.py::test_dwpwl PASSED [ 66%] >tests/test_pwl.py::test_dwpwl_empty PASSED [ 67%] >tests/test_pwl.py::test_pypwl PASSED [ 69%] >tests/test_pwl.py::test_unicode_chars_in_path PASSED [ 71%] >tests/test_tokenize.py::test_basic_tokenize PASSED [ 73%] >tests/test_tokenize.py::test_tokenize_strip PASSED [ 75%] >tests/test_tokenize.py::test_wrap_tokenizer PASSED [ 77%] >tests/test_tokenize.py::test_url_filter PASSED [ 79%] >tests/test_tokenize.py::test_wiki_word_filter PASSED [ 81%] >tests/test_tokenize.py::test_email_filter PASSED [ 83%] >tests/test_tokenize.py::test_combined_filter PASSED [ 84%] >tests/test_tokenize.py::test_html_chunker PASSED [ 86%] >tests/test_tokenize.py::test_tokenize_en PASSED [ 88%] >tests/test_tokenize.py::test_unicode_basic PASSED [ 90%] >tests/test_tokenize.py::test_bug1591450 PASSED [ 92%] >tests/test_tokenize.py::test_bug2785373 PASSED [ 94%] >tests/test_tokenize.py::test_finnish_text PASSED [ 96%] >tests/test_tokenize.py::test_typographic_apostrophe PASSED [ 98%] >tests/test_utils.py::test_trim_suggestions PASSED [100%] > >=================================== FAILURES =================================== >_________________________ test_all_langs_are_available _________________________ > >broker = <enchant.Broker object at 0x00007fc5bdabf280> > > def test_all_langs_are_available(broker): > """Test whether all advertised languages are in fact available.""" > for lang in broker.list_languages(): > if not broker.dict_exists(lang): >> assert False, "language '" + lang + "' advertised but non-existent" >E AssertionError: language 'kk_test' advertised but non-existent >E assert False > >tests/test_broker.py:17: AssertionError >___________________________ test_provs_are_available ___________________________ > >broker = <enchant.Broker object at 0x00007fc5bd8923a0> > > def test_provs_are_available(broker): > """Test whether all advertised providers are in fact available.""" > for (lang, prov) in broker.list_dicts(): >> assert broker.dict_exists(lang) >E AssertionError: assert False >E + where False = <bound method Broker.dict_exists of <enchant.Broker object at 0x00007fc5bd8923a0>>('kk_test') >E + where <bound method Broker.dict_exists of <enchant.Broker object at 0x00007fc5bd8923a0>> = <enchant.Broker object at 0x00007fc5bd8923a0>.dict_exists > >tests/test_broker.py:23: AssertionError >=========================== short test summary info ============================ >FAILED tests/test_broker.py::test_all_langs_are_available - AssertionError: l... >FAILED tests/test_broker.py::test_provs_are_available - AssertionError: asser... >======================== 2 failed, 51 passed in 15.38s ========================= > * ERROR: dev-python/pyenchant-3.1.0::gentoo failed (test phase): > * Tests fail with pypy3 > * > * Call stack: > * ebuild.sh, line 125: Called src_test > * environment, line 3039: Called distutils-r1_src_test > * environment, line 1308: Called _distutils-r1_run_foreach_impl 'python_test' > * environment, line 488: Called python_foreach_impl 'distutils-r1_run_phase' 'python_test' > * environment, line 2647: Called multibuild_foreach_variant '_python_multibuild_wrapper' 'distutils-r1_run_phase' 'python_test' > * environment, line 2091: Called _multibuild_run '_python_multibuild_wrapper' 'distutils-r1_run_phase' 'python_test' > * environment, line 2089: Called _python_multibuild_wrapper 'distutils-r1_run_phase' 'python_test' > * environment, line 881: Called distutils-r1_run_phase 'python_test' > * environment, line 1245: Called python_test > * environment, line 2998: Called die > * The specific snippet of code: > * pytest -vv || die "Tests fail with ${EPYTHON}" > * > * If you need support, post the output of `emerge --info '=dev-python/pyenchant-3.1.0::gentoo'`, > * the complete build log and the output of `emerge -pqv '=dev-python/pyenchant-3.1.0::gentoo'`. > * The complete build log is located at '/var/log/emerge-log/build/dev-python/pyenchant-3.1.0:20200920-000937.log'. > * For convenience, a symlink to the build log is located at '/var/tmp/portage/dev-python/pyenchant-3.1.0/temp/build.log'. > * The ebuild environment file is located at '/var/tmp/portage/dev-python/pyenchant-3.1.0/temp/environment'. > * Working directory: '/var/tmp/portage/dev-python/pyenchant-3.1.0/work/pyenchant-3.1.0' > * S: '/var/tmp/portage/dev-python/pyenchant-3.1.0/work/pyenchant-3.1.0'
You cannot view the attachment while viewing its details because your browser does not support IFRAMEs.
View the attachment on a separate page
.
View Attachment As Raw
Actions:
View
Attachments on
bug 743697
: 661536