Go to:
Gentoo Home
Documentation
Forums
Lists
Bugs
Planet
Store
Wiki
Get Gentoo!
Gentoo's Bugzilla – Attachment 654582 Details for
Bug 737092
dev-lang/tcc-0.9.27 fails to compile (make[1]: *** [Makefile:137: dlltest] Segmentation fault (core dumped))
Home
|
New
–
[Ex]
|
Browse
|
Search
|
Privacy Policy
|
[?]
|
Reports
|
Requests
|
Help
|
New Account
|
Log In
[x]
|
Forgot Password
Login:
[x]
build.log
build.log (text/plain), 20.30 KB, created by
Agostino Sarubbo
on 2020-08-14 08:43:14 UTC
(
hide
)
Description:
build.log
Filename:
MIME Type:
Creator:
Agostino Sarubbo
Created:
2020-08-14 08:43:14 UTC
Size:
20.30 KB
patch
obsolete
> * Package: dev-lang/tcc-0.9.27 > * Repository: gentoo > * Maintainer: dlan@gentoo.org > * USE: abi_x86_64 amd64 elibc_glibc kernel_linux test userland_GNU > * FEATURES: network-sandbox preserve-libs sandbox test userpriv usersandbox > > >@@@@@ PLEASE PAY ATTENTION HERE!!! @@@@@ >This information may help you to understand if this is a duplicate or if this bug exists after you pushed a fix; >This ebuild was merged at the following commit: >https://github.com/gentoo-mirror/gentoo/commit/08c5ed02fe10ee57ed97285586c63b62efa41eac (Fri Aug 14 07:35:45 UTC 2020) >@@@@@ END @@@@@ > > > >emerge --info: >Portage 3.0.2 (python 3.7.8-final-0, default/linux/amd64/17.1, gcc-10.2.0, glibc-2.31-r6, 5.4.0-1021-aws x86_64) >================================================================= >System uname: Linux-5.4.0-1021-aws-x86_64-Intel-R-_Xeon-R-_Platinum_8175M_CPU_@_2.50GHz-with-gentoo-2.7 >KiB Mem: 64359960 total, 53565028 free >KiB Swap: 0 total, 0 free >Timestamp of repository gentoo: Fri, 14 Aug 2020 07:35:44 +0000 >sh bash 5.0_p18 >ld GNU ld (Gentoo 2.34 p6) 2.34.0 >app-shells/bash: 5.0_p18::gentoo >dev-lang/perl: 5.30.3-r1::gentoo >dev-lang/python: 2.7.18-r1::gentoo, 3.7.8-r2::gentoo, 3.8.5::gentoo, 3.9.0_rc1::gentoo >dev-util/cmake: 3.18.1::gentoo >sys-apps/baselayout: 2.7::gentoo >sys-apps/openrc: 0.42.1::gentoo >sys-apps/sandbox: 2.20::gentoo >sys-devel/autoconf: 2.69-r5::gentoo >sys-devel/automake: 1.16.2::gentoo >sys-devel/binutils: 2.34-r2::gentoo >sys-devel/gcc: 10.2.0::gentoo >sys-devel/gcc-config: 2.3.1::gentoo >sys-devel/libtool: 2.4.6-r6::gentoo >sys-devel/make: 4.3::gentoo >sys-kernel/linux-headers: 5.8::gentoo (virtual/os-headers) >sys-libs/glibc: 2.31-r6::gentoo >Repositories: > >gentoo > location: /usr/portage > sync-type: rsync > sync-uri: rsync://rsync.gentoo.org/gentoo-portage > priority: -1000 > sync-rsync-extra-opts: > sync-rsync-verify-max-age: 24 > sync-rsync-verify-jobs: 1 > sync-rsync-verify-metamanifest: yes > >ACCEPT_KEYWORDS="amd64 ~amd64" >ACCEPT_LICENSE="* LGPL-2.1" >CBUILD="x86_64-pc-linux-gnu" >CC="x86_64-pc-linux-gnu-clang" >CFLAGS="-O2 -pipe -march=native -frecord-gcc-switches -fno-diagnostics-color" >CHOST="x86_64-pc-linux-gnu" >CONFIG_PROTECT="/etc /usr/share/gnupg/qualified.txt" >CONFIG_PROTECT_MASK="/etc/ca-certificates.conf /etc/env.d /etc/gconf /etc/gentoo-release /etc/revdep-rebuild /etc/sandbox.d /etc/terminfo" >CXX="x86_64-pc-linux-gnu-clang++" >CXXFLAGS="-O2 -pipe -march=native -frecord-gcc-switches -fno-diagnostics-color" >DISTDIR="/var/tmp/portage/dev-lang/tcc-0.9.27/distdir" >EMERGE_DEFAULT_OPTS="--with-bdeps=y -1 -b -k" >ENV_UNSET="DBUS_SESSION_BUS_ADDRESS DISPLAY GOBIN GOPATH PERL5LIB PERL5OPT PERLPREFIX PERL_CORE PERL_MB_OPT PERL_MM_OPT XAUTHORITY XDG_CACHE_HOME XDG_CONFIG_HOME XDG_DATA_HOME XDG_RUNTIME_DIR" >FCFLAGS="-O2 -pipe -march=native -frecord-gcc-switches -fno-diagnostics-color" >FEATURES="assume-digests binpkg-docompress binpkg-dostrip binpkg-logs buildpkg collision-protect config-protect-if-modified distlocks ebuild-locks fixlafiles ipc-sandbox merge-sync multilib-strict network-sandbox news parallel-fetch pid-sandbox preserve-libs protect-owned qa-unresolved-soname-deps sandbox sfperms sign split-log strict test unknown-features-warn unmerge-logs unmerge-orphans userfetch userpriv usersandbox usersync xattr" >FFLAGS="-O2 -pipe -march=native -frecord-gcc-switches -fno-diagnostics-color" >GENTOO_MIRRORS="http://distfiles.gentoo.org" >LANG="C.UTF-8" >LDFLAGS="-Wl,-O1 -Wl,--as-needed -Wl,--defsym=__gentoo_check_ldflags__=0 -fuse-ld=lld -Wl,--defsym=__gentoo_check_ldflags__=0" >MAKEOPTS="-j16 V=1" >PKGDIR="/root/.packages" >PORTAGE_CONFIGROOT="/" >PORTAGE_RSYNC_OPTS="--recursive --links --safe-links --perms --times --omit-dir-times --compress --force --whole-file --delete --stats --human-readable --timeout=180 --exclude=/distfiles --exclude=/local --exclude=/packages --exclude=/.git" >PORTAGE_TMPDIR="/var/tmp" >USE="acl amd64 berkdb bzip2 cli crypt dri fortran gdbm iconv ipv6 libglvnd libtirpc multilib native-symlinks ncurses nls nptl openmp pam pcre readline seccomp split-usr ssl tcpd test unicode xattr zlib" ABI_X86="64" ELIBC="glibc" KERNEL="linux" USERLAND="GNU" >Unset: CPPFLAGS, CTARGET, INSTALL_MASK, LC_ALL, LINGUAS, PORTAGE_BINHOST, PORTAGE_BUNZIP2_COMMAND, PORTAGE_COMPRESS, PORTAGE_COMPRESS_FLAGS, PORTAGE_RSYNC_EXTRA_OPTS > > > >>>> Unpacking source... >>>> Unpacking tcc-0.9.27.tar.bz2 to /var/tmp/portage/dev-lang/tcc-0.9.27/work >>>> Source unpacked in /var/tmp/portage/dev-lang/tcc-0.9.27/work >>>> Preparing source in /var/tmp/portage/dev-lang/tcc-0.9.27/work/tcc-0.9.27 ... >>>> Source prepared. >>>> Configuring source in /var/tmp/portage/dev-lang/tcc-0.9.27/work/tcc-0.9.27 ... >Binary directory /usr/bin >TinyCC directory /usr/lib64/tcc >Library directory /usr/lib64 >Include directory /usr/include >Manual directory /usr/share/man >Info directory /usr/share/info >Doc directory /usr/share/doc/tcc-0.9.27 >Source path /var/tmp/portage/dev-lang/tcc-0.9.27/work/tcc-0.9.27 >C compiler x86_64-pc-linux-gnu-clang (4.2) >Target OS Linux >CPU x86_64 >Creating config.mak and config.h >>>> Source configured. >>>> Compiling source in /var/tmp/portage/dev-lang/tcc-0.9.27/work/tcc-0.9.27 ... >make -j16 V=1 AR=llvm-ar >x86_64-pc-linux-gnu-clang -o tcc.o -c tcc.c -DCONFIG_LDDIR="\"lib64\"" -DTCC_TARGET_X86_64 -DONE_SOURCE=0 -Wall -g -O2 -Wdeclaration-after-statement -fno-strict-aliasing -fheinous-gnu-extensions -Wno-pointer-sign -Wno-sign-compare -Wno-unused-result -Wno-string-plus-int -I. >x86_64-pc-linux-gnu-clang -o libtcc.o -c libtcc.c -DCONFIG_LDDIR="\"lib64\"" -DTCC_TARGET_X86_64 -DONE_SOURCE=0 -Wall -g -O2 -Wdeclaration-after-statement -fno-strict-aliasing -fheinous-gnu-extensions -Wno-pointer-sign -Wno-sign-compare -Wno-unused-result -Wno-string-plus-int -I. >x86_64-pc-linux-gnu-clang -o tccpp.o -c tccpp.c -DCONFIG_LDDIR="\"lib64\"" -DTCC_TARGET_X86_64 -DONE_SOURCE=0 -Wall -g -O2 -Wdeclaration-after-statement -fno-strict-aliasing -fheinous-gnu-extensions -Wno-pointer-sign -Wno-sign-compare -Wno-unused-result -Wno-string-plus-int -I. >x86_64-pc-linux-gnu-clang -o tccgen.o -c tccgen.c -DCONFIG_LDDIR="\"lib64\"" -DTCC_TARGET_X86_64 -DONE_SOURCE=0 -Wall -g -O2 -Wdeclaration-after-statement -fno-strict-aliasing -fheinous-gnu-extensions -Wno-pointer-sign -Wno-sign-compare -Wno-unused-result -Wno-string-plus-int -I. >x86_64-pc-linux-gnu-clang -o tccelf.o -c tccelf.c -DCONFIG_LDDIR="\"lib64\"" -DTCC_TARGET_X86_64 -DONE_SOURCE=0 -Wall -g -O2 -Wdeclaration-after-statement -fno-strict-aliasing -fheinous-gnu-extensions -Wno-pointer-sign -Wno-sign-compare -Wno-unused-result -Wno-string-plus-int -I. >x86_64-pc-linux-gnu-clang -o tccasm.o -c tccasm.c -DCONFIG_LDDIR="\"lib64\"" -DTCC_TARGET_X86_64 -DONE_SOURCE=0 -Wall -g -O2 -Wdeclaration-after-statement -fno-strict-aliasing -fheinous-gnu-extensions -Wno-pointer-sign -Wno-sign-compare -Wno-unused-result -Wno-string-plus-int -I. >x86_64-pc-linux-gnu-clang -o tccrun.o -c tccrun.c -DCONFIG_LDDIR="\"lib64\"" -DTCC_TARGET_X86_64 -DONE_SOURCE=0 -Wall -g -O2 -Wdeclaration-after-statement -fno-strict-aliasing -fheinous-gnu-extensions -Wno-pointer-sign -Wno-sign-compare -Wno-unused-result -Wno-string-plus-int -I. >x86_64-pc-linux-gnu-clang -o x86_64-gen.o -c x86_64-gen.c -DCONFIG_LDDIR="\"lib64\"" -DTCC_TARGET_X86_64 -DONE_SOURCE=0 -Wall -g -O2 -Wdeclaration-after-statement -fno-strict-aliasing -fheinous-gnu-extensions -Wno-pointer-sign -Wno-sign-compare -Wno-unused-result -Wno-string-plus-int -I. >x86_64-pc-linux-gnu-clang -o x86_64-link.o -c x86_64-link.c -DCONFIG_LDDIR="\"lib64\"" -DTCC_TARGET_X86_64 -DONE_SOURCE=0 -Wall -g -O2 -Wdeclaration-after-statement -fno-strict-aliasing -fheinous-gnu-extensions -Wno-pointer-sign -Wno-sign-compare -Wno-unused-result -Wno-string-plus-int -I. >x86_64-pc-linux-gnu-clang -o i386-asm.o -c i386-asm.c -DCONFIG_LDDIR="\"lib64\"" -DTCC_TARGET_X86_64 -DONE_SOURCE=0 -Wall -g -O2 -Wdeclaration-after-statement -fno-strict-aliasing -fheinous-gnu-extensions -Wno-pointer-sign -Wno-sign-compare -Wno-unused-result -Wno-string-plus-int -I. >./texi2pod.pl tcc-doc.texi tcc.pod \ >&& pod2man --section=1 --center="Tiny C Compiler" --release="0.9.27" tcc.pod >tmp.1 \ >&& mv tmp.1 tcc.1 || rm -f tmp.1 >makeinfo tcc-doc.texi || true >llvm-ar rcs libtcc.a libtcc.o tccpp.o tccgen.o tccelf.o tccasm.o tccrun.o x86_64-gen.o x86_64-link.o i386-asm.o >x86_64-pc-linux-gnu-clang -o tcc tcc.o libtcc.a -lm -ldl >make[1]: Entering directory '/var/tmp/portage/dev-lang/tcc-0.9.27/work/tcc-0.9.27/lib' >../tcc -c libtcc1.c -o libtcc1.o -B.. >../tcc -c alloca86_64.S -o alloca86_64.o -B.. >../tcc -c alloca86_64-bt.S -o alloca86_64-bt.o -B.. >../tcc -c va_list.c -o va_list.o -B.. >../tcc -c bcheck.c -o bcheck.o -B.. >../tcc -ar rcs ../libtcc1.a libtcc1.o alloca86_64.o alloca86_64-bt.o va_list.o bcheck.o >make[1]: Leaving directory '/var/tmp/portage/dev-lang/tcc-0.9.27/work/tcc-0.9.27/lib' >>>> Source compiled. >>>> Test phase: dev-lang/tcc-0.9.27 >make -j16 V=1 test >make -C tests >make[1]: Entering directory '/var/tmp/portage/dev-lang/tcc-0.9.27/work/tcc-0.9.27/tests' >x86_64-pc-linux-gnu-clang -o libtcc_test libtcc_test.c ../libtcc.a -fno-strict-aliasing -fheinous-gnu-extensions -I.. -I.. -lm -ldl >------------ hello-exe ------------ >x86_64-pc-linux-gnu-clang -o tcctest.gcc tcctest.c -DCONFIG_LDDIR="\"lib64\"" -DTCC_TARGET_X86_64 -fno-strict-aliasing -fheinous-gnu-extensions -I.. -I.. -w -O0 -std=gnu99 -fno-omit-frame-pointer >../tcc -B.. -I../include -I.. -I.. ../examples/ex1.c -o hello && ./hello || (set -x; ../tcc -vv; ldd ../tcc; exit 1) >------------ hello-run ------------ >../tcc -B.. -I../include -I.. -I.. -run ../examples/ex1.c || (set -x; ../tcc -vv; ldd ../tcc; exit 1) >x86_64-pc-linux-gnu-clang -o abitest-cc abitest.c ../libtcc.a -fno-strict-aliasing -fheinous-gnu-extensions -I.. -I.. -lm -ldl -w >------------ memtest ------------ >x86_64-pc-linux-gnu-clang -fno-strict-aliasing -fheinous-gnu-extensions -I.. -I.. -DCONFIG_LDDIR="\"lib64\"" -DTCC_TARGET_X86_64 -DMEM_DEBUG=2 ../tcc.c -lm -ldl -o memtest-tcc >------------ dlltest ------------ >../tcc -B.. -I../include -I.. -I.. -o abitest-tcc abitest.c ../libtcc.c -DCONFIG_LDDIR="\"lib64\"" -DTCC_TARGET_X86_64 -lm -ldl >../tcc -B.. -I../include -I.. -I.. -DCONFIG_LDDIR="\"lib64\"" -DTCC_TARGET_X86_64 -DLIBTCC_AS_DLL ../libtcc.c -lm -ldl -shared -o libtcc2.so >../tcc -B.. -I../include -I.. -I.. -o asm-c-connect asm-c-connect-1.c asm-c-connect-2.c >../tcc -B.. -I../include -I.. -I.. -c -o asm-c-connect-1.o asm-c-connect-1.c >../tcc -B.. -I../include -I.. -I.. -c -o asm-c-connect-2.o asm-c-connect-2.c >../tcc -B.. -I../include -I.. -I.. -o vla_test vla_test.c >Hello World >------------ tests2-dir ------------ >../tcc -B.. -I../include -I.. -I.. -o asm-c-connect-sep asm-c-connect-1.o asm-c-connect-2.o >make -k -C tests2 >------------ pp-dir ------------ >make -k -C pp >Hello World >make[2]: Entering directory '/var/tmp/portage/dev-lang/tcc-0.9.27/work/tcc-0.9.27/tests/tests2' >make[2]: Entering directory '/var/tmp/portage/dev-lang/tcc-0.9.27/work/tcc-0.9.27/tests/pp' >------------ asm-c-connect-test ------------ >------------ vla_test-run ------------ >./asm-c-connect > asm-c-connect.out1 && cat asm-c-connect.out1 >PPTest 01 ... >./vla_test >make[1]: ./vla_test: No such file or directory >make[1]: *** [Makefile:232: vla_test-run] Error 127 >make[1]: *** Waiting for unfinished jobs.... >Test: 00_assignment... >PPTest 02 ... >PPTest 03 ... >Test: 01_comment... >Test: 02_printf... >PPTest 04 ... >/bin/sh: ./asm-c-connect: No such file or directory >make[1]: *** [Makefile:245: asm-c-connect-test] Error 127 >Test: 03_struct... >PPTest 05 ... >Test: 04_for... >--- 01_comment.expect 2017-12-17 09:27:05.000000000 +0100 >+++ 01_comment.output 1970-01-01 01:00:00.000000000 +0100 >@@ -1,5 +0,0 @@ >-Hello >-Hello >-Hello >-Hello >-Hello >make[2]: *** [Makefile:67: 01_comment.test] Error 1 >PPTest 06 ... >--- 02_printf.expect 2017-12-17 09:27:05.000000000 +0100 >+++ 02_printf.output 1970-01-01 01:00:00.000000000 +0100 >@@ -1,15 +0,0 @@ >-Hello world >-Count = -5 >-Count = -4 >-Count = -3 >-Count = -2 >-Count = -1 >-Count = 0 >-Count = 1 >-Count = 2 >-Count = 3 >-Count = 4 >-Count = 5 >-String 'hello', 'there' is 'hello', 'there' >-Character 'A' is 'A' >-Character 'a' is 'a' >make[2]: *** [Makefile:67: 02_printf.test] Error 1 >PPTest 07 ... >Test: 05_array... >Test: 06_case... >PPTest 08 ... >Test: 07_function... >PPTest 09 ... >PPTest 10 ... >[1mtcctest.c:71:10: [0m[0;1;31mfatal error: [0m[1m' tests/ 42test.h ' file not found[0m >#include incname >[0;1;32m ^~~~~~~ >[0m[1mtcctest.c:67:17: [0m[0;1;30mnote: [0mexpanded from macro 'incname'[0m >#define incname < incdir funnyname > >[0;1;32m ^~~~~~~~~~~~~~~~~~~~ >[0m[1m<scratch space>:16:1: [0m[0;1;30mnote: [0mexpanded from here[0m >< tests/ 42test.h > >[0;1;32m^~~~~~~~~~~~~~~~~~~ >[0mTest: 08_while... >Test: 09_do_while... >Test: 10_pointer... >PPTest 11 ... >Test: 11_precedence... >Test: 12_hashdefine... >PPTest 12 ... >Test: 13_integer_literals... >PPTest 13 ... >Test: 14_if... >../tcc -B.. -I../include -I.. -I.. -DCONFIG_LDDIR="\"lib64\"" -DTCC_TARGET_X86_64 -DONE_SOURCE=0 ../tcc.c libtcc2.so -lm -ldl -Wl,-rpath=. -o tcc2 >Test: 15_recursion... >Test: 16_nesting... >PPTest 14 ... >Test: 17_enum... >Test: 18_include... >PPTest 15 ... >Test: 19_pointer_arithmetic... >PPTest 16 ... >Test: 20_pointer_comparison... >PPTest 17 ... >1 error generated. >PPTest 18 ... >make[1]: *** [Makefile:85: test.ref] Error 1 >Test: 22_floating_point... >Test: 21_char_array... >PPTest 19 ... >PPTest 20 ... >Test: 23_type_coercion... >Test: 24_math_library... >PPTest 21 ... >./tcc2 -B.. -I../include -I.. -I.. -DCONFIG_LDDIR="\"lib64\"" -DTCC_TARGET_X86_64 -run ../tcc.c -B.. -I../include -I.. -I.. -run ../examples/ex1.c >Test: 25_quicksort... >PPTest pp-counter ... >Test: 26_character_constants... >Test: 27_sizeof... >Test: 28_strings... >Test: 29_array_address... >Test: 30_hanoi... >Test: 31_args... >Test: 32_led... >Test: 33_ternary_op... >Test: 35_sizeof... >Test: 36_array_initialisers... >Test: 37_sprintf... >Test: 38_multiple_array_index... >Test: 39_typedef... >Test: 40_stdio... >Test: 41_hashif... >make[2]: Leaving directory '/var/tmp/portage/dev-lang/tcc-0.9.27/work/tcc-0.9.27/tests/pp' >Test: 42_function_pointer... >Test: 43_void_param... >Test: 44_scoped_declarations... >In file included from ../tcc.c:23: >In file included from ../libtcc.c:40: >[1m../tccpp.c:1421:33: [0m[0;1;35mwarning: [0m[1madding 'int' to a string does not append to the > string [-Wstring-plus-int][0m > fprintf(s->ppfp, "\n[%s]\n" + !(s->dflag & 32), p), fflush(s->ppfp); >[0;1;32m ~~~~~~~~~~~^~~~~~~~~~~~~~~~~~ >[0m[1m../tccpp.c:1421:33: [0m[0;1;30mnote: [0muse array indexing to silence this warning[0m > fprintf(s->ppfp, "\n[%s]\n" + !(s->dflag & 32), p), fflush(s->ppfp); >[0;1;32m ^ >[0m[0;32m & [ ] >[0mTest: 45_empty_for... >Test: 46_grep... >Test: 47_switch_return... >Test: 48_nested_break... >Test: 49_bracket_evaluation... >Test: 50_logical_second_arg... >Test: 51_static... >Test: 52_unnamed_enum... >Test: 54_goto... >Test: 55_lshift_type... >Test: 60_errors_and_warnings... >[1m../tccpp.c:3723:20: [0m[0;1;35mwarning: [0m[1madding 'int' to a string does not append to the > string [-Wstring-plus-int][0m > fprintf(fp, " %s" + s, get_tok_str(t, &cval)), s = 1; >[0;1;32m ~~~~~~^~~ >[0m[1m../tccpp.c:3723:20: [0m[0;1;30mnote: [0muse array indexing to silence this warning[0m > fprintf(fp, " %s" + s, get_tok_str(t, &cval)), s = 1; >[0;1;32m ^ >[0m[0;32m & [ ] >[0mTest: 67_macro_concat... >Test: 64_macro_nesting... >Test: 70_floating_point_literals... >Test: 71_macro_empty_arg... >Test: 72_long_long_constant... >Test: 75_array_in_struct_init... >Test: 76_dollars_in_identifiers... >Test: 77_push_pop_macro... >Test: 78_vla_label... >Test: 79_vla_continue... >Test: 80_flexarray... >Test: 81_types... >Test: 82_attribs_position... >Test: 83_utf8_in_identifiers... >Test: 84_hex-float... >Test: 85_asm-outside-function... >Test: 86_memory-model... >Test: 87_dead_code... >Test: 88_codeopt... >Test: 89_nocode_wanted... >Test: 90_struct-init... >Test: 91_ptr_longlong_arith32... >Test: 92_enum_bitfield... >Test: 93_integer_promotion... >Test: 94_generic... >Test: 95_bitfields... >Test: 95_bitfields_ms... >Test: 96_nodata_wanted... >Test: 97_utf8_string_literal... >Hello World >------------ dlltest with PIC ------------ >x86_64-pc-linux-gnu-clang -fno-strict-aliasing -fheinous-gnu-extensions -I.. -I.. -fPIC -DCONFIG_LDDIR="\"lib64\"" -DTCC_TARGET_X86_64 -DLIBTCC_AS_DLL -c ../libtcc.c >make[2]: Target 'all' not remade because of errors. >make[2]: Leaving directory '/var/tmp/portage/dev-lang/tcc-0.9.27/work/tcc-0.9.27/tests/tests2' >make[1]: *** [Makefile:80: tests2-dir] Error 2 >In file included from ../tcc.c:23: >In file included from ../libtcc.c:42: >[1m../tccelf.c:174:43: [0m[0;1;35mwarning: [0m[1mpassing 'unsigned char *' to parameter of type > 'const char *' converts between pointers to integer types with different > sign [-Wpointer-sign][0m > sym->st_other, sym->st_shndx, s->link->data + sym->st_name); >[0;1;32m ^~~~~~~~~~~~~~~~~~~~~~~~~~~~ >[0m[1m../tcc.h:1410:115: [0m[0;1;30mnote: [0mpassing argument to parameter 'name' here[0m > ...unsigned long size, int info, int other, int shndx, const char *name); >[0;1;32m ^ >[0mIn file included from ../libtcc.c:40: >[1m../tccpp.c:1421:33: [0m[0;1;35mwarning: [0m[1madding 'int' to a string does not append to the > string [-Wstring-plus-int][0m > fprintf(s->ppfp, "\n[%s]\n" + !(s->dflag & 32), p), fflush(s->ppfp); >[0;1;32m ~~~~~~~~~~~^~~~~~~~~~~~~~~~~~ >[0m[1m../tccpp.c:1421:33: [0m[0;1;30mnote: [0muse array indexing to silence this warning[0m > fprintf(s->ppfp, "\n[%s]\n" + !(s->dflag & 32), p), fflush(s->ppfp); >[0;1;32m ^ >[0m[0;32m & [ ] >[0m[1m../tccpp.c:3723:20: [0m[0;1;35mwarning: [0m[1madding 'int' to a string does not append to the > string [-Wstring-plus-int][0m > fprintf(fp, " %s" + s, get_tok_str(t, &cval)), s = 1; >[0;1;32m ~~~~~~^~~ >[0m[1m../tccpp.c:3723:20: [0m[0;1;30mnote: [0muse array indexing to silence this warning[0m > fprintf(fp, " %s" + s, get_tok_str(t, &cval)), s = 1; >[0;1;32m ^ >[0m[0;32m & [ ] >[0mIn file included from ../libtcc.c:42: >[1m../tccelf.c:174:43: [0m[0;1;35mwarning: [0m[1mpassing 'unsigned char *' to parameter of type > 'const char *' converts between pointers to integer types with different > sign [-Wpointer-sign][0m > sym->st_other, sym->st_shndx, s->link->data + sym->st_name); >[0;1;32m ^~~~~~~~~~~~~~~~~~~~~~~~~~~~ >[0m[1m../tcc.h:1410:115: [0m[0;1;30mnote: [0mpassing argument to parameter 'name' here[0m > ...unsigned long size, int info, int other, int shndx, const char *name); >[0;1;32m ^ >[0m3 warnings generated. >./memtest-tcc -B.. -I../include -I.. -I.. -DCONFIG_LDDIR="\"lib64\"" -DTCC_TARGET_X86_64 ../tcc.c -lm -ldl >./memtest-tcc -B.. -I../include -I.. -I.. -DCONFIG_LDDIR="\"lib64\"" -DTCC_TARGET_X86_64 -run ../tcc.c -B.. -I../include -I.. -I.. ../tests/tcctest.c >3 warnings generated. >../tcc -B.. -I../include -I.. -I.. libtcc.o -lm -ldl -shared -o libtcc2.so >make[1]: *** [Makefile:137: dlltest] Segmentation fault (core dumped) >make[1]: Leaving directory '/var/tmp/portage/dev-lang/tcc-0.9.27/work/tcc-0.9.27/tests' >make: *** [Makefile:347: test] Error 2 > * ERROR: dev-lang/tcc-0.9.27::gentoo failed (test phase): > * emake failed > * > * If you need support, post the output of `emerge --info '=dev-lang/tcc-0.9.27::gentoo'`, > * the complete build log and the output of `emerge -pqv '=dev-lang/tcc-0.9.27::gentoo'`. > * The complete build log is located at '/var/log/emerge-log/build/dev-lang/tcc-0.9.27:20200814-083921.log'. > * For convenience, a symlink to the build log is located at '/var/tmp/portage/dev-lang/tcc-0.9.27/temp/build.log'. > * The ebuild environment file is located at '/var/tmp/portage/dev-lang/tcc-0.9.27/temp/environment'. > * Working directory: '/var/tmp/portage/dev-lang/tcc-0.9.27/work/tcc-0.9.27' > * S: '/var/tmp/portage/dev-lang/tcc-0.9.27/work/tcc-0.9.27'
You cannot view the attachment while viewing its details because your browser does not support IFRAMEs.
View the attachment on a separate page
.
View Attachment As Raw
Actions:
View
Attachments on
bug 737092
: 654582