Go to:
Gentoo Home
Documentation
Forums
Lists
Bugs
Planet
Store
Wiki
Get Gentoo!
Gentoo's Bugzilla – Attachment 653658 Details for
Bug 736298
dev-libs/urdfdom-1.0.4 : /.../pose.cpp: error: no matching function for call to TiXmlElement::SetAttribute(const char [4], std::st
Home
|
New
–
[Ex]
|
Browse
|
Search
|
Privacy Policy
|
[?]
|
Reports
|
Requests
|
Help
|
New Account
|
Log In
[x]
|
Forgot Password
Login:
[x]
dev-libs:urdfdom-1.0.4:20200807-204043.log
dev-libs:urdfdom-1.0.4:20200807-204043.log (text/plain), 9.63 KB, created by
Toralf Förster
on 2020-08-07 20:48:05 UTC
(
hide
)
Description:
dev-libs:urdfdom-1.0.4:20200807-204043.log
Filename:
MIME Type:
Creator:
Toralf Förster
Created:
2020-08-07 20:48:05 UTC
Size:
9.63 KB
patch
obsolete
> * Package: dev-libs/urdfdom-1.0.4 > * Repository: gentoo > * Maintainer: ros@gentoo.org > * USE: abi_x86_64 amd64 elibc_glibc kernel_linux userland_GNU > * FEATURES: network-sandbox preserve-libs sandbox userpriv usersandbox >>>> Unpacking source... >>>> Unpacking urdfdom-1.0.4.tar.gz to /var/tmp/portage/dev-libs/urdfdom-1.0.4/work >>>> Source unpacked in /var/tmp/portage/dev-libs/urdfdom-1.0.4/work >>>> Preparing source in /var/tmp/portage/dev-libs/urdfdom-1.0.4/work/urdfdom-1.0.4 ... > * Applying cb.patch ... > [ ok ] > * Working in BUILD_DIR: "/var/tmp/portage/dev-libs/urdfdom-1.0.4/work/urdfdom-1.0.4_build" > * Hardcoded definition(s) removed in CMakeLists.txt: > * set(CMAKE_BUILD_TYPE Release) >>>> Source prepared. >>>> Configuring source in /var/tmp/portage/dev-libs/urdfdom-1.0.4/work/urdfdom-1.0.4 ... > * Working in BUILD_DIR: "/var/tmp/portage/dev-libs/urdfdom-1.0.4/work/urdfdom-1.0.4_build" >cmake -C /var/tmp/portage/dev-libs/urdfdom-1.0.4/work/urdfdom-1.0.4_build/gentoo_common_config.cmake -G Ninja -DCMAKE_INSTALL_PREFIX=/usr -DCMAKE_BUILD_TYPE=Gentoo -DCMAKE_TOOLCHAIN_FILE=/var/tmp/portage/dev-libs/urdfdom-1.0.4/work/urdfdom-1.0.4_build/gentoo_toolchain.cmake /var/tmp/portage/dev-libs/urdfdom-1.0.4/work/urdfdom-1.0.4 >loading initial cache file /var/tmp/portage/dev-libs/urdfdom-1.0.4/work/urdfdom-1.0.4_build/gentoo_common_config.cmake >-- The CXX compiler identification is GNU 10.2.0 >-- The C compiler identification is GNU 10.2.0 >-- Detecting CXX compiler ABI info >-- Detecting CXX compiler ABI info - done >-- Check for working CXX compiler: /usr/bin/x86_64-pc-linux-gnu-g++ - skipped >-- Detecting CXX compile features >-- Detecting CXX compile features - done >-- Detecting C compiler ABI info >-- Detecting C compiler ABI info - done >-- Check for working C compiler: /usr/bin/x86_64-pc-linux-gnu-gcc - skipped >-- Detecting C compile features >-- Detecting C compile features - done >-- urdfdom version 1.0.4 >-- Performing Test HAS_VISIBILITY >-- Performing Test HAS_VISIBILITY - Success >-- Found TinyXML: /usr/lib64/libtinyxml.so >-- Configuration successful. Type make to compile urdfdom >-- <<< Gentoo configuration >>> >Build type Gentoo >Install path /usr >Compiler flags: >C -O2 -pipe -march=native -fno-diagnostics-color -Wformat -Werror=format-security >C++ -O2 -pipe -march=native -fno-diagnostics-color -Wformat -Werror=format-security -fvisibility=hidden -std=c++11 >Linker flags: >Executable -Wl,-O1 -Wl,--as-needed -Wl,--defsym=__gentoo_check_ldflags__=0 >Module -Wl,-O1 -Wl,--as-needed -Wl,--defsym=__gentoo_check_ldflags__=0 >Shared -Wl,-O1 -Wl,--as-needed -Wl,--defsym=__gentoo_check_ldflags__=0 > >-- Configuring done >-- Generating done >-- Build files have been written to: /var/tmp/portage/dev-libs/urdfdom-1.0.4/work/urdfdom-1.0.4_build >>>> Source configured. >>>> Compiling source in /var/tmp/portage/dev-libs/urdfdom-1.0.4/work/urdfdom-1.0.4 ... > * Working in BUILD_DIR: "/var/tmp/portage/dev-libs/urdfdom-1.0.4/work/urdfdom-1.0.4_build" >ninja -v -j1 -l0 >[1/36] /usr/bin/x86_64-pc-linux-gnu-g++ -I/var/tmp/portage/dev-libs/urdfdom-1.0.4/work/urdfdom-1.0.4/urdf_parser/include -O2 -pipe -march=native -fno-diagnostics-color -Wformat -Werror=format-security -fvisibility=hidden -std=c++11 -MD -MT urdf_parser/CMakeFiles/check_urdf.dir/src/check_urdf.cpp.o -MF urdf_parser/CMakeFiles/check_urdf.dir/src/check_urdf.cpp.o.d -o urdf_parser/CMakeFiles/check_urdf.dir/src/check_urdf.cpp.o -c /var/tmp/portage/dev-libs/urdfdom-1.0.4/work/urdfdom-1.0.4/urdf_parser/src/check_urdf.cpp >[2/36] /usr/bin/x86_64-pc-linux-gnu-g++ -I/var/tmp/portage/dev-libs/urdfdom-1.0.4/work/urdfdom-1.0.4/urdf_parser/include -O2 -pipe -march=native -fno-diagnostics-color -Wformat -Werror=format-security -fvisibility=hidden -std=c++11 -MD -MT urdf_parser/CMakeFiles/urdf_to_graphiz.dir/src/urdf_to_graphiz.cpp.o -MF urdf_parser/CMakeFiles/urdf_to_graphiz.dir/src/urdf_to_graphiz.cpp.o.d -o urdf_parser/CMakeFiles/urdf_to_graphiz.dir/src/urdf_to_graphiz.cpp.o -c /var/tmp/portage/dev-libs/urdfdom-1.0.4/work/urdfdom-1.0.4/urdf_parser/src/urdf_to_graphiz.cpp >[3/36] /usr/bin/x86_64-pc-linux-gnu-g++ -I/var/tmp/portage/dev-libs/urdfdom-1.0.4/work/urdfdom-1.0.4/urdf_parser/include -O2 -pipe -march=native -fno-diagnostics-color -Wformat -Werror=format-security -fvisibility=hidden -std=c++11 -MD -MT urdf_parser/CMakeFiles/urdf_mem_test.dir/test/memtest.cpp.o -MF urdf_parser/CMakeFiles/urdf_mem_test.dir/test/memtest.cpp.o.d -o urdf_parser/CMakeFiles/urdf_mem_test.dir/test/memtest.cpp.o -c /var/tmp/portage/dev-libs/urdfdom-1.0.4/work/urdfdom-1.0.4/urdf_parser/test/memtest.cpp >[4/36] /usr/bin/x86_64-pc-linux-gnu-g++ -Durdfdom_model_EXPORTS -I/var/tmp/portage/dev-libs/urdfdom-1.0.4/work/urdfdom-1.0.4/urdf_parser/include -O2 -pipe -march=native -fno-diagnostics-color -Wformat -Werror=format-security -fvisibility=hidden -std=c++11 -fPIC -MD -MT urdf_parser/CMakeFiles/urdfdom_model.dir/src/pose.cpp.o -MF urdf_parser/CMakeFiles/urdfdom_model.dir/src/pose.cpp.o.d -o urdf_parser/CMakeFiles/urdfdom_model.dir/src/pose.cpp.o -c /var/tmp/portage/dev-libs/urdfdom-1.0.4/work/urdfdom-1.0.4/urdf_parser/src/pose.cpp >[31mFAILED: [0murdf_parser/CMakeFiles/urdfdom_model.dir/src/pose.cpp.o >/usr/bin/x86_64-pc-linux-gnu-g++ -Durdfdom_model_EXPORTS -I/var/tmp/portage/dev-libs/urdfdom-1.0.4/work/urdfdom-1.0.4/urdf_parser/include -O2 -pipe -march=native -fno-diagnostics-color -Wformat -Werror=format-security -fvisibility=hidden -std=c++11 -fPIC -MD -MT urdf_parser/CMakeFiles/urdfdom_model.dir/src/pose.cpp.o -MF urdf_parser/CMakeFiles/urdfdom_model.dir/src/pose.cpp.o.d -o urdf_parser/CMakeFiles/urdfdom_model.dir/src/pose.cpp.o -c /var/tmp/portage/dev-libs/urdfdom-1.0.4/work/urdfdom-1.0.4/urdf_parser/src/pose.cpp >/var/tmp/portage/dev-libs/urdfdom-1.0.4/work/urdfdom-1.0.4/urdf_parser/src/pose.cpp: In function âbool urdf::exportPose(urdf::Pose&, TiXmlElement*)â: >/var/tmp/portage/dev-libs/urdfdom-1.0.4/work/urdfdom-1.0.4/urdf_parser/src/pose.cpp:127:43: error: no matching function for call to âTiXmlElement::SetAttribute(const char [4], std::string&)â > 127 | origin->SetAttribute("xyz", pose_xyz_str); > | ^ >In file included from /var/tmp/portage/dev-libs/urdfdom-1.0.4/work/urdfdom-1.0.4/urdf_parser/src/pose.cpp:43: >/usr/include/tinyxml.h:1050:7: note: candidate: âvoid TiXmlElement::SetAttribute(const char*, const char*)â > 1050 | void SetAttribute( const char* name, const char * _value ); > | ^~~~~~~~~~~~ >/usr/include/tinyxml.h:1050:52: note: no known conversion for argument 2 from âstd::stringâ {aka âstd::__cxx11::basic_string<char>â} to âconst char*â > 1050 | void SetAttribute( const char* name, const char * _value ); > | ~~~~~~~~~~~~~^~~~~~ >/usr/include/tinyxml.h:1070:7: note: candidate: âvoid TiXmlElement::SetAttribute(const char*, int)â > 1070 | void SetAttribute( const char * name, int value ); > | ^~~~~~~~~~~~ >/usr/include/tinyxml.h:1070:44: note: no known conversion for argument 2 from âstd::stringâ {aka âstd::__cxx11::basic_string<char>â} to âintâ > 1070 | void SetAttribute( const char * name, int value ); > | ~~~~^~~~~ >/var/tmp/portage/dev-libs/urdfdom-1.0.4/work/urdfdom-1.0.4/urdf_parser/src/pose.cpp:128:43: error: no matching function for call to âTiXmlElement::SetAttribute(const char [4], std::string&)â > 128 | origin->SetAttribute("rpy", pose_rpy_str); > | ^ >In file included from /var/tmp/portage/dev-libs/urdfdom-1.0.4/work/urdfdom-1.0.4/urdf_parser/src/pose.cpp:43: >/usr/include/tinyxml.h:1050:7: note: candidate: âvoid TiXmlElement::SetAttribute(const char*, const char*)â > 1050 | void SetAttribute( const char* name, const char * _value ); > | ^~~~~~~~~~~~ >/usr/include/tinyxml.h:1050:52: note: no known conversion for argument 2 from âstd::stringâ {aka âstd::__cxx11::basic_string<char>â} to âconst char*â > 1050 | void SetAttribute( const char* name, const char * _value ); > | ~~~~~~~~~~~~~^~~~~~ >/usr/include/tinyxml.h:1070:7: note: candidate: âvoid TiXmlElement::SetAttribute(const char*, int)â > 1070 | void SetAttribute( const char * name, int value ); > | ^~~~~~~~~~~~ >/usr/include/tinyxml.h:1070:44: note: no known conversion for argument 2 from âstd::stringâ {aka âstd::__cxx11::basic_string<char>â} to âintâ > 1070 | void SetAttribute( const char * name, int value ); > | ~~~~^~~~~ >ninja: build stopped: subcommand failed. > * ERROR: dev-libs/urdfdom-1.0.4::gentoo failed (compile phase): > * ninja -v -j1 -l0 failed > * > * Call stack: > * ebuild.sh, line 125: Called src_compile > * environment, line 1937: Called cmake_src_compile > * environment, line 678: Called cmake_build > * environment, line 657: Called eninja > * environment, line 1099: Called die > * The specific snippet of code: > * "$@" || die "${nonfatal_args[@]}" "${*} failed" > * > * If you need support, post the output of `emerge --info '=dev-libs/urdfdom-1.0.4::gentoo'`, > * the complete build log and the output of `emerge -pqv '=dev-libs/urdfdom-1.0.4::gentoo'`. > * The complete build log is located at '/var/log/portage/dev-libs:urdfdom-1.0.4:20200807-204043.log'. > * For convenience, a symlink to the build log is located at '/var/tmp/portage/dev-libs/urdfdom-1.0.4/temp/build.log'. > * The ebuild environment file is located at '/var/tmp/portage/dev-libs/urdfdom-1.0.4/temp/environment'. > * Working directory: '/var/tmp/portage/dev-libs/urdfdom-1.0.4/work/urdfdom-1.0.4_build' > * S: '/var/tmp/portage/dev-libs/urdfdom-1.0.4/work/urdfdom-1.0.4'
You cannot view the attachment while viewing its details because your browser does not support IFRAMEs.
View the attachment on a separate page
.
View Attachment As Raw
Actions:
View
Attachments on
bug 736298
:
653656
| 653658 |
653660
|
653662
|
653664
|
653666
|
653668