Go to:
Gentoo Home
Documentation
Forums
Lists
Bugs
Planet
Store
Wiki
Get Gentoo!
Gentoo's Bugzilla – Attachment 634752 Details for
Bug 719702
dev-python/dnspython fails tests
Home
|
New
–
[Ex]
|
Browse
|
Search
|
Privacy Policy
|
[?]
|
Reports
|
Requests
|
Help
|
New Account
|
Log In
[x]
|
Forgot Password
Login:
[x]
build.log
build.log (text/plain), 55.63 KB, created by
Agostino Sarubbo
on 2020-04-26 20:52:12 UTC
(
hide
)
Description:
build.log
Filename:
MIME Type:
Creator:
Agostino Sarubbo
Created:
2020-04-26 20:52:12 UTC
Size:
55.63 KB
patch
obsolete
> * Package: dev-python/dnspython-1.16.0-r1 > * Repository: gentoo > * Maintainer: python@gentoo.org > * USE: arm64 elibc_glibc kernel_linux python_targets_python2_7 python_targets_python3_6 test userland_GNU > * FEATURES: network-sandbox preserve-libs sandbox splitdebug test userpriv usersandbox >>>> Unpacking source... >>>> Unpacking dnspython-1.16.0.tar.gz to /var/tmp/portage/dev-python/dnspython-1.16.0-r1/work >>>> Source unpacked in /var/tmp/portage/dev-python/dnspython-1.16.0-r1/work >>>> Preparing source in /var/tmp/portage/dev-python/dnspython-1.16.0-r1/work/dnspython-1.16.0 ... >>>> Source prepared. >>>> Configuring source in /var/tmp/portage/dev-python/dnspython-1.16.0-r1/work/dnspython-1.16.0 ... >>>> Source configured. >>>> Compiling source in /var/tmp/portage/dev-python/dnspython-1.16.0-r1/work/dnspython-1.16.0 ... > * python2_7: running distutils-r1_run_phase distutils-r1_python_compile >python2.7 setup.py build >running build >running build_py >creating /var/tmp/portage/dev-python/dnspython-1.16.0-r1/work/dnspython-1.16.0-python2_7/lib/dns >copying dns/flags.py -> /var/tmp/portage/dev-python/dnspython-1.16.0-r1/work/dnspython-1.16.0-python2_7/lib/dns >copying dns/version.py -> /var/tmp/portage/dev-python/dnspython-1.16.0-r1/work/dnspython-1.16.0-python2_7/lib/dns >copying dns/tsig.py -> /var/tmp/portage/dev-python/dnspython-1.16.0-r1/work/dnspython-1.16.0-python2_7/lib/dns >copying dns/node.py -> /var/tmp/portage/dev-python/dnspython-1.16.0-r1/work/dnspython-1.16.0-python2_7/lib/dns >copying dns/name.py -> /var/tmp/portage/dev-python/dnspython-1.16.0-r1/work/dnspython-1.16.0-python2_7/lib/dns >copying dns/zone.py -> /var/tmp/portage/dev-python/dnspython-1.16.0-r1/work/dnspython-1.16.0-python2_7/lib/dns >copying dns/rdata.py -> /var/tmp/portage/dev-python/dnspython-1.16.0-r1/work/dnspython-1.16.0-python2_7/lib/dns >copying dns/resolver.py -> /var/tmp/portage/dev-python/dnspython-1.16.0-r1/work/dnspython-1.16.0-python2_7/lib/dns >copying dns/ipv6.py -> /var/tmp/portage/dev-python/dnspython-1.16.0-r1/work/dnspython-1.16.0-python2_7/lib/dns >copying dns/renderer.py -> /var/tmp/portage/dev-python/dnspython-1.16.0-r1/work/dnspython-1.16.0-python2_7/lib/dns >copying dns/__init__.py -> /var/tmp/portage/dev-python/dnspython-1.16.0-r1/work/dnspython-1.16.0-python2_7/lib/dns >copying dns/query.py -> /var/tmp/portage/dev-python/dnspython-1.16.0-r1/work/dnspython-1.16.0-python2_7/lib/dns >copying dns/entropy.py -> /var/tmp/portage/dev-python/dnspython-1.16.0-r1/work/dnspython-1.16.0-python2_7/lib/dns >copying dns/rdataclass.py -> /var/tmp/portage/dev-python/dnspython-1.16.0-r1/work/dnspython-1.16.0-python2_7/lib/dns >copying dns/edns.py -> /var/tmp/portage/dev-python/dnspython-1.16.0-r1/work/dnspython-1.16.0-python2_7/lib/dns >copying dns/rdatatype.py -> /var/tmp/portage/dev-python/dnspython-1.16.0-r1/work/dnspython-1.16.0-python2_7/lib/dns >copying dns/rcode.py -> /var/tmp/portage/dev-python/dnspython-1.16.0-r1/work/dnspython-1.16.0-python2_7/lib/dns >copying dns/namedict.py -> /var/tmp/portage/dev-python/dnspython-1.16.0-r1/work/dnspython-1.16.0-python2_7/lib/dns >copying dns/rrset.py -> /var/tmp/portage/dev-python/dnspython-1.16.0-r1/work/dnspython-1.16.0-python2_7/lib/dns >copying dns/exception.py -> /var/tmp/portage/dev-python/dnspython-1.16.0-r1/work/dnspython-1.16.0-python2_7/lib/dns >copying dns/rdataset.py -> /var/tmp/portage/dev-python/dnspython-1.16.0-r1/work/dnspython-1.16.0-python2_7/lib/dns >copying dns/tokenizer.py -> /var/tmp/portage/dev-python/dnspython-1.16.0-r1/work/dnspython-1.16.0-python2_7/lib/dns >copying dns/wiredata.py -> /var/tmp/portage/dev-python/dnspython-1.16.0-r1/work/dnspython-1.16.0-python2_7/lib/dns >copying dns/hash.py -> /var/tmp/portage/dev-python/dnspython-1.16.0-r1/work/dnspython-1.16.0-python2_7/lib/dns >copying dns/tsigkeyring.py -> /var/tmp/portage/dev-python/dnspython-1.16.0-r1/work/dnspython-1.16.0-python2_7/lib/dns >copying dns/dnssec.py -> /var/tmp/portage/dev-python/dnspython-1.16.0-r1/work/dnspython-1.16.0-python2_7/lib/dns >copying dns/inet.py -> /var/tmp/portage/dev-python/dnspython-1.16.0-r1/work/dnspython-1.16.0-python2_7/lib/dns >copying dns/message.py -> /var/tmp/portage/dev-python/dnspython-1.16.0-r1/work/dnspython-1.16.0-python2_7/lib/dns >copying dns/_compat.py -> /var/tmp/portage/dev-python/dnspython-1.16.0-r1/work/dnspython-1.16.0-python2_7/lib/dns >copying dns/opcode.py -> /var/tmp/portage/dev-python/dnspython-1.16.0-r1/work/dnspython-1.16.0-python2_7/lib/dns >copying dns/grange.py -> /var/tmp/portage/dev-python/dnspython-1.16.0-r1/work/dnspython-1.16.0-python2_7/lib/dns >copying dns/ipv4.py -> /var/tmp/portage/dev-python/dnspython-1.16.0-r1/work/dnspython-1.16.0-python2_7/lib/dns >copying dns/reversename.py -> /var/tmp/portage/dev-python/dnspython-1.16.0-r1/work/dnspython-1.16.0-python2_7/lib/dns >copying dns/e164.py -> /var/tmp/portage/dev-python/dnspython-1.16.0-r1/work/dnspython-1.16.0-python2_7/lib/dns >copying dns/update.py -> /var/tmp/portage/dev-python/dnspython-1.16.0-r1/work/dnspython-1.16.0-python2_7/lib/dns >copying dns/ttl.py -> /var/tmp/portage/dev-python/dnspython-1.16.0-r1/work/dnspython-1.16.0-python2_7/lib/dns >copying dns/set.py -> /var/tmp/portage/dev-python/dnspython-1.16.0-r1/work/dnspython-1.16.0-python2_7/lib/dns >creating /var/tmp/portage/dev-python/dnspython-1.16.0-r1/work/dnspython-1.16.0-python2_7/lib/dns/rdtypes >copying dns/rdtypes/nsbase.py -> /var/tmp/portage/dev-python/dnspython-1.16.0-r1/work/dnspython-1.16.0-python2_7/lib/dns/rdtypes >copying dns/rdtypes/euibase.py -> /var/tmp/portage/dev-python/dnspython-1.16.0-r1/work/dnspython-1.16.0-python2_7/lib/dns/rdtypes >copying dns/rdtypes/__init__.py -> /var/tmp/portage/dev-python/dnspython-1.16.0-r1/work/dnspython-1.16.0-python2_7/lib/dns/rdtypes >copying dns/rdtypes/dsbase.py -> /var/tmp/portage/dev-python/dnspython-1.16.0-r1/work/dnspython-1.16.0-python2_7/lib/dns/rdtypes >copying dns/rdtypes/txtbase.py -> /var/tmp/portage/dev-python/dnspython-1.16.0-r1/work/dnspython-1.16.0-python2_7/lib/dns/rdtypes >copying dns/rdtypes/mxbase.py -> /var/tmp/portage/dev-python/dnspython-1.16.0-r1/work/dnspython-1.16.0-python2_7/lib/dns/rdtypes >copying dns/rdtypes/dnskeybase.py -> /var/tmp/portage/dev-python/dnspython-1.16.0-r1/work/dnspython-1.16.0-python2_7/lib/dns/rdtypes >creating /var/tmp/portage/dev-python/dnspython-1.16.0-r1/work/dnspython-1.16.0-python2_7/lib/dns/rdtypes/IN >copying dns/rdtypes/IN/PX.py -> /var/tmp/portage/dev-python/dnspython-1.16.0-r1/work/dnspython-1.16.0-python2_7/lib/dns/rdtypes/IN >copying dns/rdtypes/IN/WKS.py -> /var/tmp/portage/dev-python/dnspython-1.16.0-r1/work/dnspython-1.16.0-python2_7/lib/dns/rdtypes/IN >copying dns/rdtypes/IN/APL.py -> /var/tmp/portage/dev-python/dnspython-1.16.0-r1/work/dnspython-1.16.0-python2_7/lib/dns/rdtypes/IN >copying dns/rdtypes/IN/DHCID.py -> /var/tmp/portage/dev-python/dnspython-1.16.0-r1/work/dnspython-1.16.0-python2_7/lib/dns/rdtypes/IN >copying dns/rdtypes/IN/SRV.py -> /var/tmp/portage/dev-python/dnspython-1.16.0-r1/work/dnspython-1.16.0-python2_7/lib/dns/rdtypes/IN >copying dns/rdtypes/IN/__init__.py -> /var/tmp/portage/dev-python/dnspython-1.16.0-r1/work/dnspython-1.16.0-python2_7/lib/dns/rdtypes/IN >copying dns/rdtypes/IN/NAPTR.py -> /var/tmp/portage/dev-python/dnspython-1.16.0-r1/work/dnspython-1.16.0-python2_7/lib/dns/rdtypes/IN >copying dns/rdtypes/IN/NSAP_PTR.py -> /var/tmp/portage/dev-python/dnspython-1.16.0-r1/work/dnspython-1.16.0-python2_7/lib/dns/rdtypes/IN >copying dns/rdtypes/IN/KX.py -> /var/tmp/portage/dev-python/dnspython-1.16.0-r1/work/dnspython-1.16.0-python2_7/lib/dns/rdtypes/IN >copying dns/rdtypes/IN/AAAA.py -> /var/tmp/portage/dev-python/dnspython-1.16.0-r1/work/dnspython-1.16.0-python2_7/lib/dns/rdtypes/IN >copying dns/rdtypes/IN/NSAP.py -> /var/tmp/portage/dev-python/dnspython-1.16.0-r1/work/dnspython-1.16.0-python2_7/lib/dns/rdtypes/IN >copying dns/rdtypes/IN/A.py -> /var/tmp/portage/dev-python/dnspython-1.16.0-r1/work/dnspython-1.16.0-python2_7/lib/dns/rdtypes/IN >copying dns/rdtypes/IN/IPSECKEY.py -> /var/tmp/portage/dev-python/dnspython-1.16.0-r1/work/dnspython-1.16.0-python2_7/lib/dns/rdtypes/IN >creating /var/tmp/portage/dev-python/dnspython-1.16.0-r1/work/dnspython-1.16.0-python2_7/lib/dns/rdtypes/ANY >copying dns/rdtypes/ANY/DLV.py -> /var/tmp/portage/dev-python/dnspython-1.16.0-r1/work/dnspython-1.16.0-python2_7/lib/dns/rdtypes/ANY >copying dns/rdtypes/ANY/URI.py -> /var/tmp/portage/dev-python/dnspython-1.16.0-r1/work/dnspython-1.16.0-python2_7/lib/dns/rdtypes/ANY >copying dns/rdtypes/ANY/PTR.py -> /var/tmp/portage/dev-python/dnspython-1.16.0-r1/work/dnspython-1.16.0-python2_7/lib/dns/rdtypes/ANY >copying dns/rdtypes/ANY/CAA.py -> /var/tmp/portage/dev-python/dnspython-1.16.0-r1/work/dnspython-1.16.0-python2_7/lib/dns/rdtypes/ANY >copying dns/rdtypes/ANY/RT.py -> /var/tmp/portage/dev-python/dnspython-1.16.0-r1/work/dnspython-1.16.0-python2_7/lib/dns/rdtypes/ANY >copying dns/rdtypes/ANY/SPF.py -> /var/tmp/portage/dev-python/dnspython-1.16.0-r1/work/dnspython-1.16.0-python2_7/lib/dns/rdtypes/ANY >copying dns/rdtypes/ANY/RRSIG.py -> /var/tmp/portage/dev-python/dnspython-1.16.0-r1/work/dnspython-1.16.0-python2_7/lib/dns/rdtypes/ANY >copying dns/rdtypes/ANY/RP.py -> /var/tmp/portage/dev-python/dnspython-1.16.0-r1/work/dnspython-1.16.0-python2_7/lib/dns/rdtypes/ANY >copying dns/rdtypes/ANY/__init__.py -> /var/tmp/portage/dev-python/dnspython-1.16.0-r1/work/dnspython-1.16.0-python2_7/lib/dns/rdtypes/ANY >copying dns/rdtypes/ANY/CSYNC.py -> /var/tmp/portage/dev-python/dnspython-1.16.0-r1/work/dnspython-1.16.0-python2_7/lib/dns/rdtypes/ANY >copying dns/rdtypes/ANY/LOC.py -> /var/tmp/portage/dev-python/dnspython-1.16.0-r1/work/dnspython-1.16.0-python2_7/lib/dns/rdtypes/ANY >copying dns/rdtypes/ANY/OPENPGPKEY.py -> /var/tmp/portage/dev-python/dnspython-1.16.0-r1/work/dnspython-1.16.0-python2_7/lib/dns/rdtypes/ANY >copying dns/rdtypes/ANY/EUI64.py -> /var/tmp/portage/dev-python/dnspython-1.16.0-r1/work/dnspython-1.16.0-python2_7/lib/dns/rdtypes/ANY >copying dns/rdtypes/ANY/CERT.py -> /var/tmp/portage/dev-python/dnspython-1.16.0-r1/work/dnspython-1.16.0-python2_7/lib/dns/rdtypes/ANY >copying dns/rdtypes/ANY/ISDN.py -> /var/tmp/portage/dev-python/dnspython-1.16.0-r1/work/dnspython-1.16.0-python2_7/lib/dns/rdtypes/ANY >copying dns/rdtypes/ANY/NSEC3.py -> /var/tmp/portage/dev-python/dnspython-1.16.0-r1/work/dnspython-1.16.0-python2_7/lib/dns/rdtypes/ANY >copying dns/rdtypes/ANY/MX.py -> /var/tmp/portage/dev-python/dnspython-1.16.0-r1/work/dnspython-1.16.0-python2_7/lib/dns/rdtypes/ANY >copying dns/rdtypes/ANY/AVC.py -> /var/tmp/portage/dev-python/dnspython-1.16.0-r1/work/dnspython-1.16.0-python2_7/lib/dns/rdtypes/ANY >copying dns/rdtypes/ANY/HIP.py -> /var/tmp/portage/dev-python/dnspython-1.16.0-r1/work/dnspython-1.16.0-python2_7/lib/dns/rdtypes/ANY >copying dns/rdtypes/ANY/NSEC3PARAM.py -> /var/tmp/portage/dev-python/dnspython-1.16.0-r1/work/dnspython-1.16.0-python2_7/lib/dns/rdtypes/ANY >copying dns/rdtypes/ANY/AFSDB.py -> /var/tmp/portage/dev-python/dnspython-1.16.0-r1/work/dnspython-1.16.0-python2_7/lib/dns/rdtypes/ANY >copying dns/rdtypes/ANY/CDNSKEY.py -> /var/tmp/portage/dev-python/dnspython-1.16.0-r1/work/dnspython-1.16.0-python2_7/lib/dns/rdtypes/ANY >copying dns/rdtypes/ANY/CNAME.py -> /var/tmp/portage/dev-python/dnspython-1.16.0-r1/work/dnspython-1.16.0-python2_7/lib/dns/rdtypes/ANY >copying dns/rdtypes/ANY/HINFO.py -> /var/tmp/portage/dev-python/dnspython-1.16.0-r1/work/dnspython-1.16.0-python2_7/lib/dns/rdtypes/ANY >copying dns/rdtypes/ANY/DNSKEY.py -> /var/tmp/portage/dev-python/dnspython-1.16.0-r1/work/dnspython-1.16.0-python2_7/lib/dns/rdtypes/ANY >copying dns/rdtypes/ANY/X25.py -> /var/tmp/portage/dev-python/dnspython-1.16.0-r1/work/dnspython-1.16.0-python2_7/lib/dns/rdtypes/ANY >copying dns/rdtypes/ANY/TLSA.py -> /var/tmp/portage/dev-python/dnspython-1.16.0-r1/work/dnspython-1.16.0-python2_7/lib/dns/rdtypes/ANY >copying dns/rdtypes/ANY/DNAME.py -> /var/tmp/portage/dev-python/dnspython-1.16.0-r1/work/dnspython-1.16.0-python2_7/lib/dns/rdtypes/ANY >copying dns/rdtypes/ANY/SOA.py -> /var/tmp/portage/dev-python/dnspython-1.16.0-r1/work/dnspython-1.16.0-python2_7/lib/dns/rdtypes/ANY >copying dns/rdtypes/ANY/NSEC.py -> /var/tmp/portage/dev-python/dnspython-1.16.0-r1/work/dnspython-1.16.0-python2_7/lib/dns/rdtypes/ANY >copying dns/rdtypes/ANY/CDS.py -> /var/tmp/portage/dev-python/dnspython-1.16.0-r1/work/dnspython-1.16.0-python2_7/lib/dns/rdtypes/ANY >copying dns/rdtypes/ANY/NS.py -> /var/tmp/portage/dev-python/dnspython-1.16.0-r1/work/dnspython-1.16.0-python2_7/lib/dns/rdtypes/ANY >copying dns/rdtypes/ANY/SSHFP.py -> /var/tmp/portage/dev-python/dnspython-1.16.0-r1/work/dnspython-1.16.0-python2_7/lib/dns/rdtypes/ANY >copying dns/rdtypes/ANY/DS.py -> /var/tmp/portage/dev-python/dnspython-1.16.0-r1/work/dnspython-1.16.0-python2_7/lib/dns/rdtypes/ANY >copying dns/rdtypes/ANY/EUI48.py -> /var/tmp/portage/dev-python/dnspython-1.16.0-r1/work/dnspython-1.16.0-python2_7/lib/dns/rdtypes/ANY >copying dns/rdtypes/ANY/GPOS.py -> /var/tmp/portage/dev-python/dnspython-1.16.0-r1/work/dnspython-1.16.0-python2_7/lib/dns/rdtypes/ANY >copying dns/rdtypes/ANY/TXT.py -> /var/tmp/portage/dev-python/dnspython-1.16.0-r1/work/dnspython-1.16.0-python2_7/lib/dns/rdtypes/ANY >creating /var/tmp/portage/dev-python/dnspython-1.16.0-r1/work/dnspython-1.16.0-python2_7/lib/dns/rdtypes/CH >copying dns/rdtypes/CH/__init__.py -> /var/tmp/portage/dev-python/dnspython-1.16.0-r1/work/dnspython-1.16.0-python2_7/lib/dns/rdtypes/CH >copying dns/rdtypes/CH/A.py -> /var/tmp/portage/dev-python/dnspython-1.16.0-r1/work/dnspython-1.16.0-python2_7/lib/dns/rdtypes/CH >copying dns/py.typed -> /var/tmp/portage/dev-python/dnspython-1.16.0-r1/work/dnspython-1.16.0-python2_7/lib/dns >warning: build_py: byte-compiling is disabled, skipping. > > * python3_6: running distutils-r1_run_phase distutils-r1_python_compile >python3.6 setup.py build -j 96 >running build >running build_py >creating /var/tmp/portage/dev-python/dnspython-1.16.0-r1/work/dnspython-1.16.0-python3_6/lib/dns >copying dns/flags.py -> /var/tmp/portage/dev-python/dnspython-1.16.0-r1/work/dnspython-1.16.0-python3_6/lib/dns >copying dns/version.py -> /var/tmp/portage/dev-python/dnspython-1.16.0-r1/work/dnspython-1.16.0-python3_6/lib/dns >copying dns/tsig.py -> /var/tmp/portage/dev-python/dnspython-1.16.0-r1/work/dnspython-1.16.0-python3_6/lib/dns >copying dns/node.py -> /var/tmp/portage/dev-python/dnspython-1.16.0-r1/work/dnspython-1.16.0-python3_6/lib/dns >copying dns/name.py -> /var/tmp/portage/dev-python/dnspython-1.16.0-r1/work/dnspython-1.16.0-python3_6/lib/dns >copying dns/zone.py -> /var/tmp/portage/dev-python/dnspython-1.16.0-r1/work/dnspython-1.16.0-python3_6/lib/dns >copying dns/rdata.py -> /var/tmp/portage/dev-python/dnspython-1.16.0-r1/work/dnspython-1.16.0-python3_6/lib/dns >copying dns/resolver.py -> /var/tmp/portage/dev-python/dnspython-1.16.0-r1/work/dnspython-1.16.0-python3_6/lib/dns >copying dns/ipv6.py -> /var/tmp/portage/dev-python/dnspython-1.16.0-r1/work/dnspython-1.16.0-python3_6/lib/dns >copying dns/renderer.py -> /var/tmp/portage/dev-python/dnspython-1.16.0-r1/work/dnspython-1.16.0-python3_6/lib/dns >copying dns/__init__.py -> /var/tmp/portage/dev-python/dnspython-1.16.0-r1/work/dnspython-1.16.0-python3_6/lib/dns >copying dns/query.py -> /var/tmp/portage/dev-python/dnspython-1.16.0-r1/work/dnspython-1.16.0-python3_6/lib/dns >copying dns/entropy.py -> /var/tmp/portage/dev-python/dnspython-1.16.0-r1/work/dnspython-1.16.0-python3_6/lib/dns >copying dns/rdataclass.py -> /var/tmp/portage/dev-python/dnspython-1.16.0-r1/work/dnspython-1.16.0-python3_6/lib/dns >copying dns/edns.py -> /var/tmp/portage/dev-python/dnspython-1.16.0-r1/work/dnspython-1.16.0-python3_6/lib/dns >copying dns/rdatatype.py -> /var/tmp/portage/dev-python/dnspython-1.16.0-r1/work/dnspython-1.16.0-python3_6/lib/dns >copying dns/rcode.py -> /var/tmp/portage/dev-python/dnspython-1.16.0-r1/work/dnspython-1.16.0-python3_6/lib/dns >copying dns/namedict.py -> /var/tmp/portage/dev-python/dnspython-1.16.0-r1/work/dnspython-1.16.0-python3_6/lib/dns >copying dns/rrset.py -> /var/tmp/portage/dev-python/dnspython-1.16.0-r1/work/dnspython-1.16.0-python3_6/lib/dns >copying dns/exception.py -> /var/tmp/portage/dev-python/dnspython-1.16.0-r1/work/dnspython-1.16.0-python3_6/lib/dns >copying dns/rdataset.py -> /var/tmp/portage/dev-python/dnspython-1.16.0-r1/work/dnspython-1.16.0-python3_6/lib/dns >copying dns/tokenizer.py -> /var/tmp/portage/dev-python/dnspython-1.16.0-r1/work/dnspython-1.16.0-python3_6/lib/dns >copying dns/wiredata.py -> /var/tmp/portage/dev-python/dnspython-1.16.0-r1/work/dnspython-1.16.0-python3_6/lib/dns >copying dns/hash.py -> /var/tmp/portage/dev-python/dnspython-1.16.0-r1/work/dnspython-1.16.0-python3_6/lib/dns >copying dns/tsigkeyring.py -> /var/tmp/portage/dev-python/dnspython-1.16.0-r1/work/dnspython-1.16.0-python3_6/lib/dns >copying dns/dnssec.py -> /var/tmp/portage/dev-python/dnspython-1.16.0-r1/work/dnspython-1.16.0-python3_6/lib/dns >copying dns/inet.py -> /var/tmp/portage/dev-python/dnspython-1.16.0-r1/work/dnspython-1.16.0-python3_6/lib/dns >copying dns/message.py -> /var/tmp/portage/dev-python/dnspython-1.16.0-r1/work/dnspython-1.16.0-python3_6/lib/dns >copying dns/_compat.py -> /var/tmp/portage/dev-python/dnspython-1.16.0-r1/work/dnspython-1.16.0-python3_6/lib/dns >copying dns/opcode.py -> /var/tmp/portage/dev-python/dnspython-1.16.0-r1/work/dnspython-1.16.0-python3_6/lib/dns >copying dns/grange.py -> /var/tmp/portage/dev-python/dnspython-1.16.0-r1/work/dnspython-1.16.0-python3_6/lib/dns >copying dns/ipv4.py -> /var/tmp/portage/dev-python/dnspython-1.16.0-r1/work/dnspython-1.16.0-python3_6/lib/dns >copying dns/reversename.py -> /var/tmp/portage/dev-python/dnspython-1.16.0-r1/work/dnspython-1.16.0-python3_6/lib/dns >copying dns/e164.py -> /var/tmp/portage/dev-python/dnspython-1.16.0-r1/work/dnspython-1.16.0-python3_6/lib/dns >copying dns/update.py -> /var/tmp/portage/dev-python/dnspython-1.16.0-r1/work/dnspython-1.16.0-python3_6/lib/dns >copying dns/ttl.py -> /var/tmp/portage/dev-python/dnspython-1.16.0-r1/work/dnspython-1.16.0-python3_6/lib/dns >copying dns/set.py -> /var/tmp/portage/dev-python/dnspython-1.16.0-r1/work/dnspython-1.16.0-python3_6/lib/dns >creating /var/tmp/portage/dev-python/dnspython-1.16.0-r1/work/dnspython-1.16.0-python3_6/lib/dns/rdtypes >copying dns/rdtypes/nsbase.py -> /var/tmp/portage/dev-python/dnspython-1.16.0-r1/work/dnspython-1.16.0-python3_6/lib/dns/rdtypes >copying dns/rdtypes/euibase.py -> /var/tmp/portage/dev-python/dnspython-1.16.0-r1/work/dnspython-1.16.0-python3_6/lib/dns/rdtypes >copying dns/rdtypes/__init__.py -> /var/tmp/portage/dev-python/dnspython-1.16.0-r1/work/dnspython-1.16.0-python3_6/lib/dns/rdtypes >copying dns/rdtypes/dsbase.py -> /var/tmp/portage/dev-python/dnspython-1.16.0-r1/work/dnspython-1.16.0-python3_6/lib/dns/rdtypes >copying dns/rdtypes/txtbase.py -> /var/tmp/portage/dev-python/dnspython-1.16.0-r1/work/dnspython-1.16.0-python3_6/lib/dns/rdtypes >copying dns/rdtypes/mxbase.py -> /var/tmp/portage/dev-python/dnspython-1.16.0-r1/work/dnspython-1.16.0-python3_6/lib/dns/rdtypes >copying dns/rdtypes/dnskeybase.py -> /var/tmp/portage/dev-python/dnspython-1.16.0-r1/work/dnspython-1.16.0-python3_6/lib/dns/rdtypes >creating /var/tmp/portage/dev-python/dnspython-1.16.0-r1/work/dnspython-1.16.0-python3_6/lib/dns/rdtypes/IN >copying dns/rdtypes/IN/PX.py -> /var/tmp/portage/dev-python/dnspython-1.16.0-r1/work/dnspython-1.16.0-python3_6/lib/dns/rdtypes/IN >copying dns/rdtypes/IN/WKS.py -> /var/tmp/portage/dev-python/dnspython-1.16.0-r1/work/dnspython-1.16.0-python3_6/lib/dns/rdtypes/IN >copying dns/rdtypes/IN/APL.py -> /var/tmp/portage/dev-python/dnspython-1.16.0-r1/work/dnspython-1.16.0-python3_6/lib/dns/rdtypes/IN >copying dns/rdtypes/IN/DHCID.py -> /var/tmp/portage/dev-python/dnspython-1.16.0-r1/work/dnspython-1.16.0-python3_6/lib/dns/rdtypes/IN >copying dns/rdtypes/IN/SRV.py -> /var/tmp/portage/dev-python/dnspython-1.16.0-r1/work/dnspython-1.16.0-python3_6/lib/dns/rdtypes/IN >copying dns/rdtypes/IN/__init__.py -> /var/tmp/portage/dev-python/dnspython-1.16.0-r1/work/dnspython-1.16.0-python3_6/lib/dns/rdtypes/IN >copying dns/rdtypes/IN/NAPTR.py -> /var/tmp/portage/dev-python/dnspython-1.16.0-r1/work/dnspython-1.16.0-python3_6/lib/dns/rdtypes/IN >copying dns/rdtypes/IN/NSAP_PTR.py -> /var/tmp/portage/dev-python/dnspython-1.16.0-r1/work/dnspython-1.16.0-python3_6/lib/dns/rdtypes/IN >copying dns/rdtypes/IN/KX.py -> /var/tmp/portage/dev-python/dnspython-1.16.0-r1/work/dnspython-1.16.0-python3_6/lib/dns/rdtypes/IN >copying dns/rdtypes/IN/AAAA.py -> /var/tmp/portage/dev-python/dnspython-1.16.0-r1/work/dnspython-1.16.0-python3_6/lib/dns/rdtypes/IN >copying dns/rdtypes/IN/NSAP.py -> /var/tmp/portage/dev-python/dnspython-1.16.0-r1/work/dnspython-1.16.0-python3_6/lib/dns/rdtypes/IN >copying dns/rdtypes/IN/A.py -> /var/tmp/portage/dev-python/dnspython-1.16.0-r1/work/dnspython-1.16.0-python3_6/lib/dns/rdtypes/IN >copying dns/rdtypes/IN/IPSECKEY.py -> /var/tmp/portage/dev-python/dnspython-1.16.0-r1/work/dnspython-1.16.0-python3_6/lib/dns/rdtypes/IN >creating /var/tmp/portage/dev-python/dnspython-1.16.0-r1/work/dnspython-1.16.0-python3_6/lib/dns/rdtypes/ANY >copying dns/rdtypes/ANY/DLV.py -> /var/tmp/portage/dev-python/dnspython-1.16.0-r1/work/dnspython-1.16.0-python3_6/lib/dns/rdtypes/ANY >copying dns/rdtypes/ANY/URI.py -> /var/tmp/portage/dev-python/dnspython-1.16.0-r1/work/dnspython-1.16.0-python3_6/lib/dns/rdtypes/ANY >copying dns/rdtypes/ANY/PTR.py -> /var/tmp/portage/dev-python/dnspython-1.16.0-r1/work/dnspython-1.16.0-python3_6/lib/dns/rdtypes/ANY >copying dns/rdtypes/ANY/CAA.py -> /var/tmp/portage/dev-python/dnspython-1.16.0-r1/work/dnspython-1.16.0-python3_6/lib/dns/rdtypes/ANY >copying dns/rdtypes/ANY/RT.py -> /var/tmp/portage/dev-python/dnspython-1.16.0-r1/work/dnspython-1.16.0-python3_6/lib/dns/rdtypes/ANY >copying dns/rdtypes/ANY/SPF.py -> /var/tmp/portage/dev-python/dnspython-1.16.0-r1/work/dnspython-1.16.0-python3_6/lib/dns/rdtypes/ANY >copying dns/rdtypes/ANY/RRSIG.py -> /var/tmp/portage/dev-python/dnspython-1.16.0-r1/work/dnspython-1.16.0-python3_6/lib/dns/rdtypes/ANY >copying dns/rdtypes/ANY/RP.py -> /var/tmp/portage/dev-python/dnspython-1.16.0-r1/work/dnspython-1.16.0-python3_6/lib/dns/rdtypes/ANY >copying dns/rdtypes/ANY/__init__.py -> /var/tmp/portage/dev-python/dnspython-1.16.0-r1/work/dnspython-1.16.0-python3_6/lib/dns/rdtypes/ANY >copying dns/rdtypes/ANY/CSYNC.py -> /var/tmp/portage/dev-python/dnspython-1.16.0-r1/work/dnspython-1.16.0-python3_6/lib/dns/rdtypes/ANY >copying dns/rdtypes/ANY/LOC.py -> /var/tmp/portage/dev-python/dnspython-1.16.0-r1/work/dnspython-1.16.0-python3_6/lib/dns/rdtypes/ANY >copying dns/rdtypes/ANY/OPENPGPKEY.py -> /var/tmp/portage/dev-python/dnspython-1.16.0-r1/work/dnspython-1.16.0-python3_6/lib/dns/rdtypes/ANY >copying dns/rdtypes/ANY/EUI64.py -> /var/tmp/portage/dev-python/dnspython-1.16.0-r1/work/dnspython-1.16.0-python3_6/lib/dns/rdtypes/ANY >copying dns/rdtypes/ANY/CERT.py -> /var/tmp/portage/dev-python/dnspython-1.16.0-r1/work/dnspython-1.16.0-python3_6/lib/dns/rdtypes/ANY >copying dns/rdtypes/ANY/ISDN.py -> /var/tmp/portage/dev-python/dnspython-1.16.0-r1/work/dnspython-1.16.0-python3_6/lib/dns/rdtypes/ANY >copying dns/rdtypes/ANY/NSEC3.py -> /var/tmp/portage/dev-python/dnspython-1.16.0-r1/work/dnspython-1.16.0-python3_6/lib/dns/rdtypes/ANY >copying dns/rdtypes/ANY/MX.py -> /var/tmp/portage/dev-python/dnspython-1.16.0-r1/work/dnspython-1.16.0-python3_6/lib/dns/rdtypes/ANY >copying dns/rdtypes/ANY/AVC.py -> /var/tmp/portage/dev-python/dnspython-1.16.0-r1/work/dnspython-1.16.0-python3_6/lib/dns/rdtypes/ANY >copying dns/rdtypes/ANY/HIP.py -> /var/tmp/portage/dev-python/dnspython-1.16.0-r1/work/dnspython-1.16.0-python3_6/lib/dns/rdtypes/ANY >copying dns/rdtypes/ANY/NSEC3PARAM.py -> /var/tmp/portage/dev-python/dnspython-1.16.0-r1/work/dnspython-1.16.0-python3_6/lib/dns/rdtypes/ANY >copying dns/rdtypes/ANY/AFSDB.py -> /var/tmp/portage/dev-python/dnspython-1.16.0-r1/work/dnspython-1.16.0-python3_6/lib/dns/rdtypes/ANY >copying dns/rdtypes/ANY/CDNSKEY.py -> /var/tmp/portage/dev-python/dnspython-1.16.0-r1/work/dnspython-1.16.0-python3_6/lib/dns/rdtypes/ANY >copying dns/rdtypes/ANY/CNAME.py -> /var/tmp/portage/dev-python/dnspython-1.16.0-r1/work/dnspython-1.16.0-python3_6/lib/dns/rdtypes/ANY >copying dns/rdtypes/ANY/HINFO.py -> /var/tmp/portage/dev-python/dnspython-1.16.0-r1/work/dnspython-1.16.0-python3_6/lib/dns/rdtypes/ANY >copying dns/rdtypes/ANY/DNSKEY.py -> /var/tmp/portage/dev-python/dnspython-1.16.0-r1/work/dnspython-1.16.0-python3_6/lib/dns/rdtypes/ANY >copying dns/rdtypes/ANY/X25.py -> /var/tmp/portage/dev-python/dnspython-1.16.0-r1/work/dnspython-1.16.0-python3_6/lib/dns/rdtypes/ANY >copying dns/rdtypes/ANY/TLSA.py -> /var/tmp/portage/dev-python/dnspython-1.16.0-r1/work/dnspython-1.16.0-python3_6/lib/dns/rdtypes/ANY >copying dns/rdtypes/ANY/DNAME.py -> /var/tmp/portage/dev-python/dnspython-1.16.0-r1/work/dnspython-1.16.0-python3_6/lib/dns/rdtypes/ANY >copying dns/rdtypes/ANY/SOA.py -> /var/tmp/portage/dev-python/dnspython-1.16.0-r1/work/dnspython-1.16.0-python3_6/lib/dns/rdtypes/ANY >copying dns/rdtypes/ANY/NSEC.py -> /var/tmp/portage/dev-python/dnspython-1.16.0-r1/work/dnspython-1.16.0-python3_6/lib/dns/rdtypes/ANY >copying dns/rdtypes/ANY/CDS.py -> /var/tmp/portage/dev-python/dnspython-1.16.0-r1/work/dnspython-1.16.0-python3_6/lib/dns/rdtypes/ANY >copying dns/rdtypes/ANY/NS.py -> /var/tmp/portage/dev-python/dnspython-1.16.0-r1/work/dnspython-1.16.0-python3_6/lib/dns/rdtypes/ANY >copying dns/rdtypes/ANY/SSHFP.py -> /var/tmp/portage/dev-python/dnspython-1.16.0-r1/work/dnspython-1.16.0-python3_6/lib/dns/rdtypes/ANY >copying dns/rdtypes/ANY/DS.py -> /var/tmp/portage/dev-python/dnspython-1.16.0-r1/work/dnspython-1.16.0-python3_6/lib/dns/rdtypes/ANY >copying dns/rdtypes/ANY/EUI48.py -> /var/tmp/portage/dev-python/dnspython-1.16.0-r1/work/dnspython-1.16.0-python3_6/lib/dns/rdtypes/ANY >copying dns/rdtypes/ANY/GPOS.py -> /var/tmp/portage/dev-python/dnspython-1.16.0-r1/work/dnspython-1.16.0-python3_6/lib/dns/rdtypes/ANY >copying dns/rdtypes/ANY/TXT.py -> /var/tmp/portage/dev-python/dnspython-1.16.0-r1/work/dnspython-1.16.0-python3_6/lib/dns/rdtypes/ANY >creating /var/tmp/portage/dev-python/dnspython-1.16.0-r1/work/dnspython-1.16.0-python3_6/lib/dns/rdtypes/CH >copying dns/rdtypes/CH/__init__.py -> /var/tmp/portage/dev-python/dnspython-1.16.0-r1/work/dnspython-1.16.0-python3_6/lib/dns/rdtypes/CH >copying dns/rdtypes/CH/A.py -> /var/tmp/portage/dev-python/dnspython-1.16.0-r1/work/dnspython-1.16.0-python3_6/lib/dns/rdtypes/CH >copying dns/py.typed -> /var/tmp/portage/dev-python/dnspython-1.16.0-r1/work/dnspython-1.16.0-python3_6/lib/dns >warning: build_py: byte-compiling is disabled, skipping. > >>>> Source compiled. >>>> Test phase: dev-python/dnspython-1.16.0-r1 > * python2_7: running distutils-r1_run_phase python_test > * Unable to trace static ELF: /sbin/ldconfig: /sbin/ldconfig -p >test_name (unittest.loader.ModuleImportFailure) ... ERROR >testECSOption (test_edns.OptionTestCase) ... ok >testECSOption_from_wire (test_edns.OptionTestCase) ... ok >testECSOption_prefix_length (test_edns.OptionTestCase) ... ok >testECSOption_v6 (test_edns.OptionTestCase) ... ok >testGenericOption (test_edns.OptionTestCase) ... ok >test_EDNSVersionCoherence (test_message.MessageTestCase) ... ok >test_EDNS_from_wire1 (test_message.MessageTestCase) ... ok >test_EDNS_from_wire2 (test_message.MessageTestCase) ... ok >test_EDNS_to_wire1 (test_message.MessageTestCase) ... ok >test_EDNS_to_wire2 (test_message.MessageTestCase) ... ok >test_ExtendedRcodeSetting (test_message.MessageTestCase) ... ok >test_FindRRset (test_message.MessageTestCase) ... ok >test_RespondingToResponse (test_message.MessageTestCase) ... ok >test_SettingEDNSFlagsImpliesEDNS (test_message.MessageTestCase) ... ok >test_SettingEDNSPayloadImpliesEDNS (test_message.MessageTestCase) ... ok >test_SettingEDNSRequestPayloadImpliesEDNS (test_message.MessageTestCase) ... ok >test_SettingNoEDNSOptionsImpliesNoEDNS (test_message.MessageTestCase) ... ok >test_SettingOptionsImpliesEDNS (test_message.MessageTestCase) ... ok >test_ShortHeader (test_message.MessageTestCase) ... ok >test_TooBig (test_message.MessageTestCase) ... ok >test_TrailingJunk (test_message.MessageTestCase) ... ok >test_answer1 (test_message.MessageTestCase) ... ok >test_comparison_eq1 (test_message.MessageTestCase) ... ok >test_comparison_ne1 (test_message.MessageTestCase) ... ok >test_comparison_ne2 (test_message.MessageTestCase) ... ok >test_comparison_ne3 (test_message.MessageTestCase) ... ok >testFromText (test_generate.GenerateTestCase) ... ok >testFromText1 (test_generate.GenerateTestCase) ... ok >testGenerate1 (test_generate.GenerateTestCase) ... ok >testGenerate2 (test_generate.GenerateTestCase) ... ok >testGenerate3 (test_generate.GenerateTestCase) ... ok >testGenerate4 (test_generate.GenerateTestCase) ... ok >testGenerate6 (test_generate.GenerateTestCase) ... ok >testGenerate7 (test_generate.GenerateTestCase) ... ok >testIterateAllRdatas2 (test_generate.GenerateTestCase) ... ok >testIterateAllRdatas3 (test_generate.GenerateTestCase) ... ok >test_zone (unittest.loader.ModuleImportFailure) ... ERROR >testFromTextDelim (test_rdtypeanyeui.RdtypeAnyEUI48TestCase) >Invalid delimiter. ... ok >testFromTextExtraDash (test_rdtypeanyeui.RdtypeAnyEUI48TestCase) >Extra dash instead of hex digit. ... ok >testFromTextInvalidHex (test_rdtypeanyeui.RdtypeAnyEUI48TestCase) >Invalid hexadecimal input. ... ok >testFromTextLength (test_rdtypeanyeui.RdtypeAnyEUI48TestCase) >Invalid input length. ... ok >testFromTextMultipleTokens (test_rdtypeanyeui.RdtypeAnyEUI48TestCase) >Invalid input divided to multiple tokens. ... ok >testFromTextOk (test_rdtypeanyeui.RdtypeAnyEUI48TestCase) >Valid text input. ... ok >testFromWireLength (test_rdtypeanyeui.RdtypeAnyEUI48TestCase) >Valid wire format. ... ok >testFromWireOk (test_rdtypeanyeui.RdtypeAnyEUI48TestCase) >Valid wire format. ... ok >testInstLength (test_rdtypeanyeui.RdtypeAnyEUI48TestCase) >Incorrect input length. ... ok >testInstOk (test_rdtypeanyeui.RdtypeAnyEUI48TestCase) >Valid binary input. ... ok >testToTextOk (test_rdtypeanyeui.RdtypeAnyEUI48TestCase) >Valid text output. ... ok >testToWire (test_rdtypeanyeui.RdtypeAnyEUI48TestCase) >Valid wire format. ... ok >testFromTextDelim (test_rdtypeanyeui.RdtypeAnyEUI64TestCase) >Invalid delimiter. ... ok >testFromTextExtraDash (test_rdtypeanyeui.RdtypeAnyEUI64TestCase) >Extra dash instead of hex digit. ... ok >testFromTextInvalidHex (test_rdtypeanyeui.RdtypeAnyEUI64TestCase) >Invalid hexadecimal input. ... ok >testFromTextLength (test_rdtypeanyeui.RdtypeAnyEUI64TestCase) >Invalid input length. ... ok >testFromTextMultipleTokens (test_rdtypeanyeui.RdtypeAnyEUI64TestCase) >Invalid input divided to multiple tokens. ... ok >testFromTextOk (test_rdtypeanyeui.RdtypeAnyEUI64TestCase) >Valid text input. ... ok >testFromWireLength (test_rdtypeanyeui.RdtypeAnyEUI64TestCase) >Valid wire format. ... ok >testFromWireOk (test_rdtypeanyeui.RdtypeAnyEUI64TestCase) >Valid wire format. ... ok >testInstLength (test_rdtypeanyeui.RdtypeAnyEUI64TestCase) >Incorrect input length. ... ok >testInstOk (test_rdtypeanyeui.RdtypeAnyEUI64TestCase) >Valid binary input. ... ok >testToTextOk (test_rdtypeanyeui.RdtypeAnyEUI64TestCase) >Valid text output. ... ok >testToWire (test_rdtypeanyeui.RdtypeAnyEUI64TestCase) >Valid wire format. ... ok >testCacheCleaning (test_resolver.BaseResolverTests) ... ok >testCacheExpiration (test_resolver.BaseResolverTests) ... ok >testEmptyAnswerSection (test_resolver.BaseResolverTests) ... ok >testIndexErrorOnEmptyRRsetAccess (test_resolver.BaseResolverTests) ... ok >testIndexErrorOnEmptyRRsetDelete (test_resolver.BaseResolverTests) ... ok >testLRUDoesLRU (test_resolver.BaseResolverTests) ... ok >testLRUExpiration (test_resolver.BaseResolverTests) ... ok >testLRUReplace (test_resolver.BaseResolverTests) ... ok >testRead (test_resolver.BaseResolverTests) ... ok >testZoneForName1 (test_resolver.BaseResolverTests) ... skipped 'Internet not reachable' >testZoneForName2 (test_resolver.BaseResolverTests) ... skipped 'Internet not reachable' >testZoneForName3 (test_resolver.BaseResolverTests) ... skipped 'Internet not reachable' >testZoneForName4 (test_resolver.BaseResolverTests) ... ok >test_nxdomain_canonical_name (test_resolver.NXDOMAINExceptionTestCase) ... ok >test_nxdomain_compatible (test_resolver.NXDOMAINExceptionTestCase) ... ok >test_nxdomain_merge (test_resolver.NXDOMAINExceptionTestCase) ... ok >testCacheCleaning (test_resolver.PollResolverTestCase) ... ok >testCacheExpiration (test_resolver.PollResolverTestCase) ... ok >testEmptyAnswerSection (test_resolver.PollResolverTestCase) ... ok >testIndexErrorOnEmptyRRsetAccess (test_resolver.PollResolverTestCase) ... ok >testIndexErrorOnEmptyRRsetDelete (test_resolver.PollResolverTestCase) ... ok >testLRUDoesLRU (test_resolver.PollResolverTestCase) ... ok >testLRUExpiration (test_resolver.PollResolverTestCase) ... ok >testLRUReplace (test_resolver.PollResolverTestCase) ... ok >testRead (test_resolver.PollResolverTestCase) ... ok >testZoneForName1 (test_resolver.PollResolverTestCase) ... skipped 'Internet not reachable' >testZoneForName2 (test_resolver.PollResolverTestCase) ... skipped 'Internet not reachable' >testZoneForName3 (test_resolver.PollResolverTestCase) ... skipped 'Internet not reachable' >testZoneForName4 (test_resolver.PollResolverTestCase) ... ok >testCacheCleaning (test_resolver.SelectResolverTestCase) ... ok >testCacheExpiration (test_resolver.SelectResolverTestCase) ... ok >testEmptyAnswerSection (test_resolver.SelectResolverTestCase) ... ok >testIndexErrorOnEmptyRRsetAccess (test_resolver.SelectResolverTestCase) ... ok >testIndexErrorOnEmptyRRsetDelete (test_resolver.SelectResolverTestCase) ... ok >testLRUDoesLRU (test_resolver.SelectResolverTestCase) ... ok >testLRUExpiration (test_resolver.SelectResolverTestCase) ... ok >testLRUReplace (test_resolver.SelectResolverTestCase) ... ok >testRead (test_resolver.SelectResolverTestCase) ... ok >testZoneForName1 (test_resolver.SelectResolverTestCase) ... skipped 'Internet not reachable' >testZoneForName2 (test_resolver.SelectResolverTestCase) ... skipped 'Internet not reachable' >testZoneForName3 (test_resolver.SelectResolverTestCase) ... skipped 'Internet not reachable' >testZoneForName4 (test_resolver.SelectResolverTestCase) ... ok >testComment1 (test_tokenizer.TokenizerTestCase) ... ok >testComment2 (test_tokenizer.TokenizerTestCase) ... ok >testComment3 (test_tokenizer.TokenizerTestCase) ... ok >testEOL (test_tokenizer.TokenizerTestCase) ... ok >testEmpty1 (test_tokenizer.TokenizerTestCase) ... ok >testEmpty2 (test_tokenizer.TokenizerTestCase) ... ok >testEscapedDelimiter1 (test_tokenizer.TokenizerTestCase) ... ok >testEscapedDelimiter1u (test_tokenizer.TokenizerTestCase) ... ok >testEscapedDelimiter2 (test_tokenizer.TokenizerTestCase) ... ok >testEscapedDelimiter2u (test_tokenizer.TokenizerTestCase) ... ok >testEscapedDelimiter3 (test_tokenizer.TokenizerTestCase) ... ok >testEscapedDelimiter3u (test_tokenizer.TokenizerTestCase) ... ok >testGetEOL1 (test_tokenizer.TokenizerTestCase) ... ok >testGetEOL2 (test_tokenizer.TokenizerTestCase) ... ok >testMultiline1 (test_tokenizer.TokenizerTestCase) ... ok >testMultiline2 (test_tokenizer.TokenizerTestCase) ... ok >testMultiline3 (test_tokenizer.TokenizerTestCase) ... ok >testMultiline4 (test_tokenizer.TokenizerTestCase) ... ok >testQuotedString1 (test_tokenizer.TokenizerTestCase) ... ok >testQuotedString2 (test_tokenizer.TokenizerTestCase) ... ok >testQuotedString3 (test_tokenizer.TokenizerTestCase) ... ok >testQuotedString4 (test_tokenizer.TokenizerTestCase) ... ok >testQuotedString5 (test_tokenizer.TokenizerTestCase) ... ok >testQuotedString6 (test_tokenizer.TokenizerTestCase) ... ok >testQuotedString7 (test_tokenizer.TokenizerTestCase) ... ok >testStr (test_tokenizer.TokenizerTestCase) ... ok >testUnget1 (test_tokenizer.TokenizerTestCase) ... ok >testUnget2 (test_tokenizer.TokenizerTestCase) ... ok >testUnicode (test_tokenizer.TokenizerTestCase) ... ok >testWS1 (test_tokenizer.TokenizerTestCase) ... ok >testWS2 (test_tokenizer.TokenizerTestCase) ... ok >testEqual1 (test_rdtypeanyloc.RdtypeAnyLocTestCase) >Test default values for size, horizontal and vertical precision. ... ok >testEqual2 (test_rdtypeanyloc.RdtypeAnyLocTestCase) >Test default values for size, horizontal and vertical precision. ... ok >testEqual3 (test_rdtypeanyloc.RdtypeAnyLocTestCase) >Test size, horizontal and vertical precision parsers: 100 cm == 1 m. ... ok >testEqual4 (test_rdtypeanyloc.RdtypeAnyLocTestCase) >Test size, horizontal and vertical precision parsers without unit. ... ok >test_class_bytext1 (test_rdtypeandclass.RdTypeAndClassTestCase) ... ok >test_class_bytext2 (test_rdtypeandclass.RdTypeAndClassTestCase) ... ok >test_class_bytext_bounds1 (test_rdtypeandclass.RdTypeAndClassTestCase) ... ok >test_class_bytext_bounds2 (test_rdtypeandclass.RdTypeAndClassTestCase) ... ok >test_class_bytext_unknown (test_rdtypeandclass.RdTypeAndClassTestCase) ... ok >test_class_meta1 (test_rdtypeandclass.RdTypeAndClassTestCase) ... ok >test_class_meta2 (test_rdtypeandclass.RdTypeAndClassTestCase) ... ok >test_class_totext1 (test_rdtypeandclass.RdTypeAndClassTestCase) ... ok >test_class_totext2 (test_rdtypeandclass.RdTypeAndClassTestCase) ... ok >test_class_totext_bounds1 (test_rdtypeandclass.RdTypeAndClassTestCase) ... ok >test_class_totext_bounds2 (test_rdtypeandclass.RdTypeAndClassTestCase) ... ok >test_type_bytext1 (test_rdtypeandclass.RdTypeAndClassTestCase) ... ok >test_type_bytext2 (test_rdtypeandclass.RdTypeAndClassTestCase) ... ok >test_type_bytext_bounds1 (test_rdtypeandclass.RdTypeAndClassTestCase) ... ok >test_type_bytext_bounds2 (test_rdtypeandclass.RdTypeAndClassTestCase) ... ok >test_type_bytext_unknown (test_rdtypeandclass.RdTypeAndClassTestCase) ... ok >test_type_meta1 (test_rdtypeandclass.RdTypeAndClassTestCase) ... ok >test_type_meta2 (test_rdtypeandclass.RdTypeAndClassTestCase) ... ok >test_type_meta3 (test_rdtypeandclass.RdTypeAndClassTestCase) ... ok >test_type_singleton1 (test_rdtypeandclass.RdTypeAndClassTestCase) ... ok >test_type_singleton2 (test_rdtypeandclass.RdTypeAndClassTestCase) ... ok >test_type_totext1 (test_rdtypeandclass.RdTypeAndClassTestCase) ... ok >test_type_totext2 (test_rdtypeandclass.RdTypeAndClassTestCase) ... ok >test_type_totext_bounds1 (test_rdtypeandclass.RdTypeAndClassTestCase) ... ok >test_type_totext_bounds2 (test_rdtypeandclass.RdTypeAndClassTestCase) ... ok >testEmptySlice (test_wiredata.WireDataSlicingTestCase) >Test empty slice ... ok >testGetOne (test_wiredata.WireDataSlicingTestCase) >Get data one by one item ... ok >testGetOneOutOfLowerBorder (test_wiredata.WireDataSlicingTestCase) >Get item outside of range ... ok >testGetOneOutOfUpperBorder (test_wiredata.WireDataSlicingTestCase) >Get item outside of range ... ok >testSliceAll (test_wiredata.WireDataSlicingTestCase) >Get all data ... ok >testSliceAllExplicitlyDefined (test_wiredata.WireDataSlicingTestCase) >Get all data ... ok >testSliceBothOutOfLowerBorder (test_wiredata.WireDataSlicingTestCase) >Get data from out of lower border ... ok >testSliceBothOutOfUpperBorder (test_wiredata.WireDataSlicingTestCase) >Get data from out of lower border ... ok >testSliceLowerHalf (test_wiredata.WireDataSlicingTestCase) >Get lower half of data ... ok >testSliceLowerHalfWithNegativeIndex (test_wiredata.WireDataSlicingTestCase) >Get lower half of data ... ok >testSliceMiddle (test_wiredata.WireDataSlicingTestCase) >Get data from middle ... ok >testSliceMiddleWithMixedIndex (test_wiredata.WireDataSlicingTestCase) >Get data from middle ... ok >testSliceMiddleWithNegativeIndex (test_wiredata.WireDataSlicingTestCase) >Get data from middle ... ok >testSliceStartOutOfLowerBorder (test_wiredata.WireDataSlicingTestCase) >Get data from out of lower border ... ok >testSliceStartOutOfUpperBorder (test_wiredata.WireDataSlicingTestCase) >Get data from out of upper border ... ok >testSliceStopOutOfLowerBorder (test_wiredata.WireDataSlicingTestCase) >Get data from out of lower border ... ok >testSliceStopOutOfUpperBorder (test_wiredata.WireDataSlicingTestCase) >Get data from out of upper border ... ok >testSliceUpperHalf (test_wiredata.WireDataSlicingTestCase) >Get upper half of data ... ok >test_CAA_from_wire (test_bugs.BugsTestCase) ... ok >test_SOA_BIND8_TTL (test_bugs.BugsTestCase) ... ok >test_TTL_bounds_check (test_bugs.BugsTestCase) ... ok >test_TXT_conversions (test_bugs.BugsTestCase) ... ok >test_empty_NSEC3_window (test_bugs.BugsTestCase) ... ok >test_float_LOC (test_bugs.BugsTestCase) ... ok >test_trailing_zero_APL (test_bugs.BugsTestCase) ... ok >test_zero_size_APL (test_bugs.BugsTestCase) ... ok >test_rdtypeanydnskey (unittest.loader.ModuleImportFailure) ... ERROR >testAbsoluteDSABad (test_dnssec.DNSSECValidatorTestCase) ... ok >testAbsoluteDSAGood (test_dnssec.DNSSECValidatorTestCase) ... ok >testAbsoluteECDSA256Bad (test_dnssec.DNSSECValidatorTestCase) ... ok >testAbsoluteECDSA256Good (test_dnssec.DNSSECValidatorTestCase) ... ok >testAbsoluteECDSA384Bad (test_dnssec.DNSSECValidatorTestCase) ... ok >testAbsoluteECDSA384Good (test_dnssec.DNSSECValidatorTestCase) ... ok >testAbsoluteRSABad (test_dnssec.DNSSECValidatorTestCase) ... ok >testAbsoluteRSAGood (test_dnssec.DNSSECValidatorTestCase) ... ok >testDuplicateKeytag (test_dnssec.DNSSECValidatorTestCase) ... ok >testMakeExampleSHA1DS (test_dnssec.DNSSECValidatorTestCase) ... ok >testMakeExampleSHA256DS (test_dnssec.DNSSECValidatorTestCase) ... ok >testMakeSHA256DS (test_dnssec.DNSSECValidatorTestCase) ... ok >testRelativeRSABad (test_dnssec.DNSSECValidatorTestCase) ... ok >testRelativeRSAGood (test_dnssec.DNSSECValidatorTestCase) ... ok >testFailFromText1 (test_grange.GRangeTestCase) ... ok >testFailFromText2 (test_grange.GRangeTestCase) ... ok >testFailFromText3 (test_grange.GRangeTestCase) ... ok >testFromText1 (test_grange.GRangeTestCase) ... ok >testFromText2 (test_grange.GRangeTestCase) ... ok >testFromText3 (test_grange.GRangeTestCase) ... ok >testFromText4 (test_grange.GRangeTestCase) ... ok >testFromText5 (test_grange.GRangeTestCase) ... ok >testFromText6 (test_grange.GRangeTestCase) ... ok >testEqual1 (test_rrset.RRsetTestCase) ... ok >testEqual2 (test_rrset.RRsetTestCase) ... ok >testNotEqual1 (test_rrset.RRsetTestCase) ... ok >testNotEqual2 (test_rrset.RRsetTestCase) ... ok >testNotEqual3 (test_rrset.RRsetTestCase) ... ok >testNotEqual4 (test_rrset.RRsetTestCase) ... ok >testDelitem (test_set.SimpleSetTestCase) ... ok >testDelslice (test_set.SimpleSetTestCase) ... ok >testDifference1 (test_set.SimpleSetTestCase) ... ok >testDifference2 (test_set.SimpleSetTestCase) ... ok >testDifference3 (test_set.SimpleSetTestCase) ... ok >testDifference4 (test_set.SimpleSetTestCase) ... ok >testGetitem (test_set.SimpleSetTestCase) ... ok >testGetslice (test_set.SimpleSetTestCase) ... ok >testIntersection1 (test_set.SimpleSetTestCase) ... ok >testIntersection2 (test_set.SimpleSetTestCase) ... ok >testIntersection3 (test_set.SimpleSetTestCase) ... ok >testIntersection4 (test_set.SimpleSetTestCase) ... ok >testLen1 (test_set.SimpleSetTestCase) ... ok >testLen2 (test_set.SimpleSetTestCase) ... ok >testLen3 (test_set.SimpleSetTestCase) ... ok >testSubset1 (test_set.SimpleSetTestCase) ... ok >testSubset2 (test_set.SimpleSetTestCase) ... ok >testSubset3 (test_set.SimpleSetTestCase) ... ok >testSubset4 (test_set.SimpleSetTestCase) ... ok >testSubset5 (test_set.SimpleSetTestCase) ... ok >testSubset6 (test_set.SimpleSetTestCase) ... ok >testSuperset1 (test_set.SimpleSetTestCase) ... ok >testSuperset2 (test_set.SimpleSetTestCase) ... ok >testSuperset3 (test_set.SimpleSetTestCase) ... ok >testSuperset4 (test_set.SimpleSetTestCase) ... ok >testSuperset5 (test_set.SimpleSetTestCase) ... ok >testSuperset6 (test_set.SimpleSetTestCase) ... ok >testUnion1 (test_set.SimpleSetTestCase) ... ok >testUnion2 (test_set.SimpleSetTestCase) ... ok >testUnion3 (test_set.SimpleSetTestCase) ... ok >testUpdate1 (test_set.SimpleSetTestCase) ... ok >testUpdate2 (test_set.SimpleSetTestCase) ... ok >test_flags1 (test_flags.FlagsTestCase) ... ok >test_flags2 (test_flags.FlagsTestCase) ... ok >test_rcode1 (test_flags.FlagsTestCase) ... ok >test_rcode2 (test_flags.FlagsTestCase) ... ok >test_rcode3 (test_flags.FlagsTestCase) ... ok >test_rcode4 (test_flags.FlagsTestCase) ... ok >test_rcode6 (test_flags.FlagsTestCase) ... ok >test_rcode7 (test_flags.FlagsTestCase) ... ok >test_rcode8 (test_flags.FlagsTestCase) ... ok >testDepth (test_namedict.NameTestCase) ... ok >testLookup1 (test_namedict.NameTestCase) ... ok >testLookup2 (test_namedict.NameTestCase) ... ok >testLookup3 (test_namedict.NameTestCase) ... ok >testLookup4 (test_namedict.NameTestCase) ... ok >testLookup5 (test_namedict.NameTestCase) ... ok >testLookup6 (test_namedict.NameTestCase) ... ok >testLookup7 (test_namedict.NameTestCase) ... ok >testLookup8 (test_namedict.NameTestCase) ... ok >testRelDepth (test_namedict.NameTestCase) ... ok >testRelLookup1 (test_namedict.NameTestCase) ... ok >testRelLookup2 (test_namedict.NameTestCase) ... ok >testRelLookup3 (test_namedict.NameTestCase) ... ok >testRelLookup4 (test_namedict.NameTestCase) ... ok >testRelLookup7 (test_namedict.NameTestCase) ... ok >test_NSEC3_bitmap (test_nsec3.NSEC3TestCase) ... ok >test_from_text1 (test_update.UpdateTestCase) ... ok >test_to_wire1 (test_update.UpdateTestCase) ... ok >test_to_wire2 (test_update.UpdateTestCase) ... ok >test_to_wire3 (test_update.UpdateTestCase) ... ok >test_custom_message (test_exceptions.ExceptionTestCase) ... ok >test_formatted_error (test_exceptions.ExceptionTestCase) >Exceptions with explicit format has to respect it. ... ok >test_implicit_message (test_exceptions.ExceptionTestCase) ... ok >test_kwargs_only (test_exceptions.ExceptionTestCase) >Kwargs cannot be combined with args. ... ok >test_kwargs_unsupported (test_exceptions.ExceptionTestCase) >Only supported kwargs are accepted. ... ok >test_module_registration (test_rdata.RdataTestCase) ... ok >test_module_reregistration (test_rdata.RdataTestCase) ... ok >test_str (test_rdata.RdataTestCase) ... ok >test_unicode (test_rdata.RdataTestCase) ... ok >test_aton1 (test_ntoaaton.NtoAAtoNTestCase) ... ok >test_aton2 (test_ntoaaton.NtoAAtoNTestCase) ... ok >test_aton3 (test_ntoaaton.NtoAAtoNTestCase) ... ok >test_aton4 (test_ntoaaton.NtoAAtoNTestCase) ... ok >test_aton5 (test_ntoaaton.NtoAAtoNTestCase) ... ok >test_aton6 (test_ntoaaton.NtoAAtoNTestCase) ... ok >test_aton7 (test_ntoaaton.NtoAAtoNTestCase) ... ok >test_aton8 (test_ntoaaton.NtoAAtoNTestCase) ... ok >test_aton9 (test_ntoaaton.NtoAAtoNTestCase) ... ok >test_bad_aton1 (test_ntoaaton.NtoAAtoNTestCase) ... ok >test_bad_aton2 (test_ntoaaton.NtoAAtoNTestCase) ... ok >test_bad_aton3 (test_ntoaaton.NtoAAtoNTestCase) ... ok >test_bad_ntoa1 (test_ntoaaton.NtoAAtoNTestCase) ... ok >test_bad_ntoa2 (test_ntoaaton.NtoAAtoNTestCase) ... ok >test_bad_v4_aton (test_ntoaaton.NtoAAtoNTestCase) ... ok >test_bad_v6_aton (test_ntoaaton.NtoAAtoNTestCase) ... ok >test_good_v4_aton (test_ntoaaton.NtoAAtoNTestCase) ... ok >test_is_mapped (test_ntoaaton.NtoAAtoNTestCase) ... ok >test_is_multicast (test_ntoaaton.NtoAAtoNTestCase) ... ok >test_ntoa1 (test_ntoaaton.NtoAAtoNTestCase) ... ok >test_ntoa10 (test_ntoaaton.NtoAAtoNTestCase) ... ok >test_ntoa11 (test_ntoaaton.NtoAAtoNTestCase) ... ok >test_ntoa12 (test_ntoaaton.NtoAAtoNTestCase) ... ok >test_ntoa13 (test_ntoaaton.NtoAAtoNTestCase) ... ok >test_ntoa14 (test_ntoaaton.NtoAAtoNTestCase) ... ok >test_ntoa2 (test_ntoaaton.NtoAAtoNTestCase) ... ok >test_ntoa3 (test_ntoaaton.NtoAAtoNTestCase) ... ok >test_ntoa4 (test_ntoaaton.NtoAAtoNTestCase) ... ok >test_ntoa5 (test_ntoaaton.NtoAAtoNTestCase) ... ok >test_ntoa6 (test_ntoaaton.NtoAAtoNTestCase) ... ok >test_ntoa7 (test_ntoaaton.NtoAAtoNTestCase) ... ok >test_ntoa8 (test_ntoaaton.NtoAAtoNTestCase) ... ok >test_ntoa9 (test_ntoaaton.NtoAAtoNTestCase) ... ok >test_rfc5952_section_4_2_2 (test_ntoaaton.NtoAAtoNTestCase) ... ok > >====================================================================== >ERROR: test_name (unittest.loader.ModuleImportFailure) >---------------------------------------------------------------------- >ImportError: Failed to import test module: test_name >Traceback (most recent call last): > File "/usr/lib64/python2.7/unittest/loader.py", line 254, in _find_tests > module = self._get_module_from_name(name) > File "/usr/lib64/python2.7/unittest/loader.py", line 232, in _get_module_from_name > __import__(name) > File "/var/tmp/portage/dev-python/dnspython-1.16.0-r1/work/dnspython-1.16.0/tests/test_name.py", line 21, in <module> > from typing import Dict # pylint: disable=unused-import >ImportError: No module named typing > > >====================================================================== >ERROR: test_zone (unittest.loader.ModuleImportFailure) >---------------------------------------------------------------------- >ImportError: Failed to import test module: test_zone >Traceback (most recent call last): > File "/usr/lib64/python2.7/unittest/loader.py", line 254, in _find_tests > module = self._get_module_from_name(name) > File "/usr/lib64/python2.7/unittest/loader.py", line 232, in _get_module_from_name > __import__(name) > File "/var/tmp/portage/dev-python/dnspython-1.16.0-r1/work/dnspython-1.16.0/tests/test_zone.py", line 22, in <module> > from typing import cast >ImportError: No module named typing > > >====================================================================== >ERROR: test_rdtypeanydnskey (unittest.loader.ModuleImportFailure) >---------------------------------------------------------------------- >ImportError: Failed to import test module: test_rdtypeanydnskey >Traceback (most recent call last): > File "/usr/lib64/python2.7/unittest/loader.py", line 254, in _find_tests > module = self._get_module_from_name(name) > File "/usr/lib64/python2.7/unittest/loader.py", line 232, in _get_module_from_name > __import__(name) > File "/var/tmp/portage/dev-python/dnspython-1.16.0-r1/work/dnspython-1.16.0/tests/test_rdtypeanydnskey.py", line 22, in <module> > from typing import Set # pylint: disable=unused-import >ImportError: No module named typing > > >---------------------------------------------------------------------- >Ran 324 tests in 22.288s > >FAILED (errors=3, skipped=9) >256.1.1.1 >1.1.1 >1.1.1.1.1 >+1.1.1.1 >1.1.1.1+ >1..2.3.4 >.1.2.3.4 >1.2.3.4. > * ERROR: dev-python/dnspython-1.16.0-r1::gentoo failed (test phase): > * tests failed under python2.7 > * > * Call stack: > * ebuild.sh, line 125: Called src_test > * environment, line 2896: Called distutils-r1_src_test > * environment, line 1232: Called _distutils-r1_run_foreach_impl 'python_test' > * environment, line 429: Called python_foreach_impl 'distutils-r1_run_phase' 'python_test' > * environment, line 2501: Called multibuild_foreach_variant '_python_multibuild_wrapper' 'distutils-r1_run_phase' 'python_test' > * environment, line 2014: Called _multibuild_run '_python_multibuild_wrapper' 'distutils-r1_run_phase' 'python_test' > * environment, line 2012: Called _python_multibuild_wrapper 'distutils-r1_run_phase' 'python_test' > * environment, line 820: Called distutils-r1_run_phase 'python_test' > * environment, line 1169: Called python_test > * environment, line 2855: Called die > * The specific snippet of code: > * "${EPYTHON}" utest.py || die "tests failed under ${EPYTHON}"; > * > * If you need support, post the output of `emerge --info '=dev-python/dnspython-1.16.0-r1::gentoo'`, > * the complete build log and the output of `emerge -pqv '=dev-python/dnspython-1.16.0-r1::gentoo'`. > * The complete build log is located at '/var/log/emerge-log/build/dev-python/dnspython-1.16.0-r1:20200426-170542.log'. > * For convenience, a symlink to the build log is located at '/var/tmp/portage/dev-python/dnspython-1.16.0-r1/temp/build.log'. > * The ebuild environment file is located at '/var/tmp/portage/dev-python/dnspython-1.16.0-r1/temp/environment'. > * Working directory: '/var/tmp/portage/dev-python/dnspython-1.16.0-r1/work/dnspython-1.16.0/tests' > * S: '/var/tmp/portage/dev-python/dnspython-1.16.0-r1/work/dnspython-1.16.0' > > > >emerge --info: >Portage 2.3.99 (python 3.6.10-final-0, default/linux/arm64/17.0, gcc-9.3.0, glibc-2.31-r2, 4.9.0-4-arm64 aarch64) >================================================================= >System uname: Linux-4.9.0-4-arm64-aarch64-with-gentoo-2.7 >KiB Mem: 131544964 total, 68383396 free >KiB Swap: 3321056 total, 2718188 free >Timestamp of repository gentoo: Sun, 26 Apr 2020 12:55:33 +0000 >sh bash 5.0_p17 >ld GNU ld (Gentoo 2.34 p1) 2.34.0 >app-shells/bash: 5.0_p17::gentoo >dev-lang/perl: 5.30.2::gentoo >dev-lang/python: 2.7.18::gentoo, 3.6.10-r2::gentoo, 3.8.2-r2::gentoo >sys-apps/baselayout: 2.7::gentoo >sys-apps/openrc: 0.42.1::gentoo >sys-apps/sandbox: 2.18::gentoo >sys-devel/autoconf: 2.69-r5::gentoo >sys-devel/automake: 1.16.2::gentoo >sys-devel/binutils: 2.34::gentoo >sys-devel/gcc: 9.3.0::gentoo >sys-devel/gcc-config: 2.2.1::gentoo >sys-devel/libtool: 2.4.6-r6::gentoo >sys-devel/make: 4.3::gentoo >sys-kernel/linux-headers: 5.6::gentoo (virtual/os-headers) >sys-libs/glibc: 2.31-r2::gentoo >Repositories: > >gentoo > location: /usr/portage > sync-type: rsync > sync-uri: rsync://rsync.gentoo.org/gentoo-portage > priority: -1000 > sync-rsync-verify-metamanifest: yes > sync-rsync-verify-max-age: 24 > sync-rsync-verify-jobs: 1 > sync-rsync-extra-opts: > >ACCEPT_KEYWORDS="arm64 ~arm64" >ACCEPT_LICENSE="*" >CBUILD="aarch64-unknown-linux-gnu" >CC="aarch64-unknown-linux-gnu-gcc" >CFLAGS="-O2 -pipe -march=native -g -ggdb -frecord-gcc-switches" >CHOST="aarch64-unknown-linux-gnu" >CONFIG_PROTECT="/etc /usr/share/gnupg/qualified.txt" >CONFIG_PROTECT_MASK="/etc/ca-certificates.conf /etc/env.d /etc/gconf /etc/gentoo-release /etc/revdep-rebuild /etc/sandbox.d /etc/terminfo" >CXX="aarch64-unknown-linux-gnu-g++" >CXXFLAGS="-O2 -pipe -march=native -g -ggdb -frecord-gcc-switches" >DISTDIR="/usr/portage/distfiles" >EMERGE_DEFAULT_OPTS="--with-bdeps=y -1" >ENV_UNSET="DBUS_SESSION_BUS_ADDRESS DISPLAY GOBIN PERL5LIB PERL5OPT PERLPREFIX PERL_CORE PERL_MB_OPT PERL_MM_OPT XAUTHORITY XDG_CACHE_HOME XDG_CONFIG_HOME XDG_DATA_HOME XDG_RUNTIME_DIR" >FCFLAGS="-O2 -pipe -march=native -g -ggdb -frecord-gcc-switches" >FEATURES="assume-digests binpkg-docompress binpkg-dostrip binpkg-logs collision-protect config-protect-if-modified distlocks ebuild-locks fixlafiles ipc-sandbox merge-sync multilib-strict network-sandbox news parallel-fetch pid-sandbox preserve-libs protect-owned qa-unresolved-soname-deps sandbox sfperms sign split-log splitdebug strict unknown-features-warn unmerge-logs unmerge-orphans userfetch userpriv usersandbox usersync xattr" >FFLAGS="-O2 -pipe -march=native -g -ggdb -frecord-gcc-switches" >GENTOO_MIRRORS="http://distfiles.gentoo.org" >LANG="en_US.UTF-8" >LDFLAGS="-Wl,-O1 -Wl,--as-needed -Wl,--defsym=__gentoo_check_ldflags__=0" >MAKEOPTS="-j96" >PKGDIR="/usr/portage/packages" >PORTAGE_CONFIGROOT="/" >PORTAGE_RSYNC_OPTS="--recursive --links --safe-links --perms --times --omit-dir-times --compress --force --whole-file --delete --stats --human-readable --timeout=180 --exclude=/distfiles --exclude=/local --exclude=/packages --exclude=/.git" >PORTAGE_TMPDIR="/var/tmp" >USE="acl arm64 berkdb bzip2 cli crypt dri fortran gdbm iconv ipv6 libtirpc ncurses nls nptl openmp pam pcre readline seccomp split-usr ssl tcpd unicode xattr zlib" ADA_TARGET="gnat_2018" APACHE2_MODULES="authn_core authz_core socache_shmcb unixd actions alias auth_basic authn_alias authn_anon authn_dbm authn_default authn_file authz_dbm authz_default authz_groupfile authz_host authz_owner authz_user autoindex cache cgi cgid dav dav_fs dav_lock deflate dir disk_cache env expires ext_filter file_cache filter headers include info log_config logio mem_cache mime mime_magic negotiation rewrite setenvif speling status unique_id userdir usertrack vhost_alias" CALLIGRA_FEATURES="karbon sheets words" COLLECTD_PLUGINS="df interface irq load memory rrdtool swap syslog" CPU_FLAGS_ARM="edsp thumb thumb2 v4 v5 v6 v7 v8 vfp vfp-d32 vfpv3 vfpv4" ELIBC="glibc" GPSD_PROTOCOLS="ashtech aivdm earthmate evermore fv18 garmin garmintxt gpsclock greis isync itrax mtk3301 nmea ntrip navcom oceanserver oldstyle oncore rtcm104v2 rtcm104v3 sirf skytraq superstar2 timing tsip tripmate tnt ublox ubx" INPUT_DEVICES="libinput keyboard mouse" KERNEL="linux" LCD_DEVICES="bayrad cfontz cfontz633 glk hd44780 lb216 lcdm001 mtxorb ncurses text" LIBREOFFICE_EXTENSIONS="presenter-console presenter-minimizer" OFFICE_IMPLEMENTATION="libreoffice" PHP_TARGETS="php7-2" POSTGRES_TARGETS="postgres10 postgres11" PYTHON_SINGLE_TARGET="python3_6" PYTHON_TARGETS="python2_7 python3_6" RUBY_TARGETS="ruby24 ruby25" USERLAND="GNU" VIDEO_CARDS="fbdev dummy v4l" XTABLES_ADDONS="quota2 psd pknock lscan length2 ipv4options ipset ipp2p iface geoip fuzzy condition tee tarpit sysrq steal rawnat logmark ipmark dhcpmac delude chaos account" >Unset: CPPFLAGS, CTARGET, INSTALL_MASK, LC_ALL, LINGUAS, PORTAGE_BINHOST, PORTAGE_BUNZIP2_COMMAND, PORTAGE_COMPRESS, PORTAGE_COMPRESS_FLAGS, PORTAGE_RSYNC_EXTRA_OPTS >
You cannot view the attachment while viewing its details because your browser does not support IFRAMEs.
View the attachment on a separate page
.
View Attachment As Raw
Actions:
View
Attachments on
bug 719702
: 634752