Go to:
Gentoo Home
Documentation
Forums
Lists
Bugs
Planet
Store
Wiki
Get Gentoo!
Gentoo's Bugzilla – Attachment 524982 Details for
Bug 651260
dev-util/statifier-1.7.4 : /.../stubs.h:7:11: fatal error: gnu/stubs-32.h: No such file or directory
Home
|
New
–
[Ex]
|
Browse
|
Search
|
Privacy Policy
|
[?]
|
Reports
|
Requests
|
Help
|
New Account
|
Log In
[x]
|
Forgot Password
Login:
[x]
dev-util:statifier-1.7.4:20180323-132049.log
dev-util:statifier-1.7.4:20180323-132049.log (text/plain), 2.65 KB, created by
Toralf Förster
on 2018-03-23 17:08:22 UTC
(
hide
)
Description:
dev-util:statifier-1.7.4:20180323-132049.log
Filename:
MIME Type:
Creator:
Toralf Förster
Created:
2018-03-23 17:08:22 UTC
Size:
2.65 KB
patch
obsolete
> * Package: dev-util/statifier-1.7.4 > * Repository: gentoo > * Maintainer: ck+gentoo@bl4ckb0x.de proxy-maint@gentoo.org > * USE: abi_x86_64 amd64 elibc_glibc kernel_linux userland_GNU > * FEATURES: network-sandbox preserve-libs sandbox userpriv usersandbox >>>> Unpacking source... >>>> Unpacking statifier-1.7.4.tar.gz to /var/tmp/portage/dev-util/statifier-1.7.4/work >>>> Source unpacked in /var/tmp/portage/dev-util/statifier-1.7.4/work >>>> Preparing source in /var/tmp/portage/dev-util/statifier-1.7.4/work/statifier-1.7.4 ... >>>> Source prepared. >>>> Configuring source in /var/tmp/portage/dev-util/statifier-1.7.4/work/statifier-1.7.4 ... >./configure --prefix=/usr --build=x86_64-pc-linux-gnu --host=x86_64-pc-linux-gnu --mandir=/usr/share/man --infodir=/usr/share/info --datadir=/usr/share --sysconfdir=/etc --localstatedir=/var/lib --libdir=/usr/lib64 >>>> Source configured. >>>> Compiling source in /var/tmp/portage/dev-util/statifier-1.7.4/work/statifier-1.7.4 ... >make -j 1 -j1 >/bin/sh ./configure >rm --force VERSION >echo "VERSION='1.7.4'" > VERSION || { rm --force VERSION; exit 1; } >make all-local-32 >ELF_CLASS=32 && mkdir --parents $ELF_CLASS && make ELF_CLASS=$ELF_CLASS all-local-internal >gcc -m32 -Icpus/i386 -O2 -pipe -march=native -Wl,-O1 -Wl,--as-needed -g elf_class.c -o 32/elf_class >In file included from /usr/include/features.h:452:0, > from /usr/include/bits/libc-header-start.h:33, > from /usr/include/stdio.h:27, > from elf_class.c:14: >/usr/include/gnu/stubs.h:7:11: fatal error: gnu/stubs-32.h: No such file or directory > # include <gnu/stubs-32.h> > ^~~~~~~~~~~~~~~~ >compilation terminated. >make[4]: *** [Makefile:173: 32/elf_class] Error 1 >make[3]: *** [Makefile:159: all-local-32] Error 2 >make[2]: *** [Makefile:155: all-local] Error 2 >make[1]: *** [../Makefile.include:88: all-recursive] Error 2 >make: *** [Makefile.include:88: all-recursive] Error 2 > * ERROR: dev-util/statifier-1.7.4::gentoo failed (compile phase): > * emake failed > * > * If you need support, post the output of `emerge --info '=dev-util/statifier-1.7.4::gentoo'`, > * the complete build log and the output of `emerge -pqv '=dev-util/statifier-1.7.4::gentoo'`. > * The complete build log is located at '/var/log/portage/dev-util:statifier-1.7.4:20180323-132049.log'. > * For convenience, a symlink to the build log is located at '/var/tmp/portage/dev-util/statifier-1.7.4/temp/build.log'. > * The ebuild environment file is located at '/var/tmp/portage/dev-util/statifier-1.7.4/temp/environment'. > * Working directory: '/var/tmp/portage/dev-util/statifier-1.7.4/work/statifier-1.7.4' > * S: '/var/tmp/portage/dev-util/statifier-1.7.4/work/statifier-1.7.4'
You cannot view the attachment while viewing its details because your browser does not support IFRAMEs.
View the attachment on a separate page
.
View Attachment As Raw
Actions:
View
Attachments on
bug 651260
:
524980
| 524982 |
524984
|
524986
|
524988
|
524990