Go to:
Gentoo Home
Documentation
Forums
Lists
Bugs
Planet
Store
Wiki
Get Gentoo!
Gentoo's Bugzilla – Attachment 510998 Details for
Bug 641742
net-voip/telepathy-haze-0.8.0-r2[test] fails: ImportError: No module named gobject
Home
|
New
–
[Ex]
|
Browse
|
Search
|
Privacy Policy
|
[?]
|
Reports
|
Requests
|
Help
|
New Account
|
Log In
[x]
|
Forgot Password
Login:
[x]
build.log
build.log (text/plain), 64.16 KB, created by
Thomas Deutschmann (RETIRED)
on 2017-12-19 17:43:38 UTC
(
hide
)
Description:
build.log
Filename:
MIME Type:
Creator:
Thomas Deutschmann (RETIRED)
Created:
2017-12-19 17:43:38 UTC
Size:
64.16 KB
patch
obsolete
> * Package: net-voip/telepathy-haze-0.8.0-r2 > * Repository: gentoo > * Maintainer: gnome@gentoo.org > * USE: abi_x86_32 elibc_glibc kernel_linux test userland_GNU x86 > * FEATURES: preserve-libs sandbox test userpriv usersandbox >>>> Unpacking source... >>>> Unpacking telepathy-haze-0.8.0.tar.gz to /var/tmp/portage/net-voip/telepathy-haze-0.8.0-r2/work >>>> Source unpacked in /var/tmp/portage/net-voip/telepathy-haze-0.8.0-r2/work >>>> Preparing source in /var/tmp/portage/net-voip/telepathy-haze-0.8.0-r2/work/telepathy-haze-0.8.0 ... > * Applying telepathy-haze-0.8.0-crash.patch ... > [ ok ] > * Applying telepathy-haze-0.8.0-pidgin-2.10.12-compat.patch ... > [ ok ] >>>> Source prepared. >>>> Configuring source in /var/tmp/portage/net-voip/telepathy-haze-0.8.0-r2/work/telepathy-haze-0.8.0 ... > * econf: updating telepathy-haze-0.8.0/build-aux/config.guess with /usr/share/gnuconfig/config.guess > * econf: updating telepathy-haze-0.8.0/build-aux/config.sub with /usr/share/gnuconfig/config.sub >./configure --prefix=/usr --build=i686-pc-linux-gnu --host=i686-pc-linux-gnu --mandir=/usr/share/man --infodir=/usr/share/info --datadir=/usr/share --sysconfdir=/etc --localstatedir=/var/lib --disable-dependency-tracking --disable-silent-rules --docdir=/usr/share/doc/telepathy-haze-0.8.0-r2 --htmldir=/usr/share/doc/telepathy-haze-0.8.0-r2/html --libdir=/usr/lib >checking for a BSD-compatible install... /usr/lib/portage/python3.5/ebuild-helpers/xattr/install -c >checking whether build environment is sane... yes >checking for a thread-safe mkdir -p... /bin/mkdir -p >checking for gawk... gawk >checking whether make sets $(MAKE)... yes >checking whether make supports nested variables... yes >checking for i686-pc-linux-gnu-gcc... i686-pc-linux-gnu-gcc >checking whether the C compiler works... yes >checking for C compiler default output file name... a.out >checking for suffix of executables... >checking whether we are cross compiling... no >checking for suffix of object files... o >checking whether we are using the GNU C compiler... yes >checking whether i686-pc-linux-gnu-gcc accepts -g... yes >checking for i686-pc-linux-gnu-gcc option to accept ISO C89... none needed >checking for style of include used by make... GNU >checking dependency style of i686-pc-linux-gnu-gcc... none >checking for i686-pc-linux-gnu-gcc option to accept ISO C99... none needed >checking for i686-pc-linux-gnu-gcc option to accept ISO Standard C... (cached) none needed >checking build system type... i686-pc-linux-gnu >checking host system type... i686-pc-linux-gnu >checking how to print strings... printf >checking for a sed that does not truncate output... /bin/sed >checking for grep that handles long lines and -e... /bin/grep >checking for egrep... /bin/grep -E >checking for fgrep... /bin/grep -F >checking for ld used by i686-pc-linux-gnu-gcc... /usr/i686-pc-linux-gnu/bin/ld >checking if the linker (/usr/i686-pc-linux-gnu/bin/ld) is GNU ld... yes >checking for BSD- or MS-compatible name lister (nm)... /usr/bin/nm -B >checking the name lister (/usr/bin/nm -B) interface... BSD nm >checking whether ln -s works... yes >checking the maximum length of command line arguments... 1572864 >checking whether the shell understands some XSI constructs... yes >checking whether the shell understands "+="... yes >checking how to convert i686-pc-linux-gnu file names to i686-pc-linux-gnu format... func_convert_file_noop >checking how to convert i686-pc-linux-gnu file names to toolchain format... func_convert_file_noop >checking for /usr/i686-pc-linux-gnu/bin/ld option to reload object files... -r >checking for i686-pc-linux-gnu-objdump... i686-pc-linux-gnu-objdump >checking how to recognize dependent libraries... pass_all >checking for i686-pc-linux-gnu-dlltool... no >checking for dlltool... no >checking how to associate runtime and link libraries... printf %s\n >checking for i686-pc-linux-gnu-ar... i686-pc-linux-gnu-ar >checking for archiver @FILE support... @ >checking for i686-pc-linux-gnu-strip... i686-pc-linux-gnu-strip >checking for i686-pc-linux-gnu-ranlib... i686-pc-linux-gnu-ranlib >checking command to parse /usr/bin/nm -B output from i686-pc-linux-gnu-gcc object... ok >checking for sysroot... no >checking for i686-pc-linux-gnu-mt... no >checking for mt... no >checking if : is a manifest tool... no >checking how to run the C preprocessor... i686-pc-linux-gnu-gcc -E >checking for ANSI C header files... yes >checking for sys/types.h... yes >checking for sys/stat.h... yes >checking for stdlib.h... yes >checking for string.h... yes >checking for memory.h... yes >checking for strings.h... yes >checking for inttypes.h... yes >checking for stdint.h... yes >checking for unistd.h... yes >checking for dlfcn.h... yes >checking for objdir... .libs >checking if i686-pc-linux-gnu-gcc supports -fno-rtti -fno-exceptions... no >checking for i686-pc-linux-gnu-gcc option to produce PIC... -fPIC -DPIC >checking if i686-pc-linux-gnu-gcc PIC flag -fPIC -DPIC works... yes >checking if i686-pc-linux-gnu-gcc static flag -static works... yes >checking if i686-pc-linux-gnu-gcc supports -c -o file.o... yes >checking if i686-pc-linux-gnu-gcc supports -c -o file.o... (cached) yes >checking whether the i686-pc-linux-gnu-gcc linker (/usr/i686-pc-linux-gnu/bin/ld) supports shared libraries... yes >checking whether -lc should be explicitly linked in... no >checking dynamic linker characteristics... GNU/Linux ld.so >checking how to hardcode library paths into programs... immediate >checking whether stripping libraries is possible... yes >checking if libtool supports shared libraries... yes >checking whether to build shared libraries... yes >checking whether to build static libraries... yes >checking whether linker supports -Wl,-O1... yes >checking to see if compiler understands ... yes >checking to see if compiler understands -Wall... yes >checking to see if compiler understands -Wextra... yes >checking to see if compiler understands -Wdeclaration-after-statement... yes >checking to see if compiler understands -Wshadow... yes >checking to see if compiler understands -Wstrict-prototypes... yes >checking to see if compiler understands -Wmissing-prototypes... yes >checking to see if compiler understands -Wsign-compare... yes >checking to see if compiler understands -Wnested-externs... yes >checking to see if compiler understands -Wpointer-arith... yes >checking to see if compiler understands -Wformat-security... yes >checking to see if compiler understands -Winit-self... yes >checking to see if compiler understands -Werror... yes >checking to see if compiler understands -Wno-missing-field-initializers... yes >checking to see if compiler understands -Wno-error=missing-field-initializers... yes >checking to see if compiler understands -Wno-unused-parameter... yes >checking to see if compiler understands -Wno-error=unused-parameter... yes >checking to see if compiler understands -Wno-deprecated-declarations... yes >checking to see if compiler understands -Wno-error=deprecated-declarations... yes >checking for libintl.h... yes >checking for i686-pc-linux-gnu-pkg-config... /usr/bin/i686-pc-linux-gnu-pkg-config >checking pkg-config is at least version 0.9.0... yes >checking for PURPLE... yes >checking for TP_GLIB... yes >checking for GLIB... yes >checking for DBUS_GLIB... yes >checking for purple_dbus_uninit in -lpurple... yes >checking for xsltproc... xsltproc >checking whether /usr/bin/python2.7 version >= 2.5... yes >checking for /usr/bin/python2.7 version... 2.7 >checking for /usr/bin/python2.7 platform... linux2 >checking for /usr/bin/python2.7 script directory... ${prefix}/lib/python2.7/site-packages >checking for /usr/bin/python2.7 extension module directory... ${exec_prefix}/lib/python2.7/site-packages >checking for Python with Twisted and XMPP protocol support... /usr/bin/python2.7 >configure: creating ./config.status >config.status: creating Makefile >config.status: creating src/Makefile >config.status: creating data/Makefile >config.status: creating m4/Makefile >config.status: creating tests/Makefile >config.status: creating tests/twisted/Makefile >config.status: creating tests/twisted/tools/Makefile >config.status: creating tools/Makefile >config.status: creating extensions/Makefile >config.status: creating config.h >config.status: executing depfiles commands >config.status: executing libtool commands >>>> Source configured. >>>> Compiling source in /var/tmp/portage/net-voip/telepathy-haze-0.8.0-r2/work/telepathy-haze-0.8.0 ... >make --jobs 5 --load-average 7.95 >make all-recursive >make[1]: Entering directory '/var/tmp/portage/net-voip/telepathy-haze-0.8.0-r2/work/telepathy-haze-0.8.0' >Making all in tools >make[2]: Entering directory '/var/tmp/portage/net-voip/telepathy-haze-0.8.0-r2/work/telepathy-haze-0.8.0/tools' >make[2]: Nothing to be done for 'all'. >make[2]: Leaving directory '/var/tmp/portage/net-voip/telepathy-haze-0.8.0-r2/work/telepathy-haze-0.8.0/tools' >Making all in extensions >make[2]: Entering directory '/var/tmp/portage/net-voip/telepathy-haze-0.8.0-r2/work/telepathy-haze-0.8.0/extensions' >xsltproc --nonet --novalid --xinclude ../tools/identity.xsl \ > all.xml > _gen/all.xml >/usr/bin/python2.7 ../tools/glib-signals-marshal-gen.py _gen/all.xml > _gen/signals-marshal.list >/usr/bin/python2.7 ../tools/glib-interfaces-gen.py \ > Haze _gen/interfaces-body.h _gen/interfaces.h _gen/all.xml >/usr/bin/python2.7 ../tools/glib-interfaces-gen.py \ > Haze _gen/interfaces-body.h _gen/interfaces.h _gen/all.xml >/usr/bin/python2.7 ../tools/glib-ginterface-gen.py \ > --filename=_gen/svc --signal-marshal-prefix=_haze_ext \ > --include='<telepathy-glib/dbus.h>' \ > --include='"_gen/signals-marshal.h"' \ > --allow-unstable \ > --not-implemented-func='tp_dbus_g_method_return_not_implemented' \ > _gen/all.xml Haze_Svc_ >/usr/bin/python2.7 ../tools/glib-ginterface-gen.py \ > --filename=_gen/svc --signal-marshal-prefix=_haze_ext \ > --include='<telepathy-glib/dbus.h>' \ > --include='"_gen/signals-marshal.h"' \ > --allow-unstable \ > --not-implemented-func='tp_dbus_g_method_return_not_implemented' \ > _gen/all.xml Haze_Svc_ >xsltproc --nonet --novalid \ > --param "allow-undefined-interfaces" "true()" \ > ../tools/doc-generator.xsl \ > _gen/all.xml > extensions.html >{ echo '#include "_gen/signals-marshal.h"' && \ >glib-genmarshal --body --prefix=_haze_ext_marshal _gen/signals-marshal.list ; } > _gen/signals-marshal.c >glib-genmarshal --header --prefix=_haze_ext_marshal _gen/signals-marshal.list > _gen/signals-marshal.h >/usr/bin/python2.7 ../tools/glib-gtypes-generator.py \ > _gen/all.xml _gen/gtypes Haze >/usr/bin/python2.7 ../tools/glib-gtypes-generator.py \ > _gen/all.xml _gen/gtypes Haze >/usr/bin/python2.7 ../tools/c-constants-gen.py Haze _gen/all.xml > _gen/enums.h >make all-am >make[3]: Entering directory '/var/tmp/portage/net-voip/telepathy-haze-0.8.0-r2/work/telepathy-haze-0.8.0/extensions' >/bin/sh ../libtool --tag=CC --mode=compile i686-pc-linux-gnu-gcc -DHAVE_CONFIG_H -I. -I.. -Wall -Wextra -Wdeclaration-after-statement -Wshadow -Wstrict-prototypes -Wmissing-prototypes -Wsign-compare -Wnested-externs -Wpointer-arith -Wformat-security -Winit-self -Wno-missing-field-initializers -Wno-unused-parameter -Wno-deprecated-declarations -I/usr/include/dbus-1.0 -I/usr/lib/dbus-1.0/include -I/usr/include/glib-2.0 -I/usr/lib/glib-2.0/include -pthread -I/usr/include/telepathy-1.0 -I/usr/include/dbus-1.0 -I/usr/lib/dbus-1.0/include -I/usr/include/glib-2.0 -I/usr/lib/glib-2.0/include -O2 -pipe -march=pentium4m -mtune=pentium4m -c -o extensions.lo extensions.c >libtool: compile: i686-pc-linux-gnu-gcc -DHAVE_CONFIG_H -I. -I.. -Wall -Wextra -Wdeclaration-after-statement -Wshadow -Wstrict-prototypes -Wmissing-prototypes -Wsign-compare -Wnested-externs -Wpointer-arith -Wformat-security -Winit-self -Wno-missing-field-initializers -Wno-unused-parameter -Wno-deprecated-declarations -I/usr/include/dbus-1.0 -I/usr/lib/dbus-1.0/include -I/usr/include/glib-2.0 -I/usr/lib/glib-2.0/include -pthread -I/usr/include/telepathy-1.0 -I/usr/include/dbus-1.0 -I/usr/lib/dbus-1.0/include -I/usr/include/glib-2.0 -I/usr/lib/glib-2.0/include -O2 -pipe -march=pentium4m -mtune=pentium4m -c extensions.c -fPIC -DPIC -o .libs/extensions.o >libtool: compile: i686-pc-linux-gnu-gcc -DHAVE_CONFIG_H -I. -I.. -Wall -Wextra -Wdeclaration-after-statement -Wshadow -Wstrict-prototypes -Wmissing-prototypes -Wsign-compare -Wnested-externs -Wpointer-arith -Wformat-security -Winit-self -Wno-missing-field-initializers -Wno-unused-parameter -Wno-deprecated-declarations -I/usr/include/dbus-1.0 -I/usr/lib/dbus-1.0/include -I/usr/include/glib-2.0 -I/usr/lib/glib-2.0/include -pthread -I/usr/include/telepathy-1.0 -I/usr/include/dbus-1.0 -I/usr/lib/dbus-1.0/include -I/usr/include/glib-2.0 -I/usr/lib/glib-2.0/include -O2 -pipe -march=pentium4m -mtune=pentium4m -c extensions.c -o extensions.o >/dev/null 2>&1 >/bin/sh ../libtool --tag=CC --mode=compile i686-pc-linux-gnu-gcc -DHAVE_CONFIG_H -I. -I.. -Wall -Wextra -Wdeclaration-after-statement -Wshadow -Wstrict-prototypes -Wmissing-prototypes -Wsign-compare -Wnested-externs -Wpointer-arith -Wformat-security -Winit-self -Wno-missing-field-initializers -Wno-unused-parameter -Wno-deprecated-declarations -I/usr/include/dbus-1.0 -I/usr/lib/dbus-1.0/include -I/usr/include/glib-2.0 -I/usr/lib/glib-2.0/include -pthread -I/usr/include/telepathy-1.0 -I/usr/include/dbus-1.0 -I/usr/lib/dbus-1.0/include -I/usr/include/glib-2.0 -I/usr/lib/glib-2.0/include -O2 -pipe -march=pentium4m -mtune=pentium4m -c -o svc.lo `test -f '_gen/svc.c' || echo './'`_gen/svc.c >libtool: compile: i686-pc-linux-gnu-gcc -DHAVE_CONFIG_H -I. -I.. -Wall -Wextra -Wdeclaration-after-statement -Wshadow -Wstrict-prototypes -Wmissing-prototypes -Wsign-compare -Wnested-externs -Wpointer-arith -Wformat-security -Winit-self -Wno-missing-field-initializers -Wno-unused-parameter -Wno-deprecated-declarations -I/usr/include/dbus-1.0 -I/usr/lib/dbus-1.0/include -I/usr/include/glib-2.0 -I/usr/lib/glib-2.0/include -pthread -I/usr/include/telepathy-1.0 -I/usr/include/dbus-1.0 -I/usr/lib/dbus-1.0/include -I/usr/include/glib-2.0 -I/usr/lib/glib-2.0/include -O2 -pipe -march=pentium4m -mtune=pentium4m -c _gen/svc.c -fPIC -DPIC -o .libs/svc.o >libtool: compile: i686-pc-linux-gnu-gcc -DHAVE_CONFIG_H -I. -I.. -Wall -Wextra -Wdeclaration-after-statement -Wshadow -Wstrict-prototypes -Wmissing-prototypes -Wsign-compare -Wnested-externs -Wpointer-arith -Wformat-security -Winit-self -Wno-missing-field-initializers -Wno-unused-parameter -Wno-deprecated-declarations -I/usr/include/dbus-1.0 -I/usr/lib/dbus-1.0/include -I/usr/include/glib-2.0 -I/usr/lib/glib-2.0/include -pthread -I/usr/include/telepathy-1.0 -I/usr/include/dbus-1.0 -I/usr/lib/dbus-1.0/include -I/usr/include/glib-2.0 -I/usr/lib/glib-2.0/include -O2 -pipe -march=pentium4m -mtune=pentium4m -c _gen/svc.c -o svc.o >/dev/null 2>&1 >/bin/sh ../libtool --tag=CC --mode=compile i686-pc-linux-gnu-gcc -DHAVE_CONFIG_H -I. -I.. -Wall -Wextra -Wdeclaration-after-statement -Wshadow -Wstrict-prototypes -Wmissing-prototypes -Wsign-compare -Wnested-externs -Wpointer-arith -Wformat-security -Winit-self -Wno-missing-field-initializers -Wno-unused-parameter -Wno-deprecated-declarations -I/usr/include/dbus-1.0 -I/usr/lib/dbus-1.0/include -I/usr/include/glib-2.0 -I/usr/lib/glib-2.0/include -pthread -I/usr/include/telepathy-1.0 -I/usr/include/dbus-1.0 -I/usr/lib/dbus-1.0/include -I/usr/include/glib-2.0 -I/usr/lib/glib-2.0/include -O2 -pipe -march=pentium4m -mtune=pentium4m -c -o signals-marshal.lo `test -f '_gen/signals-marshal.c' || echo './'`_gen/signals-marshal.c >libtool: compile: i686-pc-linux-gnu-gcc -DHAVE_CONFIG_H -I. -I.. -Wall -Wextra -Wdeclaration-after-statement -Wshadow -Wstrict-prototypes -Wmissing-prototypes -Wsign-compare -Wnested-externs -Wpointer-arith -Wformat-security -Winit-self -Wno-missing-field-initializers -Wno-unused-parameter -Wno-deprecated-declarations -I/usr/include/dbus-1.0 -I/usr/lib/dbus-1.0/include -I/usr/include/glib-2.0 -I/usr/lib/glib-2.0/include -pthread -I/usr/include/telepathy-1.0 -I/usr/include/dbus-1.0 -I/usr/lib/dbus-1.0/include -I/usr/include/glib-2.0 -I/usr/lib/glib-2.0/include -O2 -pipe -march=pentium4m -mtune=pentium4m -c _gen/signals-marshal.c -fPIC -DPIC -o .libs/signals-marshal.o >libtool: compile: i686-pc-linux-gnu-gcc -DHAVE_CONFIG_H -I. -I.. -Wall -Wextra -Wdeclaration-after-statement -Wshadow -Wstrict-prototypes -Wmissing-prototypes -Wsign-compare -Wnested-externs -Wpointer-arith -Wformat-security -Winit-self -Wno-missing-field-initializers -Wno-unused-parameter -Wno-deprecated-declarations -I/usr/include/dbus-1.0 -I/usr/lib/dbus-1.0/include -I/usr/include/glib-2.0 -I/usr/lib/glib-2.0/include -pthread -I/usr/include/telepathy-1.0 -I/usr/include/dbus-1.0 -I/usr/lib/dbus-1.0/include -I/usr/include/glib-2.0 -I/usr/lib/glib-2.0/include -O2 -pipe -march=pentium4m -mtune=pentium4m -c _gen/signals-marshal.c -o signals-marshal.o >/dev/null 2>&1 >/bin/sh ../libtool --tag=CC --mode=link i686-pc-linux-gnu-gcc -Wall -Wextra -Wdeclaration-after-statement -Wshadow -Wstrict-prototypes -Wmissing-prototypes -Wsign-compare -Wnested-externs -Wpointer-arith -Wformat-security -Winit-self -Wno-missing-field-initializers -Wno-unused-parameter -Wno-deprecated-declarations -I/usr/include/dbus-1.0 -I/usr/lib/dbus-1.0/include -I/usr/include/glib-2.0 -I/usr/lib/glib-2.0/include -pthread -I/usr/include/telepathy-1.0 -I/usr/include/dbus-1.0 -I/usr/lib/dbus-1.0/include -I/usr/include/glib-2.0 -I/usr/lib/glib-2.0/include -O2 -pipe -march=pentium4m -mtune=pentium4m @DBUS_LIBS@ -lgio-2.0 -lgobject-2.0 -lglib-2.0 -ltelepathy-glib -Wl,-O1 -Wl,--as-needed -Wl,-O1 -o libhaze-extensions.la extensions.lo signals-marshal.lo svc.lo >libtool: link: i686-pc-linux-gnu-ar cru .libs/libhaze-extensions.a .libs/extensions.o .libs/signals-marshal.o .libs/svc.o >libtool: link: i686-pc-linux-gnu-ranlib .libs/libhaze-extensions.a >libtool: link: ( cd ".libs" && rm -f "libhaze-extensions.la" && ln -s "../libhaze-extensions.la" "libhaze-extensions.la" ) >make[3]: Leaving directory '/var/tmp/portage/net-voip/telepathy-haze-0.8.0-r2/work/telepathy-haze-0.8.0/extensions' >make[2]: Leaving directory '/var/tmp/portage/net-voip/telepathy-haze-0.8.0-r2/work/telepathy-haze-0.8.0/extensions' >Making all in src >make[2]: Entering directory '/var/tmp/portage/net-voip/telepathy-haze-0.8.0-r2/work/telepathy-haze-0.8.0/src' >i686-pc-linux-gnu-gcc -DHAVE_CONFIG_H -I. -I.. -I.. -I.. -DG_LOG_DOMAIN=\"haze\" -Wall -Wextra -Wdeclaration-after-statement -Wshadow -Wstrict-prototypes -Wmissing-prototypes -Wsign-compare -Wnested-externs -Wpointer-arith -Wformat-security -Winit-self -Wno-missing-field-initializers -Wno-unused-parameter -Wno-deprecated-declarations -I/usr/include/libpurple -I/usr/include/glib-2.0 -I/usr/lib/glib-2.0/include -pthread -I/usr/include/telepathy-1.0 -I/usr/include/dbus-1.0 -I/usr/lib/dbus-1.0/include -I/usr/include/glib-2.0 -I/usr/lib/glib-2.0/include -I/usr/include/dbus-1.0 -I/usr/lib/dbus-1.0/include -I/usr/include/glib-2.0 -I/usr/lib/glib-2.0/include -pthread -I/usr/include/glib-2.0 -I/usr/lib/glib-2.0/include -O2 -pipe -march=pentium4m -mtune=pentium4m -c main.c >i686-pc-linux-gnu-gcc -DHAVE_CONFIG_H -I. -I.. -I.. -I.. -DG_LOG_DOMAIN=\"haze\" -Wall -Wextra -Wdeclaration-after-statement -Wshadow -Wstrict-prototypes -Wmissing-prototypes -Wsign-compare -Wnested-externs -Wpointer-arith -Wformat-security -Winit-self -Wno-missing-field-initializers -Wno-unused-parameter -Wno-deprecated-declarations -I/usr/include/libpurple -I/usr/include/glib-2.0 -I/usr/lib/glib-2.0/include -pthread -I/usr/include/telepathy-1.0 -I/usr/include/dbus-1.0 -I/usr/lib/dbus-1.0/include -I/usr/include/glib-2.0 -I/usr/lib/glib-2.0/include -I/usr/include/dbus-1.0 -I/usr/lib/dbus-1.0/include -I/usr/include/glib-2.0 -I/usr/lib/glib-2.0/include -pthread -I/usr/include/glib-2.0 -I/usr/lib/glib-2.0/include -O2 -pipe -march=pentium4m -mtune=pentium4m -c connection-avatars.c >i686-pc-linux-gnu-gcc -DHAVE_CONFIG_H -I. -I.. -I.. -I.. -DG_LOG_DOMAIN=\"haze\" -Wall -Wextra -Wdeclaration-after-statement -Wshadow -Wstrict-prototypes -Wmissing-prototypes -Wsign-compare -Wnested-externs -Wpointer-arith -Wformat-security -Winit-self -Wno-missing-field-initializers -Wno-unused-parameter -Wno-deprecated-declarations -I/usr/include/libpurple -I/usr/include/glib-2.0 -I/usr/lib/glib-2.0/include -pthread -I/usr/include/telepathy-1.0 -I/usr/include/dbus-1.0 -I/usr/lib/dbus-1.0/include -I/usr/include/glib-2.0 -I/usr/lib/glib-2.0/include -I/usr/include/dbus-1.0 -I/usr/lib/dbus-1.0/include -I/usr/include/glib-2.0 -I/usr/lib/glib-2.0/include -pthread -I/usr/include/glib-2.0 -I/usr/lib/glib-2.0/include -O2 -pipe -march=pentium4m -mtune=pentium4m -c connection-capabilities.c >i686-pc-linux-gnu-gcc -DHAVE_CONFIG_H -I. -I.. -I.. -I.. -DG_LOG_DOMAIN=\"haze\" -Wall -Wextra -Wdeclaration-after-statement -Wshadow -Wstrict-prototypes -Wmissing-prototypes -Wsign-compare -Wnested-externs -Wpointer-arith -Wformat-security -Winit-self -Wno-missing-field-initializers -Wno-unused-parameter -Wno-deprecated-declarations -I/usr/include/libpurple -I/usr/include/glib-2.0 -I/usr/lib/glib-2.0/include -pthread -I/usr/include/telepathy-1.0 -I/usr/include/dbus-1.0 -I/usr/lib/dbus-1.0/include -I/usr/include/glib-2.0 -I/usr/lib/glib-2.0/include -I/usr/include/dbus-1.0 -I/usr/lib/dbus-1.0/include -I/usr/include/glib-2.0 -I/usr/lib/glib-2.0/include -pthread -I/usr/include/glib-2.0 -I/usr/lib/glib-2.0/include -O2 -pipe -march=pentium4m -mtune=pentium4m -c connection-presence.c >i686-pc-linux-gnu-gcc -DHAVE_CONFIG_H -I. -I.. -I.. -I.. -DG_LOG_DOMAIN=\"haze\" -Wall -Wextra -Wdeclaration-after-statement -Wshadow -Wstrict-prototypes -Wmissing-prototypes -Wsign-compare -Wnested-externs -Wpointer-arith -Wformat-security -Winit-self -Wno-missing-field-initializers -Wno-unused-parameter -Wno-deprecated-declarations -I/usr/include/libpurple -I/usr/include/glib-2.0 -I/usr/lib/glib-2.0/include -pthread -I/usr/include/telepathy-1.0 -I/usr/include/dbus-1.0 -I/usr/lib/dbus-1.0/include -I/usr/include/glib-2.0 -I/usr/lib/glib-2.0/include -I/usr/include/dbus-1.0 -I/usr/lib/dbus-1.0/include -I/usr/include/glib-2.0 -I/usr/lib/glib-2.0/include -pthread -I/usr/include/glib-2.0 -I/usr/lib/glib-2.0/include -O2 -pipe -march=pentium4m -mtune=pentium4m -c connection-mail.c >i686-pc-linux-gnu-gcc -DHAVE_CONFIG_H -I. -I.. -I.. -I.. -DG_LOG_DOMAIN=\"haze\" -Wall -Wextra -Wdeclaration-after-statement -Wshadow -Wstrict-prototypes -Wmissing-prototypes -Wsign-compare -Wnested-externs -Wpointer-arith -Wformat-security -Winit-self -Wno-missing-field-initializers -Wno-unused-parameter -Wno-deprecated-declarations -I/usr/include/libpurple -I/usr/include/glib-2.0 -I/usr/lib/glib-2.0/include -pthread -I/usr/include/telepathy-1.0 -I/usr/include/dbus-1.0 -I/usr/lib/dbus-1.0/include -I/usr/include/glib-2.0 -I/usr/lib/glib-2.0/include -I/usr/include/dbus-1.0 -I/usr/lib/dbus-1.0/include -I/usr/include/glib-2.0 -I/usr/lib/glib-2.0/include -pthread -I/usr/include/glib-2.0 -I/usr/lib/glib-2.0/include -O2 -pipe -march=pentium4m -mtune=pentium4m -c connection.c >i686-pc-linux-gnu-gcc -DHAVE_CONFIG_H -I. -I.. -I.. -I.. -DG_LOG_DOMAIN=\"haze\" -Wall -Wextra -Wdeclaration-after-statement -Wshadow -Wstrict-prototypes -Wmissing-prototypes -Wsign-compare -Wnested-externs -Wpointer-arith -Wformat-security -Winit-self -Wno-missing-field-initializers -Wno-unused-parameter -Wno-deprecated-declarations -I/usr/include/libpurple -I/usr/include/glib-2.0 -I/usr/lib/glib-2.0/include -pthread -I/usr/include/telepathy-1.0 -I/usr/include/dbus-1.0 -I/usr/lib/dbus-1.0/include -I/usr/include/glib-2.0 -I/usr/lib/glib-2.0/include -I/usr/include/dbus-1.0 -I/usr/lib/dbus-1.0/include -I/usr/include/glib-2.0 -I/usr/lib/glib-2.0/include -pthread -I/usr/include/glib-2.0 -I/usr/lib/glib-2.0/include -O2 -pipe -march=pentium4m -mtune=pentium4m -c contact-list.c >i686-pc-linux-gnu-gcc -DHAVE_CONFIG_H -I. -I.. -I.. -I.. -DG_LOG_DOMAIN=\"haze\" -Wall -Wextra -Wdeclaration-after-statement -Wshadow -Wstrict-prototypes -Wmissing-prototypes -Wsign-compare -Wnested-externs -Wpointer-arith -Wformat-security -Winit-self -Wno-missing-field-initializers -Wno-unused-parameter -Wno-deprecated-declarations -I/usr/include/libpurple -I/usr/include/glib-2.0 -I/usr/lib/glib-2.0/include -pthread -I/usr/include/telepathy-1.0 -I/usr/include/dbus-1.0 -I/usr/lib/dbus-1.0/include -I/usr/include/glib-2.0 -I/usr/lib/glib-2.0/include -I/usr/include/dbus-1.0 -I/usr/lib/dbus-1.0/include -I/usr/include/glib-2.0 -I/usr/lib/glib-2.0/include -pthread -I/usr/include/glib-2.0 -I/usr/lib/glib-2.0/include -O2 -pipe -march=pentium4m -mtune=pentium4m -c im-channel.c >i686-pc-linux-gnu-gcc -DHAVE_CONFIG_H -I. -I.. -I.. -I.. -DG_LOG_DOMAIN=\"haze\" -Wall -Wextra -Wdeclaration-after-statement -Wshadow -Wstrict-prototypes -Wmissing-prototypes -Wsign-compare -Wnested-externs -Wpointer-arith -Wformat-security -Winit-self -Wno-missing-field-initializers -Wno-unused-parameter -Wno-deprecated-declarations -I/usr/include/libpurple -I/usr/include/glib-2.0 -I/usr/lib/glib-2.0/include -pthread -I/usr/include/telepathy-1.0 -I/usr/include/dbus-1.0 -I/usr/lib/dbus-1.0/include -I/usr/include/glib-2.0 -I/usr/lib/glib-2.0/include -I/usr/include/dbus-1.0 -I/usr/lib/dbus-1.0/include -I/usr/include/glib-2.0 -I/usr/lib/glib-2.0/include -pthread -I/usr/include/glib-2.0 -I/usr/lib/glib-2.0/include -O2 -pipe -march=pentium4m -mtune=pentium4m -c im-channel-factory.c >i686-pc-linux-gnu-gcc -DHAVE_CONFIG_H -I. -I.. -I.. -I.. -DG_LOG_DOMAIN=\"haze\" -Wall -Wextra -Wdeclaration-after-statement -Wshadow -Wstrict-prototypes -Wmissing-prototypes -Wsign-compare -Wnested-externs -Wpointer-arith -Wformat-security -Winit-self -Wno-missing-field-initializers -Wno-unused-parameter -Wno-deprecated-declarations -I/usr/include/libpurple -I/usr/include/glib-2.0 -I/usr/lib/glib-2.0/include -pthread -I/usr/include/telepathy-1.0 -I/usr/include/dbus-1.0 -I/usr/lib/dbus-1.0/include -I/usr/include/glib-2.0 -I/usr/lib/glib-2.0/include -I/usr/include/dbus-1.0 -I/usr/lib/dbus-1.0/include -I/usr/include/glib-2.0 -I/usr/lib/glib-2.0/include -pthread -I/usr/include/glib-2.0 -I/usr/lib/glib-2.0/include -O2 -pipe -march=pentium4m -mtune=pentium4m -c notify.c >i686-pc-linux-gnu-gcc -DHAVE_CONFIG_H -I. -I.. -I.. -I.. -DG_LOG_DOMAIN=\"haze\" -Wall -Wextra -Wdeclaration-after-statement -Wshadow -Wstrict-prototypes -Wmissing-prototypes -Wsign-compare -Wnested-externs -Wpointer-arith -Wformat-security -Winit-self -Wno-missing-field-initializers -Wno-unused-parameter -Wno-deprecated-declarations -I/usr/include/libpurple -I/usr/include/glib-2.0 -I/usr/lib/glib-2.0/include -pthread -I/usr/include/telepathy-1.0 -I/usr/include/dbus-1.0 -I/usr/lib/dbus-1.0/include -I/usr/include/glib-2.0 -I/usr/lib/glib-2.0/include -I/usr/include/dbus-1.0 -I/usr/lib/dbus-1.0/include -I/usr/include/glib-2.0 -I/usr/lib/glib-2.0/include -pthread -I/usr/include/glib-2.0 -I/usr/lib/glib-2.0/include -O2 -pipe -march=pentium4m -mtune=pentium4m -c protocol.c >i686-pc-linux-gnu-gcc -DHAVE_CONFIG_H -I. -I.. -I.. -I.. -DG_LOG_DOMAIN=\"haze\" -Wall -Wextra -Wdeclaration-after-statement -Wshadow -Wstrict-prototypes -Wmissing-prototypes -Wsign-compare -Wnested-externs -Wpointer-arith -Wformat-security -Winit-self -Wno-missing-field-initializers -Wno-unused-parameter -Wno-deprecated-declarations -I/usr/include/libpurple -I/usr/include/glib-2.0 -I/usr/lib/glib-2.0/include -pthread -I/usr/include/telepathy-1.0 -I/usr/include/dbus-1.0 -I/usr/lib/dbus-1.0/include -I/usr/include/glib-2.0 -I/usr/lib/glib-2.0/include -I/usr/include/dbus-1.0 -I/usr/lib/dbus-1.0/include -I/usr/include/glib-2.0 -I/usr/lib/glib-2.0/include -pthread -I/usr/include/glib-2.0 -I/usr/lib/glib-2.0/include -O2 -pipe -march=pentium4m -mtune=pentium4m -c request.c >i686-pc-linux-gnu-gcc -DHAVE_CONFIG_H -I. -I.. -I.. -I.. -DG_LOG_DOMAIN=\"haze\" -Wall -Wextra -Wdeclaration-after-statement -Wshadow -Wstrict-prototypes -Wmissing-prototypes -Wsign-compare -Wnested-externs -Wpointer-arith -Wformat-security -Winit-self -Wno-missing-field-initializers -Wno-unused-parameter -Wno-deprecated-declarations -I/usr/include/libpurple -I/usr/include/glib-2.0 -I/usr/lib/glib-2.0/include -pthread -I/usr/include/telepathy-1.0 -I/usr/include/dbus-1.0 -I/usr/lib/dbus-1.0/include -I/usr/include/glib-2.0 -I/usr/lib/glib-2.0/include -I/usr/include/dbus-1.0 -I/usr/lib/dbus-1.0/include -I/usr/include/glib-2.0 -I/usr/lib/glib-2.0/include -pthread -I/usr/include/glib-2.0 -I/usr/lib/glib-2.0/include -O2 -pipe -march=pentium4m -mtune=pentium4m -c util.c >i686-pc-linux-gnu-gcc -DHAVE_CONFIG_H -I. -I.. -I.. -I.. -DG_LOG_DOMAIN=\"haze\" -Wall -Wextra -Wdeclaration-after-statement -Wshadow -Wstrict-prototypes -Wmissing-prototypes -Wsign-compare -Wnested-externs -Wpointer-arith -Wformat-security -Winit-self -Wno-missing-field-initializers -Wno-unused-parameter -Wno-deprecated-declarations -I/usr/include/libpurple -I/usr/include/glib-2.0 -I/usr/lib/glib-2.0/include -pthread -I/usr/include/telepathy-1.0 -I/usr/include/dbus-1.0 -I/usr/lib/dbus-1.0/include -I/usr/include/glib-2.0 -I/usr/lib/glib-2.0/include -I/usr/include/dbus-1.0 -I/usr/lib/dbus-1.0/include -I/usr/include/glib-2.0 -I/usr/lib/glib-2.0/include -pthread -I/usr/include/glib-2.0 -I/usr/lib/glib-2.0/include -O2 -pipe -march=pentium4m -mtune=pentium4m -c media-backend.c >i686-pc-linux-gnu-gcc -DHAVE_CONFIG_H -I. -I.. -I.. -I.. -DG_LOG_DOMAIN=\"haze\" -Wall -Wextra -Wdeclaration-after-statement -Wshadow -Wstrict-prototypes -Wmissing-prototypes -Wsign-compare -Wnested-externs -Wpointer-arith -Wformat-security -Winit-self -Wno-missing-field-initializers -Wno-unused-parameter -Wno-deprecated-declarations -I/usr/include/libpurple -I/usr/include/glib-2.0 -I/usr/lib/glib-2.0/include -pthread -I/usr/include/telepathy-1.0 -I/usr/include/dbus-1.0 -I/usr/lib/dbus-1.0/include -I/usr/include/glib-2.0 -I/usr/lib/glib-2.0/include -I/usr/include/dbus-1.0 -I/usr/lib/dbus-1.0/include -I/usr/include/glib-2.0 -I/usr/lib/glib-2.0/include -pthread -I/usr/include/glib-2.0 -I/usr/lib/glib-2.0/include -O2 -pipe -march=pentium4m -mtune=pentium4m -c media-channel.c >i686-pc-linux-gnu-gcc -DHAVE_CONFIG_H -I. -I.. -I.. -I.. -DG_LOG_DOMAIN=\"haze\" -Wall -Wextra -Wdeclaration-after-statement -Wshadow -Wstrict-prototypes -Wmissing-prototypes -Wsign-compare -Wnested-externs -Wpointer-arith -Wformat-security -Winit-self -Wno-missing-field-initializers -Wno-unused-parameter -Wno-deprecated-declarations -I/usr/include/libpurple -I/usr/include/glib-2.0 -I/usr/lib/glib-2.0/include -pthread -I/usr/include/telepathy-1.0 -I/usr/include/dbus-1.0 -I/usr/lib/dbus-1.0/include -I/usr/include/glib-2.0 -I/usr/lib/glib-2.0/include -I/usr/include/dbus-1.0 -I/usr/lib/dbus-1.0/include -I/usr/include/glib-2.0 -I/usr/lib/glib-2.0/include -pthread -I/usr/include/glib-2.0 -I/usr/lib/glib-2.0/include -O2 -pipe -march=pentium4m -mtune=pentium4m -c media-manager.c >[01m[Kmedia-manager.c:349:28:[m[K [01;35m[Kwarning: [m[Kâ[01m[Kanon_channel_allowed_properties[m[Kâ defined but not used [[01;35m[K-Wunused-const-variable=[m[K] > static const gchar * const [01;35m[Kanon_channel_allowed_properties[m[K[] = { > [01;35m[K^~~~~~~~~~~~~~~~~~~~~~~~~~~~~~~[m[K >i686-pc-linux-gnu-gcc -DHAVE_CONFIG_H -I. -I.. -I.. -I.. -DG_LOG_DOMAIN=\"haze\" -Wall -Wextra -Wdeclaration-after-statement -Wshadow -Wstrict-prototypes -Wmissing-prototypes -Wsign-compare -Wnested-externs -Wpointer-arith -Wformat-security -Winit-self -Wno-missing-field-initializers -Wno-unused-parameter -Wno-deprecated-declarations -I/usr/include/libpurple -I/usr/include/glib-2.0 -I/usr/lib/glib-2.0/include -pthread -I/usr/include/telepathy-1.0 -I/usr/include/dbus-1.0 -I/usr/lib/dbus-1.0/include -I/usr/include/glib-2.0 -I/usr/lib/glib-2.0/include -I/usr/include/dbus-1.0 -I/usr/lib/dbus-1.0/include -I/usr/include/glib-2.0 -I/usr/lib/glib-2.0/include -pthread -I/usr/include/glib-2.0 -I/usr/lib/glib-2.0/include -O2 -pipe -march=pentium4m -mtune=pentium4m -c media-stream.c >sed -e 's,[@]libexecdir[@],/usr/libexec,' < telepathy-haze.8.in > telepathy-haze.8 >i686-pc-linux-gnu-gcc -DHAVE_CONFIG_H -I. -I.. -I.. -I.. -DG_LOG_DOMAIN=\"haze\" -Wall -Wextra -Wdeclaration-after-statement -Wshadow -Wstrict-prototypes -Wmissing-prototypes -Wsign-compare -Wnested-externs -Wpointer-arith -Wformat-security -Winit-self -Wno-missing-field-initializers -Wno-unused-parameter -Wno-deprecated-declarations -I/usr/include/libpurple -I/usr/include/glib-2.0 -I/usr/lib/glib-2.0/include -pthread -I/usr/include/telepathy-1.0 -I/usr/include/dbus-1.0 -I/usr/lib/dbus-1.0/include -I/usr/include/glib-2.0 -I/usr/lib/glib-2.0/include -I/usr/include/dbus-1.0 -I/usr/lib/dbus-1.0/include -I/usr/include/glib-2.0 -I/usr/lib/glib-2.0/include -pthread -I/usr/include/glib-2.0 -I/usr/lib/glib-2.0/include -O2 -pipe -march=pentium4m -mtune=pentium4m -c connection-aliasing.c >i686-pc-linux-gnu-gcc -DHAVE_CONFIG_H -I. -I.. -I.. -I.. -DG_LOG_DOMAIN=\"haze\" -Wall -Wextra -Wdeclaration-after-statement -Wshadow -Wstrict-prototypes -Wmissing-prototypes -Wsign-compare -Wnested-externs -Wpointer-arith -Wformat-security -Winit-self -Wno-missing-field-initializers -Wno-unused-parameter -Wno-deprecated-declarations -I/usr/include/libpurple -I/usr/include/glib-2.0 -I/usr/lib/glib-2.0/include -pthread -I/usr/include/telepathy-1.0 -I/usr/include/dbus-1.0 -I/usr/lib/dbus-1.0/include -I/usr/include/glib-2.0 -I/usr/lib/glib-2.0/include -I/usr/include/dbus-1.0 -I/usr/lib/dbus-1.0/include -I/usr/include/glib-2.0 -I/usr/lib/glib-2.0/include -pthread -I/usr/include/glib-2.0 -I/usr/lib/glib-2.0/include -O2 -pipe -march=pentium4m -mtune=pentium4m -c connection-manager.c >i686-pc-linux-gnu-gcc -DHAVE_CONFIG_H -I. -I.. -I.. -I.. -DG_LOG_DOMAIN=\"haze\" -Wall -Wextra -Wdeclaration-after-statement -Wshadow -Wstrict-prototypes -Wmissing-prototypes -Wsign-compare -Wnested-externs -Wpointer-arith -Wformat-security -Winit-self -Wno-missing-field-initializers -Wno-unused-parameter -Wno-deprecated-declarations -I/usr/include/libpurple -I/usr/include/glib-2.0 -I/usr/lib/glib-2.0/include -pthread -I/usr/include/telepathy-1.0 -I/usr/include/dbus-1.0 -I/usr/lib/dbus-1.0/include -I/usr/include/glib-2.0 -I/usr/lib/glib-2.0/include -I/usr/include/dbus-1.0 -I/usr/lib/dbus-1.0/include -I/usr/include/glib-2.0 -I/usr/lib/glib-2.0/include -pthread -I/usr/include/glib-2.0 -I/usr/lib/glib-2.0/include -O2 -pipe -march=pentium4m -mtune=pentium4m -c debug.c >/bin/sh ../libtool --tag=CC --mode=link i686-pc-linux-gnu-gcc -I.. -I.. -DG_LOG_DOMAIN=\"haze\" -Wall -Wextra -Wdeclaration-after-statement -Wshadow -Wstrict-prototypes -Wmissing-prototypes -Wsign-compare -Wnested-externs -Wpointer-arith -Wformat-security -Winit-self -Wno-missing-field-initializers -Wno-unused-parameter -Wno-deprecated-declarations -I/usr/include/libpurple -I/usr/include/glib-2.0 -I/usr/lib/glib-2.0/include -pthread -I/usr/include/telepathy-1.0 -I/usr/include/dbus-1.0 -I/usr/lib/dbus-1.0/include -I/usr/include/glib-2.0 -I/usr/lib/glib-2.0/include -I/usr/include/dbus-1.0 -I/usr/lib/dbus-1.0/include -I/usr/include/glib-2.0 -I/usr/lib/glib-2.0/include -pthread -I/usr/include/glib-2.0 -I/usr/lib/glib-2.0/include -O2 -pipe -march=pentium4m -mtune=pentium4m -lpurple -lglib-2.0 -ltelepathy-glib -ldbus-glib-1 -ldbus-1 -lgobject-2.0 -lglib-2.0 -lgio-2.0 -lgobject-2.0 -lglib-2.0 -Wl,-O1 -Wl,--as-needed -Wl,-O1 -o telepathy-haze main.o debug.o connection-manager.o connection-aliasing.o connection-avatars.o connection-capabilities.o connection-presence.o connection-mail.o connection.o contact-list.o im-channel.o im-channel-factory.o notify.o protocol.o request.o util.o media-backend.o media-channel.o media-manager.o media-stream.o ../extensions/libhaze-extensions.la >libtool: link: i686-pc-linux-gnu-gcc -I.. -I.. -DG_LOG_DOMAIN=\"haze\" -Wall -Wextra -Wdeclaration-after-statement -Wshadow -Wstrict-prototypes -Wmissing-prototypes -Wsign-compare -Wnested-externs -Wpointer-arith -Wformat-security -Winit-self -Wno-missing-field-initializers -Wno-unused-parameter -Wno-deprecated-declarations -I/usr/include/libpurple -I/usr/include/glib-2.0 -I/usr/lib/glib-2.0/include -pthread -I/usr/include/telepathy-1.0 -I/usr/include/dbus-1.0 -I/usr/lib/dbus-1.0/include -I/usr/include/glib-2.0 -I/usr/lib/glib-2.0/include -I/usr/include/dbus-1.0 -I/usr/lib/dbus-1.0/include -I/usr/include/glib-2.0 -I/usr/lib/glib-2.0/include -pthread -I/usr/include/glib-2.0 -I/usr/lib/glib-2.0/include -O2 -pipe -march=pentium4m -mtune=pentium4m -Wl,-O1 -Wl,--as-needed -Wl,-O1 -o telepathy-haze main.o debug.o connection-manager.o connection-aliasing.o connection-avatars.o connection-capabilities.o connection-presence.o connection-mail.o connection.o contact-list.o im-channel.o im-channel-factory.o notify.o protocol.o request.o util.o media-backend.o media-channel.o media-manager.o media-stream.o -lpurple -ldbus-glib-1 -ldbus-1 ../extensions/.libs/libhaze-extensions.a -lgio-2.0 -lgobject-2.0 -lglib-2.0 -ltelepathy-glib -pthread >make[2]: Leaving directory '/var/tmp/portage/net-voip/telepathy-haze-0.8.0-r2/work/telepathy-haze-0.8.0/src' >Making all in data >make[2]: Entering directory '/var/tmp/portage/net-voip/telepathy-haze-0.8.0-r2/work/telepathy-haze-0.8.0/data' >sed -e "s|\@libexecdir\@|/usr/libexec|" org.freedesktop.Telepathy.ConnectionManager.haze.service.in > org.freedesktop.Telepathy.ConnectionManager.haze.service >make[2]: Leaving directory '/var/tmp/portage/net-voip/telepathy-haze-0.8.0-r2/work/telepathy-haze-0.8.0/data' >Making all in m4 >make[2]: Entering directory '/var/tmp/portage/net-voip/telepathy-haze-0.8.0-r2/work/telepathy-haze-0.8.0/m4' >make[2]: Nothing to be done for 'all'. >make[2]: Leaving directory '/var/tmp/portage/net-voip/telepathy-haze-0.8.0-r2/work/telepathy-haze-0.8.0/m4' >Making all in tests >make[2]: Entering directory '/var/tmp/portage/net-voip/telepathy-haze-0.8.0-r2/work/telepathy-haze-0.8.0/tests' >Making all in . >make[3]: Entering directory '/var/tmp/portage/net-voip/telepathy-haze-0.8.0-r2/work/telepathy-haze-0.8.0/tests' >make[3]: Nothing to be done for 'all-am'. >make[3]: Leaving directory '/var/tmp/portage/net-voip/telepathy-haze-0.8.0-r2/work/telepathy-haze-0.8.0/tests' >Making all in twisted >make[3]: Entering directory '/var/tmp/portage/net-voip/telepathy-haze-0.8.0-r2/work/telepathy-haze-0.8.0/tests/twisted' >{ \ > echo "MEDIA_ENABLED = True"; \ >} > config.py >echo avatar-requirements.py cm/protocols.py connect/fail.py connect/success.py connect/twice-to-same-account.py presence/presence.py roster/initial-roster.py roster/groups.py roster/publish.py roster/removed-from-rp-subscribe.py roster/subscribe.py sasl/close.py sasl/telepathy-password.py text/destroy.py text/ensure.py text/initiate-requestotron.py text/initiate.py text/respawn.py text/test-text-delayed.py text/test-text-no-body.py text/test-text.py > haze-twisted-tests.list >sed \ > -e 's![@]hazetestsdir[@]!/usr/libexec/telepathy-haze/tests!' \ > -e 's![@]TEST_PYTHON[@]!/usr/bin/python2.7!' \ > < run-test.sh.in > run-test.sh.tmp && \ > chmod +x run-test.sh.tmp && \ > mv run-test.sh.tmp run-test.sh >make all-recursive >make[4]: Entering directory '/var/tmp/portage/net-voip/telepathy-haze-0.8.0-r2/work/telepathy-haze-0.8.0/tests/twisted' >Making all in tools >make[5]: Entering directory '/var/tmp/portage/net-voip/telepathy-haze-0.8.0-r2/work/telepathy-haze-0.8.0/tests/twisted/tools' >sed -e "s|[@]abs_top_builddir[@]|/var/tmp/portage/net-voip/telepathy-haze-0.8.0-r2/work/telepathy-haze-0.8.0|g" \ > -e "s|[@]abs_top_srcdir[@]|/var/tmp/portage/net-voip/telepathy-haze-0.8.0-r2/work/telepathy-haze-0.8.0|g" haze.service.in > org.freedesktop.Telepathy.ConnectionManager.haze.service >sed -e "s|[@]abs_top_builddir[@]|/var/tmp/portage/net-voip/telepathy-haze-0.8.0-r2/work/telepathy-haze-0.8.0|g" tmp-session-bus.conf.in > tmp-session-bus.conf >make all-am >make[6]: Entering directory '/var/tmp/portage/net-voip/telepathy-haze-0.8.0-r2/work/telepathy-haze-0.8.0/tests/twisted/tools' >make[6]: Nothing to be done for 'all-am'. >make[6]: Leaving directory '/var/tmp/portage/net-voip/telepathy-haze-0.8.0-r2/work/telepathy-haze-0.8.0/tests/twisted/tools' >make[5]: Leaving directory '/var/tmp/portage/net-voip/telepathy-haze-0.8.0-r2/work/telepathy-haze-0.8.0/tests/twisted/tools' >make[5]: Entering directory '/var/tmp/portage/net-voip/telepathy-haze-0.8.0-r2/work/telepathy-haze-0.8.0/tests/twisted' >make[5]: Nothing to be done for 'all-am'. >make[5]: Leaving directory '/var/tmp/portage/net-voip/telepathy-haze-0.8.0-r2/work/telepathy-haze-0.8.0/tests/twisted' >make[4]: Leaving directory '/var/tmp/portage/net-voip/telepathy-haze-0.8.0-r2/work/telepathy-haze-0.8.0/tests/twisted' >make[3]: Leaving directory '/var/tmp/portage/net-voip/telepathy-haze-0.8.0-r2/work/telepathy-haze-0.8.0/tests/twisted' >make[2]: Leaving directory '/var/tmp/portage/net-voip/telepathy-haze-0.8.0-r2/work/telepathy-haze-0.8.0/tests' >make[2]: Entering directory '/var/tmp/portage/net-voip/telepathy-haze-0.8.0-r2/work/telepathy-haze-0.8.0' >make[2]: Leaving directory '/var/tmp/portage/net-voip/telepathy-haze-0.8.0-r2/work/telepathy-haze-0.8.0' >make[1]: Leaving directory '/var/tmp/portage/net-voip/telepathy-haze-0.8.0-r2/work/telepathy-haze-0.8.0' >>>> Source compiled. >>>> Test phase: net-voip/telepathy-haze-0.8.0-r2 >make --jobs 5 --load-average 7.95 check >Making check in tools >make[1]: Entering directory '/var/tmp/portage/net-voip/telepathy-haze-0.8.0-r2/work/telepathy-haze-0.8.0/tools' >make[1]: Nothing to be done for 'check'. >make[1]: Leaving directory '/var/tmp/portage/net-voip/telepathy-haze-0.8.0-r2/work/telepathy-haze-0.8.0/tools' >Making check in extensions >make[1]: Entering directory '/var/tmp/portage/net-voip/telepathy-haze-0.8.0-r2/work/telepathy-haze-0.8.0/extensions' >make check-am >make[2]: Entering directory '/var/tmp/portage/net-voip/telepathy-haze-0.8.0-r2/work/telepathy-haze-0.8.0/extensions' >make[2]: Nothing to be done for 'check-am'. >make[2]: Leaving directory '/var/tmp/portage/net-voip/telepathy-haze-0.8.0-r2/work/telepathy-haze-0.8.0/extensions' >make[1]: Leaving directory '/var/tmp/portage/net-voip/telepathy-haze-0.8.0-r2/work/telepathy-haze-0.8.0/extensions' >Making check in src >make[1]: Entering directory '/var/tmp/portage/net-voip/telepathy-haze-0.8.0-r2/work/telepathy-haze-0.8.0/src' >make[1]: Nothing to be done for 'check'. >make[1]: Leaving directory '/var/tmp/portage/net-voip/telepathy-haze-0.8.0-r2/work/telepathy-haze-0.8.0/src' >Making check in data >make[1]: Entering directory '/var/tmp/portage/net-voip/telepathy-haze-0.8.0-r2/work/telepathy-haze-0.8.0/data' >make[1]: Nothing to be done for 'check'. >make[1]: Leaving directory '/var/tmp/portage/net-voip/telepathy-haze-0.8.0-r2/work/telepathy-haze-0.8.0/data' >Making check in m4 >make[1]: Entering directory '/var/tmp/portage/net-voip/telepathy-haze-0.8.0-r2/work/telepathy-haze-0.8.0/m4' >make[1]: Nothing to be done for 'check'. >make[1]: Leaving directory '/var/tmp/portage/net-voip/telepathy-haze-0.8.0-r2/work/telepathy-haze-0.8.0/m4' >Making check in tests >make[1]: Entering directory '/var/tmp/portage/net-voip/telepathy-haze-0.8.0-r2/work/telepathy-haze-0.8.0/tests' >Making check in . >make[2]: Entering directory '/var/tmp/portage/net-voip/telepathy-haze-0.8.0-r2/work/telepathy-haze-0.8.0/tests' >make[2]: Nothing to be done for 'check-am'. >make[2]: Leaving directory '/var/tmp/portage/net-voip/telepathy-haze-0.8.0-r2/work/telepathy-haze-0.8.0/tests' >Making check in twisted >make[2]: Entering directory '/var/tmp/portage/net-voip/telepathy-haze-0.8.0-r2/work/telepathy-haze-0.8.0/tests/twisted' >make check-recursive >make[3]: Entering directory '/var/tmp/portage/net-voip/telepathy-haze-0.8.0-r2/work/telepathy-haze-0.8.0/tests/twisted' >Making check in tools >make[4]: Entering directory '/var/tmp/portage/net-voip/telepathy-haze-0.8.0-r2/work/telepathy-haze-0.8.0/tests/twisted/tools' >make check-am >make[5]: Entering directory '/var/tmp/portage/net-voip/telepathy-haze-0.8.0-r2/work/telepathy-haze-0.8.0/tests/twisted/tools' >make[5]: Nothing to be done for 'check-am'. >make[5]: Leaving directory '/var/tmp/portage/net-voip/telepathy-haze-0.8.0-r2/work/telepathy-haze-0.8.0/tests/twisted/tools' >make[4]: Leaving directory '/var/tmp/portage/net-voip/telepathy-haze-0.8.0-r2/work/telepathy-haze-0.8.0/tests/twisted/tools' >make[4]: Entering directory '/var/tmp/portage/net-voip/telepathy-haze-0.8.0-r2/work/telepathy-haze-0.8.0/tests/twisted' >make check-local >make[5]: Entering directory '/var/tmp/portage/net-voip/telepathy-haze-0.8.0-r2/work/telepathy-haze-0.8.0/tests/twisted' >make -C tools >make[6]: Entering directory '/var/tmp/portage/net-voip/telepathy-haze-0.8.0-r2/work/telepathy-haze-0.8.0/tests/twisted/tools' >make all-am >make[7]: Entering directory '/var/tmp/portage/net-voip/telepathy-haze-0.8.0-r2/work/telepathy-haze-0.8.0/tests/twisted/tools' >make[7]: Nothing to be done for 'all-am'. >make[7]: Leaving directory '/var/tmp/portage/net-voip/telepathy-haze-0.8.0-r2/work/telepathy-haze-0.8.0/tests/twisted/tools' >make[6]: Leaving directory '/var/tmp/portage/net-voip/telepathy-haze-0.8.0-r2/work/telepathy-haze-0.8.0/tests/twisted/tools' >if test "x0" = x0; then \ > haze_test_sleep= ; \ >else \ > haze_test_sleep=--sleep=0; \ >fi; \ >HAZE_TEST_UNINSTALLED=1 \ > HAZE_ABS_TOP_SRCDIR=/var/tmp/portage/net-voip/telepathy-haze-0.8.0-r2/work/telepathy-haze-0.8.0 \ > HAZE_ABS_TOP_BUILDDIR=/var/tmp/portage/net-voip/telepathy-haze-0.8.0-r2/work/telepathy-haze-0.8.0 \ > HAZE_TEST_SLEEP=$haze_test_sleep \ > ./run-test.sh "avatar-requirements.py cm/protocols.py connect/fail.py connect/success.py connect/twice-to-same-account.py presence/presence.py roster/initial-roster.py roster/groups.py roster/publish.py roster/removed-from-rp-subscribe.py roster/subscribe.py sasl/close.py sasl/telepathy-password.py text/destroy.py text/ensure.py text/initiate-requestotron.py text/initiate.py text/respawn.py text/test-text-delayed.py text/test-text-no-body.py text/test-text.py" >Testing avatar-requirements.py ... >Traceback (most recent call last): > File "/var/tmp/portage/net-voip/telepathy-haze-0.8.0-r2/work/telepathy-haze-0.8.0/tests/twisted/avatar-requirements.py", line 1, in <module> > from servicetest import call_async, EventPattern > File "/var/tmp/portage/net-voip/telepathy-haze-0.8.0-r2/work/telepathy-haze-0.8.0/tests/twisted/servicetest.py", line 6, in <module> > from twisted.internet import glib2reactor > File "/usr/lib/python2.7/site-packages/twisted/internet/glib2reactor.py", line 19, in <module> > from twisted.internet import gtk2reactor > File "/usr/lib/python2.7/site-packages/twisted/internet/gtk2reactor.py", line 45, in <module> > import gobject >ImportError: No module named gobject >FAIL: avatar-requirements.py (1) >Testing cm/protocols.py ... >Traceback (most recent call last): > File "/var/tmp/portage/net-voip/telepathy-haze-0.8.0-r2/work/telepathy-haze-0.8.0/tests/twisted/cm/protocols.py", line 8, in <module> > from servicetest import (assertEquals, tp_path_prefix, assertContains, > File "/var/tmp/portage/net-voip/telepathy-haze-0.8.0-r2/work/telepathy-haze-0.8.0/tests/twisted/servicetest.py", line 6, in <module> > from twisted.internet import glib2reactor > File "/usr/lib/python2.7/site-packages/twisted/internet/glib2reactor.py", line 19, in <module> > from twisted.internet import gtk2reactor > File "/usr/lib/python2.7/site-packages/twisted/internet/gtk2reactor.py", line 45, in <module> > import gobject >ImportError: No module named gobject >FAIL: cm/protocols.py (1) >Testing connect/fail.py ... >Traceback (most recent call last): > File "/var/tmp/portage/net-voip/telepathy-haze-0.8.0-r2/work/telepathy-haze-0.8.0/tests/twisted/connect/fail.py", line 8, in <module> > from servicetest import (assertEquals, assertContains) > File "/var/tmp/portage/net-voip/telepathy-haze-0.8.0-r2/work/telepathy-haze-0.8.0/tests/twisted/servicetest.py", line 6, in <module> > from twisted.internet import glib2reactor > File "/usr/lib/python2.7/site-packages/twisted/internet/glib2reactor.py", line 19, in <module> > from twisted.internet import gtk2reactor > File "/usr/lib/python2.7/site-packages/twisted/internet/gtk2reactor.py", line 45, in <module> > import gobject >ImportError: No module named gobject >FAIL: connect/fail.py (1) >Testing connect/success.py ... >Traceback (most recent call last): > File "/var/tmp/portage/net-voip/telepathy-haze-0.8.0-r2/work/telepathy-haze-0.8.0/tests/twisted/connect/success.py", line 6, in <module> > from hazetest import exec_test > File "/var/tmp/portage/net-voip/telepathy-haze-0.8.0-r2/work/telepathy-haze-0.8.0/tests/twisted/hazetest.py", line 9, in <module> > import servicetest > File "/var/tmp/portage/net-voip/telepathy-haze-0.8.0-r2/work/telepathy-haze-0.8.0/tests/twisted/servicetest.py", line 6, in <module> > from twisted.internet import glib2reactor > File "/usr/lib/python2.7/site-packages/twisted/internet/glib2reactor.py", line 19, in <module> > from twisted.internet import gtk2reactor > File "/usr/lib/python2.7/site-packages/twisted/internet/gtk2reactor.py", line 45, in <module> > import gobject >ImportError: No module named gobject >FAIL: connect/success.py (1) >Testing connect/twice-to-same-account.py ... >Traceback (most recent call last): > File "/var/tmp/portage/net-voip/telepathy-haze-0.8.0-r2/work/telepathy-haze-0.8.0/tests/twisted/connect/twice-to-same-account.py", line 9, in <module> > from hazetest import exec_test > File "/var/tmp/portage/net-voip/telepathy-haze-0.8.0-r2/work/telepathy-haze-0.8.0/tests/twisted/hazetest.py", line 9, in <module> > import servicetest > File "/var/tmp/portage/net-voip/telepathy-haze-0.8.0-r2/work/telepathy-haze-0.8.0/tests/twisted/servicetest.py", line 6, in <module> > from twisted.internet import glib2reactor > File "/usr/lib/python2.7/site-packages/twisted/internet/glib2reactor.py", line 19, in <module> > from twisted.internet import gtk2reactor > File "/usr/lib/python2.7/site-packages/twisted/internet/gtk2reactor.py", line 45, in <module> > import gobject >ImportError: No module named gobject >FAIL: connect/twice-to-same-account.py (1) >Testing presence/presence.py ... >Traceback (most recent call last): > File "/var/tmp/portage/net-voip/telepathy-haze-0.8.0-r2/work/telepathy-haze-0.8.0/tests/twisted/presence/presence.py", line 10, in <module> > from servicetest import assertEquals > File "/var/tmp/portage/net-voip/telepathy-haze-0.8.0-r2/work/telepathy-haze-0.8.0/tests/twisted/servicetest.py", line 6, in <module> > from twisted.internet import glib2reactor > File "/usr/lib/python2.7/site-packages/twisted/internet/glib2reactor.py", line 19, in <module> > from twisted.internet import gtk2reactor > File "/usr/lib/python2.7/site-packages/twisted/internet/gtk2reactor.py", line 45, in <module> > import gobject >ImportError: No module named gobject >FAIL: presence/presence.py (1) >Testing roster/initial-roster.py ... >Traceback (most recent call last): > File "/var/tmp/portage/net-voip/telepathy-haze-0.8.0-r2/work/telepathy-haze-0.8.0/tests/twisted/roster/initial-roster.py", line 7, in <module> > from hazetest import exec_test, JabberXmlStream > File "/var/tmp/portage/net-voip/telepathy-haze-0.8.0-r2/work/telepathy-haze-0.8.0/tests/twisted/hazetest.py", line 9, in <module> > import servicetest > File "/var/tmp/portage/net-voip/telepathy-haze-0.8.0-r2/work/telepathy-haze-0.8.0/tests/twisted/servicetest.py", line 6, in <module> > from twisted.internet import glib2reactor > File "/usr/lib/python2.7/site-packages/twisted/internet/glib2reactor.py", line 19, in <module> > from twisted.internet import gtk2reactor > File "/usr/lib/python2.7/site-packages/twisted/internet/gtk2reactor.py", line 45, in <module> > import gobject >ImportError: No module named gobject >FAIL: roster/initial-roster.py (1) >Testing roster/groups.py ... >Traceback (most recent call last): > File "/var/tmp/portage/net-voip/telepathy-haze-0.8.0-r2/work/telepathy-haze-0.8.0/tests/twisted/roster/groups.py", line 10, in <module> > from servicetest import (EventPattern, wrap_channel, assertLength, > File "/var/tmp/portage/net-voip/telepathy-haze-0.8.0-r2/work/telepathy-haze-0.8.0/tests/twisted/servicetest.py", line 6, in <module> > from twisted.internet import glib2reactor > File "/usr/lib/python2.7/site-packages/twisted/internet/glib2reactor.py", line 19, in <module> > from twisted.internet import gtk2reactor > File "/usr/lib/python2.7/site-packages/twisted/internet/gtk2reactor.py", line 45, in <module> > import gobject >ImportError: No module named gobject >FAIL: roster/groups.py (1) >Testing roster/publish.py ... >Traceback (most recent call last): > File "/var/tmp/portage/net-voip/telepathy-haze-0.8.0-r2/work/telepathy-haze-0.8.0/tests/twisted/roster/publish.py", line 10, in <module> > from servicetest import (EventPattern, wrap_channel, assertLength, > File "/var/tmp/portage/net-voip/telepathy-haze-0.8.0-r2/work/telepathy-haze-0.8.0/tests/twisted/servicetest.py", line 6, in <module> > from twisted.internet import glib2reactor > File "/usr/lib/python2.7/site-packages/twisted/internet/glib2reactor.py", line 19, in <module> > from twisted.internet import gtk2reactor > File "/usr/lib/python2.7/site-packages/twisted/internet/gtk2reactor.py", line 45, in <module> > import gobject >ImportError: No module named gobject >FAIL: roster/publish.py (1) >Testing roster/removed-from-rp-subscribe.py ... >Traceback (most recent call last): > File "/var/tmp/portage/net-voip/telepathy-haze-0.8.0-r2/work/telepathy-haze-0.8.0/tests/twisted/roster/removed-from-rp-subscribe.py", line 7, in <module> > from servicetest import (EventPattern, wrap_channel, assertLength, > File "/var/tmp/portage/net-voip/telepathy-haze-0.8.0-r2/work/telepathy-haze-0.8.0/tests/twisted/servicetest.py", line 6, in <module> > from twisted.internet import glib2reactor > File "/usr/lib/python2.7/site-packages/twisted/internet/glib2reactor.py", line 19, in <module> > from twisted.internet import gtk2reactor > File "/usr/lib/python2.7/site-packages/twisted/internet/gtk2reactor.py", line 45, in <module> > import gobject >ImportError: No module named gobject >FAIL: roster/removed-from-rp-subscribe.py (1) >Testing roster/subscribe.py ... >Traceback (most recent call last): > File "/var/tmp/portage/net-voip/telepathy-haze-0.8.0-r2/work/telepathy-haze-0.8.0/tests/twisted/roster/subscribe.py", line 9, in <module> > from servicetest import (EventPattern, wrap_channel, assertLength, > File "/var/tmp/portage/net-voip/telepathy-haze-0.8.0-r2/work/telepathy-haze-0.8.0/tests/twisted/servicetest.py", line 6, in <module> > from twisted.internet import glib2reactor > File "/usr/lib/python2.7/site-packages/twisted/internet/glib2reactor.py", line 19, in <module> > from twisted.internet import gtk2reactor > File "/usr/lib/python2.7/site-packages/twisted/internet/gtk2reactor.py", line 45, in <module> > import gobject >ImportError: No module named gobject >FAIL: roster/subscribe.py (1) >Testing sasl/close.py ... >Traceback (most recent call last): > File "/var/tmp/portage/net-voip/telepathy-haze-0.8.0-r2/work/telepathy-haze-0.8.0/tests/twisted/sasl/close.py", line 5, in <module> > from servicetest import EventPattern > File "/var/tmp/portage/net-voip/telepathy-haze-0.8.0-r2/work/telepathy-haze-0.8.0/tests/twisted/servicetest.py", line 6, in <module> > from twisted.internet import glib2reactor > File "/usr/lib/python2.7/site-packages/twisted/internet/glib2reactor.py", line 19, in <module> > from twisted.internet import gtk2reactor > File "/usr/lib/python2.7/site-packages/twisted/internet/gtk2reactor.py", line 45, in <module> > import gobject >ImportError: No module named gobject >FAIL: sasl/close.py (1) >Testing sasl/telepathy-password.py ... >Traceback (most recent call last): > File "/var/tmp/portage/net-voip/telepathy-haze-0.8.0-r2/work/telepathy-haze-0.8.0/tests/twisted/sasl/telepathy-password.py", line 5, in <module> > from servicetest import call_async, EventPattern > File "/var/tmp/portage/net-voip/telepathy-haze-0.8.0-r2/work/telepathy-haze-0.8.0/tests/twisted/servicetest.py", line 6, in <module> > from twisted.internet import glib2reactor > File "/usr/lib/python2.7/site-packages/twisted/internet/glib2reactor.py", line 19, in <module> > from twisted.internet import gtk2reactor > File "/usr/lib/python2.7/site-packages/twisted/internet/gtk2reactor.py", line 45, in <module> > import gobject >ImportError: No module named gobject >FAIL: sasl/telepathy-password.py (1) >Testing text/destroy.py ... >Traceback (most recent call last): > File "/var/tmp/portage/net-voip/telepathy-haze-0.8.0-r2/work/telepathy-haze-0.8.0/tests/twisted/text/destroy.py", line 10, in <module> > from hazetest import exec_test > File "/var/tmp/portage/net-voip/telepathy-haze-0.8.0-r2/work/telepathy-haze-0.8.0/tests/twisted/hazetest.py", line 9, in <module> > import servicetest > File "/var/tmp/portage/net-voip/telepathy-haze-0.8.0-r2/work/telepathy-haze-0.8.0/tests/twisted/servicetest.py", line 6, in <module> > from twisted.internet import glib2reactor > File "/usr/lib/python2.7/site-packages/twisted/internet/glib2reactor.py", line 19, in <module> > from twisted.internet import gtk2reactor > File "/usr/lib/python2.7/site-packages/twisted/internet/gtk2reactor.py", line 45, in <module> > import gobject >ImportError: No module named gobject >FAIL: text/destroy.py (1) >Testing text/ensure.py ... >Traceback (most recent call last): > File "/var/tmp/portage/net-voip/telepathy-haze-0.8.0-r2/work/telepathy-haze-0.8.0/tests/twisted/text/ensure.py", line 9, in <module> > from hazetest import exec_test > File "/var/tmp/portage/net-voip/telepathy-haze-0.8.0-r2/work/telepathy-haze-0.8.0/tests/twisted/hazetest.py", line 9, in <module> > import servicetest > File "/var/tmp/portage/net-voip/telepathy-haze-0.8.0-r2/work/telepathy-haze-0.8.0/tests/twisted/servicetest.py", line 6, in <module> > from twisted.internet import glib2reactor > File "/usr/lib/python2.7/site-packages/twisted/internet/glib2reactor.py", line 19, in <module> > from twisted.internet import gtk2reactor > File "/usr/lib/python2.7/site-packages/twisted/internet/gtk2reactor.py", line 45, in <module> > import gobject >ImportError: No module named gobject >FAIL: text/ensure.py (1) >Testing text/initiate-requestotron.py ... >Traceback (most recent call last): > File "/var/tmp/portage/net-voip/telepathy-haze-0.8.0-r2/work/telepathy-haze-0.8.0/tests/twisted/text/initiate-requestotron.py", line 9, in <module> > from hazetest import exec_test > File "/var/tmp/portage/net-voip/telepathy-haze-0.8.0-r2/work/telepathy-haze-0.8.0/tests/twisted/hazetest.py", line 9, in <module> > import servicetest > File "/var/tmp/portage/net-voip/telepathy-haze-0.8.0-r2/work/telepathy-haze-0.8.0/tests/twisted/servicetest.py", line 6, in <module> > from twisted.internet import glib2reactor > File "/usr/lib/python2.7/site-packages/twisted/internet/glib2reactor.py", line 19, in <module> > from twisted.internet import gtk2reactor > File "/usr/lib/python2.7/site-packages/twisted/internet/gtk2reactor.py", line 45, in <module> > import gobject >ImportError: No module named gobject >FAIL: text/initiate-requestotron.py (1) >Testing text/initiate.py ... >Traceback (most recent call last): > File "/var/tmp/portage/net-voip/telepathy-haze-0.8.0-r2/work/telepathy-haze-0.8.0/tests/twisted/text/initiate.py", line 9, in <module> > from hazetest import exec_test > File "/var/tmp/portage/net-voip/telepathy-haze-0.8.0-r2/work/telepathy-haze-0.8.0/tests/twisted/hazetest.py", line 9, in <module> > import servicetest > File "/var/tmp/portage/net-voip/telepathy-haze-0.8.0-r2/work/telepathy-haze-0.8.0/tests/twisted/servicetest.py", line 6, in <module> > from twisted.internet import glib2reactor > File "/usr/lib/python2.7/site-packages/twisted/internet/glib2reactor.py", line 19, in <module> > from twisted.internet import gtk2reactor > File "/usr/lib/python2.7/site-packages/twisted/internet/gtk2reactor.py", line 45, in <module> > import gobject >ImportError: No module named gobject >FAIL: text/initiate.py (1) >Testing text/respawn.py ... >Traceback (most recent call last): > File "/var/tmp/portage/net-voip/telepathy-haze-0.8.0-r2/work/telepathy-haze-0.8.0/tests/twisted/text/respawn.py", line 9, in <module> > from hazetest import exec_test > File "/var/tmp/portage/net-voip/telepathy-haze-0.8.0-r2/work/telepathy-haze-0.8.0/tests/twisted/hazetest.py", line 9, in <module> > import servicetest > File "/var/tmp/portage/net-voip/telepathy-haze-0.8.0-r2/work/telepathy-haze-0.8.0/tests/twisted/servicetest.py", line 6, in <module> > from twisted.internet import glib2reactor > File "/usr/lib/python2.7/site-packages/twisted/internet/glib2reactor.py", line 19, in <module> > from twisted.internet import gtk2reactor > File "/usr/lib/python2.7/site-packages/twisted/internet/gtk2reactor.py", line 45, in <module> > import gobject >ImportError: No module named gobject >FAIL: text/respawn.py (1) >Testing text/test-text-delayed.py ... >Traceback (most recent call last): > File "/var/tmp/portage/net-voip/telepathy-haze-0.8.0-r2/work/telepathy-haze-0.8.0/tests/twisted/text/test-text-delayed.py", line 10, in <module> > from hazetest import exec_test > File "/var/tmp/portage/net-voip/telepathy-haze-0.8.0-r2/work/telepathy-haze-0.8.0/tests/twisted/hazetest.py", line 9, in <module> > import servicetest > File "/var/tmp/portage/net-voip/telepathy-haze-0.8.0-r2/work/telepathy-haze-0.8.0/tests/twisted/servicetest.py", line 6, in <module> > from twisted.internet import glib2reactor > File "/usr/lib/python2.7/site-packages/twisted/internet/glib2reactor.py", line 19, in <module> > from twisted.internet import gtk2reactor > File "/usr/lib/python2.7/site-packages/twisted/internet/gtk2reactor.py", line 45, in <module> > import gobject >ImportError: No module named gobject >FAIL: text/test-text-delayed.py (1) >Testing text/test-text-no-body.py ... >Traceback (most recent call last): > File "/var/tmp/portage/net-voip/telepathy-haze-0.8.0-r2/work/telepathy-haze-0.8.0/tests/twisted/text/test-text-no-body.py", line 9, in <module> > from hazetest import exec_test > File "/var/tmp/portage/net-voip/telepathy-haze-0.8.0-r2/work/telepathy-haze-0.8.0/tests/twisted/hazetest.py", line 9, in <module> > import servicetest > File "/var/tmp/portage/net-voip/telepathy-haze-0.8.0-r2/work/telepathy-haze-0.8.0/tests/twisted/servicetest.py", line 6, in <module> > from twisted.internet import glib2reactor > File "/usr/lib/python2.7/site-packages/twisted/internet/glib2reactor.py", line 19, in <module> > from twisted.internet import gtk2reactor > File "/usr/lib/python2.7/site-packages/twisted/internet/gtk2reactor.py", line 45, in <module> > import gobject >ImportError: No module named gobject >FAIL: text/test-text-no-body.py (1) >Testing text/test-text.py ... >Traceback (most recent call last): > File "/var/tmp/portage/net-voip/telepathy-haze-0.8.0-r2/work/telepathy-haze-0.8.0/tests/twisted/text/test-text.py", line 10, in <module> > from hazetest import exec_test > File "/var/tmp/portage/net-voip/telepathy-haze-0.8.0-r2/work/telepathy-haze-0.8.0/tests/twisted/hazetest.py", line 9, in <module> > import servicetest > File "/var/tmp/portage/net-voip/telepathy-haze-0.8.0-r2/work/telepathy-haze-0.8.0/tests/twisted/servicetest.py", line 6, in <module> > from twisted.internet import glib2reactor > File "/usr/lib/python2.7/site-packages/twisted/internet/glib2reactor.py", line 19, in <module> > from twisted.internet import gtk2reactor > File "/usr/lib/python2.7/site-packages/twisted/internet/gtk2reactor.py", line 45, in <module> > import gobject >ImportError: No module named gobject >FAIL: text/test-text.py (1) >make[5]: *** [Makefile:674: check-twisted] Error 1 >make[5]: Leaving directory '/var/tmp/portage/net-voip/telepathy-haze-0.8.0-r2/work/telepathy-haze-0.8.0/tests/twisted' >make[4]: *** [Makefile:546: check-am] Error 2 >make[4]: Leaving directory '/var/tmp/portage/net-voip/telepathy-haze-0.8.0-r2/work/telepathy-haze-0.8.0/tests/twisted' >make[3]: *** [Makefile:362: check-recursive] Error 1 >make[3]: Leaving directory '/var/tmp/portage/net-voip/telepathy-haze-0.8.0-r2/work/telepathy-haze-0.8.0/tests/twisted' >make[2]: *** [Makefile:548: check] Error 2 >make[2]: Leaving directory '/var/tmp/portage/net-voip/telepathy-haze-0.8.0-r2/work/telepathy-haze-0.8.0/tests/twisted' >make[1]: *** [Makefile:313: check-recursive] Error 1 >make[1]: Leaving directory '/var/tmp/portage/net-voip/telepathy-haze-0.8.0-r2/work/telepathy-haze-0.8.0/tests' >make: *** [Makefile:359: check-recursive] Error 1 > * ERROR: net-voip/telepathy-haze-0.8.0-r2::gentoo failed (test phase): > * Make check failed. See above for details. > * > * Call stack: > * ebuild.sh, line 124: Called src_test > * environment, line 1924: Called default > * phase-functions.sh, line 853: Called default_src_test > * phase-functions.sh, line 882: Called __eapi0_src_test > * phase-helpers.sh, line 763: Called die > * The specific snippet of code: > * $emake_cmd ${internal_opts} check || \ > * die "Make check failed. See above for details." > * > * If you need support, post the output of `emerge --info '=net-voip/telepathy-haze-0.8.0-r2::gentoo'`, > * the complete build log and the output of `emerge -pqv '=net-voip/telepathy-haze-0.8.0-r2::gentoo'`. > * The complete build log is located at '/var/tmp/portage/net-voip/telepathy-haze-0.8.0-r2/temp/build.log'. > * The ebuild environment file is located at '/var/tmp/portage/net-voip/telepathy-haze-0.8.0-r2/temp/environment'. > * Working directory: '/var/tmp/portage/net-voip/telepathy-haze-0.8.0-r2/work/telepathy-haze-0.8.0' > * S: '/var/tmp/portage/net-voip/telepathy-haze-0.8.0-r2/work/telepathy-haze-0.8.0'
You cannot view the attachment while viewing its details because your browser does not support IFRAMEs.
View the attachment on a separate page
.
View Attachment As Raw
Actions:
View
Attachments on
bug 641742
: 510998