Go to:
Gentoo Home
Documentation
Forums
Lists
Bugs
Planet
Store
Wiki
Get Gentoo!
Gentoo's Bugzilla – Attachment 510980 Details for
Bug 641714
dev-python/flask-migrate-2.1.1: multiple test failures
Home
|
New
–
[Ex]
|
Browse
|
Search
|
Privacy Policy
|
[?]
|
Reports
|
Requests
|
Help
|
New Account
|
Log In
[x]
|
Forgot Password
Login:
[x]
build.log
build.log (text/plain), 10.69 KB, created by
Thomas Deutschmann (RETIRED)
on 2017-12-19 13:03:56 UTC
(
hide
)
Description:
build.log
Filename:
MIME Type:
Creator:
Thomas Deutschmann (RETIRED)
Created:
2017-12-19 13:03:56 UTC
Size:
10.69 KB
patch
obsolete
> * Package: dev-python/flask-migrate-2.1.1 > * Repository: gentoo > * Maintainer: python@gentoo.org > * USE: abi_x86_32 elibc_glibc kernel_linux python_targets_python2_7 python_targets_python3_5 test userland_GNU x86 > * FEATURES: preserve-libs sandbox test userpriv usersandbox >>>> Unpacking source... >>>> Unpacking Flask-Migrate-2.1.1.tar.gz to /var/tmp/portage/dev-python/flask-migrate-2.1.1/work >>>> Source unpacked in /var/tmp/portage/dev-python/flask-migrate-2.1.1/work >>>> Preparing source in /var/tmp/portage/dev-python/flask-migrate-2.1.1/work/Flask-Migrate-2.1.1 ... >>>> Source prepared. >>>> Configuring source in /var/tmp/portage/dev-python/flask-migrate-2.1.1/work/Flask-Migrate-2.1.1 ... >>>> Source configured. >>>> Compiling source in /var/tmp/portage/dev-python/flask-migrate-2.1.1/work/Flask-Migrate-2.1.1 ... > * python2_7: running distutils-r1_run_phase distutils-r1_python_compile >/usr/bin/python2.7 setup.py build >running build >running build_py >creating /var/tmp/portage/dev-python/flask-migrate-2.1.1/work/Flask-Migrate-2.1.1-python2_7/lib/flask_migrate >copying flask_migrate/cli.py -> /var/tmp/portage/dev-python/flask-migrate-2.1.1/work/Flask-Migrate-2.1.1-python2_7/lib/flask_migrate >copying flask_migrate/__init__.py -> /var/tmp/portage/dev-python/flask-migrate-2.1.1/work/Flask-Migrate-2.1.1-python2_7/lib/flask_migrate >running egg_info >writing requirements to Flask_Migrate.egg-info/requires.txt >writing Flask_Migrate.egg-info/PKG-INFO >writing top-level names to Flask_Migrate.egg-info/top_level.txt >writing dependency_links to Flask_Migrate.egg-info/dependency_links.txt >writing entry points to Flask_Migrate.egg-info/entry_points.txt >reading manifest file 'Flask_Migrate.egg-info/SOURCES.txt' >reading manifest template 'MANIFEST.in' >writing manifest file 'Flask_Migrate.egg-info/SOURCES.txt' >creating /var/tmp/portage/dev-python/flask-migrate-2.1.1/work/Flask-Migrate-2.1.1-python2_7/lib/flask_migrate/templates >creating /var/tmp/portage/dev-python/flask-migrate-2.1.1/work/Flask-Migrate-2.1.1-python2_7/lib/flask_migrate/templates/flask >copying flask_migrate/templates/flask/README -> /var/tmp/portage/dev-python/flask-migrate-2.1.1/work/Flask-Migrate-2.1.1-python2_7/lib/flask_migrate/templates/flask >copying flask_migrate/templates/flask/alembic.ini.mako -> /var/tmp/portage/dev-python/flask-migrate-2.1.1/work/Flask-Migrate-2.1.1-python2_7/lib/flask_migrate/templates/flask >copying flask_migrate/templates/flask/env.py -> /var/tmp/portage/dev-python/flask-migrate-2.1.1/work/Flask-Migrate-2.1.1-python2_7/lib/flask_migrate/templates/flask >copying flask_migrate/templates/flask/script.py.mako -> /var/tmp/portage/dev-python/flask-migrate-2.1.1/work/Flask-Migrate-2.1.1-python2_7/lib/flask_migrate/templates/flask >creating /var/tmp/portage/dev-python/flask-migrate-2.1.1/work/Flask-Migrate-2.1.1-python2_7/lib/flask_migrate/templates/flask-multidb >copying flask_migrate/templates/flask-multidb/README -> /var/tmp/portage/dev-python/flask-migrate-2.1.1/work/Flask-Migrate-2.1.1-python2_7/lib/flask_migrate/templates/flask-multidb >copying flask_migrate/templates/flask-multidb/alembic.ini.mako -> /var/tmp/portage/dev-python/flask-migrate-2.1.1/work/Flask-Migrate-2.1.1-python2_7/lib/flask_migrate/templates/flask-multidb >copying flask_migrate/templates/flask-multidb/env.py -> /var/tmp/portage/dev-python/flask-migrate-2.1.1/work/Flask-Migrate-2.1.1-python2_7/lib/flask_migrate/templates/flask-multidb >copying flask_migrate/templates/flask-multidb/script.py.mako -> /var/tmp/portage/dev-python/flask-migrate-2.1.1/work/Flask-Migrate-2.1.1-python2_7/lib/flask_migrate/templates/flask-multidb >warning: build_py: byte-compiling is disabled, skipping. > > * python3_5: running distutils-r1_run_phase distutils-r1_python_compile >/usr/bin/python3.5 setup.py build >running build >running build_py >creating /var/tmp/portage/dev-python/flask-migrate-2.1.1/work/Flask-Migrate-2.1.1-python3_5/lib/flask_migrate >copying flask_migrate/cli.py -> /var/tmp/portage/dev-python/flask-migrate-2.1.1/work/Flask-Migrate-2.1.1-python3_5/lib/flask_migrate >copying flask_migrate/__init__.py -> /var/tmp/portage/dev-python/flask-migrate-2.1.1/work/Flask-Migrate-2.1.1-python3_5/lib/flask_migrate >running egg_info >writing requirements to Flask_Migrate.egg-info/requires.txt >writing Flask_Migrate.egg-info/PKG-INFO >writing top-level names to Flask_Migrate.egg-info/top_level.txt >writing dependency_links to Flask_Migrate.egg-info/dependency_links.txt >writing entry points to Flask_Migrate.egg-info/entry_points.txt >reading manifest file 'Flask_Migrate.egg-info/SOURCES.txt' >reading manifest template 'MANIFEST.in' >writing manifest file 'Flask_Migrate.egg-info/SOURCES.txt' >creating /var/tmp/portage/dev-python/flask-migrate-2.1.1/work/Flask-Migrate-2.1.1-python3_5/lib/flask_migrate/templates >creating /var/tmp/portage/dev-python/flask-migrate-2.1.1/work/Flask-Migrate-2.1.1-python3_5/lib/flask_migrate/templates/flask >copying flask_migrate/templates/flask/README -> /var/tmp/portage/dev-python/flask-migrate-2.1.1/work/Flask-Migrate-2.1.1-python3_5/lib/flask_migrate/templates/flask >copying flask_migrate/templates/flask/alembic.ini.mako -> /var/tmp/portage/dev-python/flask-migrate-2.1.1/work/Flask-Migrate-2.1.1-python3_5/lib/flask_migrate/templates/flask >copying flask_migrate/templates/flask/env.py -> /var/tmp/portage/dev-python/flask-migrate-2.1.1/work/Flask-Migrate-2.1.1-python3_5/lib/flask_migrate/templates/flask >copying flask_migrate/templates/flask/script.py.mako -> /var/tmp/portage/dev-python/flask-migrate-2.1.1/work/Flask-Migrate-2.1.1-python3_5/lib/flask_migrate/templates/flask >creating /var/tmp/portage/dev-python/flask-migrate-2.1.1/work/Flask-Migrate-2.1.1-python3_5/lib/flask_migrate/templates/flask-multidb >copying flask_migrate/templates/flask-multidb/README -> /var/tmp/portage/dev-python/flask-migrate-2.1.1/work/Flask-Migrate-2.1.1-python3_5/lib/flask_migrate/templates/flask-multidb >copying flask_migrate/templates/flask-multidb/alembic.ini.mako -> /var/tmp/portage/dev-python/flask-migrate-2.1.1/work/Flask-Migrate-2.1.1-python3_5/lib/flask_migrate/templates/flask-multidb >copying flask_migrate/templates/flask-multidb/env.py -> /var/tmp/portage/dev-python/flask-migrate-2.1.1/work/Flask-Migrate-2.1.1-python3_5/lib/flask_migrate/templates/flask-multidb >copying flask_migrate/templates/flask-multidb/script.py.mako -> /var/tmp/portage/dev-python/flask-migrate-2.1.1/work/Flask-Migrate-2.1.1-python3_5/lib/flask_migrate/templates/flask-multidb >warning: build_py: byte-compiling is disabled, skipping. > >>>> Source compiled. >>>> Test phase: dev-python/flask-migrate-2.1.1 > * python2_7: running distutils-r1_run_phase python_test >test_alembic_version (tests.test_migrate.TestMigrate) ... ok >test_compare_type (tests.test_migrate.TestMigrate) ... ok >test_custom_directory (tests.test_migrate.TestMigrate) ... ok >test_migrate_upgrade (tests.test_migrate.TestMigrate) ... ok >test_alembic_version (tests.test_migrate_flaskcli.TestMigrate) ... ok >test_compare_type (tests.test_migrate_flaskcli.TestMigrate) ... FAIL >test_custom_directory (tests.test_migrate_flaskcli.TestMigrate) ... FAIL >test_migrate_upgrade (tests.test_migrate_flaskcli.TestMigrate) ... FAIL >test_multidb_migrate_upgrade (tests.test_multidb_migrate.TestMigrate) ... ok >test_multidb_migrate_upgrade (tests.test_multidb_migrate_flaskcli.TestMigrate) ... FAIL > >====================================================================== >FAIL: test_compare_type (tests.test_migrate_flaskcli.TestMigrate) >---------------------------------------------------------------------- >Traceback (most recent call last): > File "/var/tmp/portage/dev-python/flask-migrate-2.1.1/work/Flask-Migrate-2.1.1/tests/test_migrate_flaskcli.py", line 79, in test_compare_type > self.assertTrue(s == 0) >AssertionError: False is not true > >====================================================================== >FAIL: test_custom_directory (tests.test_migrate_flaskcli.TestMigrate) >---------------------------------------------------------------------- >Traceback (most recent call last): > File "/var/tmp/portage/dev-python/flask-migrate-2.1.1/work/Flask-Migrate-2.1.1/tests/test_migrate_flaskcli.py", line 67, in test_custom_directory > self.assertTrue(s == 0) >AssertionError: False is not true > >====================================================================== >FAIL: test_migrate_upgrade (tests.test_migrate_flaskcli.TestMigrate) >---------------------------------------------------------------------- >Traceback (most recent call last): > File "/var/tmp/portage/dev-python/flask-migrate-2.1.1/work/Flask-Migrate-2.1.1/tests/test_migrate_flaskcli.py", line 55, in test_migrate_upgrade > self.assertTrue(s == 0) >AssertionError: False is not true > >====================================================================== >FAIL: test_multidb_migrate_upgrade (tests.test_multidb_migrate_flaskcli.TestMigrate) >---------------------------------------------------------------------- >Traceback (most recent call last): > File "/var/tmp/portage/dev-python/flask-migrate-2.1.1/work/Flask-Migrate-2.1.1/tests/test_multidb_migrate_flaskcli.py", line 44, in test_multidb_migrate_upgrade > self.assertTrue(s == 0) >AssertionError: False is not true > >---------------------------------------------------------------------- >Ran 10 tests in 19.490s > >FAILED (failures=4) > * ERROR: dev-python/flask-migrate-2.1.1::gentoo failed (test phase): > * Testing failed with python2.7 > * > * Call stack: > * ebuild.sh, line 124: Called src_test > * environment, line 2682: Called distutils-r1_src_test > * environment, line 858: Called _distutils-r1_run_foreach_impl 'python_test' > * environment, line 304: Called python_foreach_impl 'distutils-r1_run_phase' 'python_test' > * environment, line 2206: Called multibuild_foreach_variant '_python_multibuild_wrapper' 'distutils-r1_run_phase' 'python_test' > * environment, line 1512: Called _multibuild_run '_python_multibuild_wrapper' 'distutils-r1_run_phase' 'python_test' > * environment, line 1510: Called _python_multibuild_wrapper 'distutils-r1_run_phase' 'python_test' > * environment, line 528: Called distutils-r1_run_phase 'python_test' > * environment, line 789: Called python_test > * environment, line 2562: Called die > * The specific snippet of code: > * nosetests -v || die "Testing failed with ${EPYTHON}" > * > * If you need support, post the output of `emerge --info '=dev-python/flask-migrate-2.1.1::gentoo'`, > * the complete build log and the output of `emerge -pqv '=dev-python/flask-migrate-2.1.1::gentoo'`. > * The complete build log is located at '/var/tmp/portage/dev-python/flask-migrate-2.1.1/temp/build.log'. > * The ebuild environment file is located at '/var/tmp/portage/dev-python/flask-migrate-2.1.1/temp/environment'. > * Working directory: '/var/tmp/portage/dev-python/flask-migrate-2.1.1/work/Flask-Migrate-2.1.1' > * S: '/var/tmp/portage/dev-python/flask-migrate-2.1.1/work/Flask-Migrate-2.1.1'
You cannot view the attachment while viewing its details because your browser does not support IFRAMEs.
View the attachment on a separate page
.
View Attachment As Raw
Actions:
View
Attachments on
bug 641714
: 510980