Go to:
Gentoo Home
Documentation
Forums
Lists
Bugs
Planet
Store
Wiki
Get Gentoo!
Gentoo's Bugzilla – Attachment 491444 Details for
Bug 629598
dev-util/open-vcdiff-0.8.4-r1 : src/varint_bigendian_test.cc:109:66: error: narrowing conversion of 255 from int to char inside { } [-Wnarrowing]
Home
|
New
–
[Ex]
|
Browse
|
Search
|
Privacy Policy
|
[?]
|
Reports
|
Requests
|
Help
|
New Account
|
Log In
[x]
|
Forgot Password
Login:
[x]
dev-util:open-vcdiff-0.8.4-r1:20170901-211804.log
dev-util:open-vcdiff-0.8.4-r1:20170901-211804.log (text/plain), 66.31 KB, created by
Toralf Förster
on 2017-09-02 07:57:05 UTC
(
hide
)
Description:
dev-util:open-vcdiff-0.8.4-r1:20170901-211804.log
Filename:
MIME Type:
Creator:
Toralf Förster
Created:
2017-09-02 07:57:05 UTC
Size:
66.31 KB
patch
obsolete
> * Package: dev-util/open-vcdiff-0.8.4-r1 > * Repository: gentoo > * USE: abi_x86_64 amd64 elibc_glibc kernel_linux userland_GNU > * FEATURES: network-sandbox preserve-libs sandbox test userpriv usersandbox >>>> Unpacking source... >>>> Unpacking open-vcdiff-0.8.4.tar.gz to /var/tmp/portage/dev-util/open-vcdiff-0.8.4-r1/work >>>> Source unpacked in /var/tmp/portage/dev-util/open-vcdiff-0.8.4-r1/work >>>> Preparing source in /var/tmp/portage/dev-util/open-vcdiff-0.8.4-r1/work/open-vcdiff-0.8.4 ... > * Applying open-vcdiff-0.8.4-gcc6.patch ... > [ ok ] >>>> Source prepared. >>>> Configuring source in /var/tmp/portage/dev-util/open-vcdiff-0.8.4-r1/work/open-vcdiff-0.8.4 ... > * econf: updating open-vcdiff-0.8.4/config.sub with /usr/share/gnuconfig/config.sub > * econf: updating open-vcdiff-0.8.4/config.guess with /usr/share/gnuconfig/config.guess >./configure --prefix=/usr --build=x86_64-pc-linux-gnu --host=x86_64-pc-linux-gnu --mandir=/usr/share/man --infodir=/usr/share/info --datadir=/usr/share --sysconfdir=/etc --localstatedir=/var/lib --disable-dependency-tracking --docdir=/usr/share/doc/open-vcdiff-0.8.4-r1 --htmldir=/usr/share/doc/open-vcdiff-0.8.4-r1/html --libdir=/usr/lib64 --disable-static >checking for a BSD-compatible install... /usr/lib/portage/python3.4/ebuild-helpers/xattr/install -c >checking whether build environment is sane... yes >checking for a thread-safe mkdir -p... /bin/mkdir -p >checking for gawk... gawk >checking whether make sets $(MAKE)... yes >checking for x86_64-pc-linux-gnu-gcc... x86_64-pc-linux-gnu-gcc >checking whether the C compiler works... yes >checking for C compiler default output file name... a.out >checking for suffix of executables... >checking whether we are cross compiling... no >checking for suffix of object files... o >checking whether we are using the GNU C compiler... yes >checking whether x86_64-pc-linux-gnu-gcc accepts -g... yes >checking for x86_64-pc-linux-gnu-gcc option to accept ISO C89... none needed >checking for style of include used by make... GNU >checking dependency style of x86_64-pc-linux-gnu-gcc... none >checking how to run the C preprocessor... x86_64-pc-linux-gnu-gcc -E >checking for x86_64-pc-linux-gnu-g++... x86_64-pc-linux-gnu-g++ >checking whether we are using the GNU C++ compiler... yes >checking whether x86_64-pc-linux-gnu-g++ accepts -g... yes >checking dependency style of x86_64-pc-linux-gnu-g++... none >checking build system type... x86_64-pc-linux-gnu >checking host system type... x86_64-pc-linux-gnu >checking how to print strings... printf >checking for a sed that does not truncate output... /bin/sed >checking for grep that handles long lines and -e... /bin/grep >checking for egrep... /bin/grep -E >checking for fgrep... /bin/grep -F >checking for ld used by x86_64-pc-linux-gnu-gcc... /usr/x86_64-pc-linux-gnu/bin/ld >checking if the linker (/usr/x86_64-pc-linux-gnu/bin/ld) is GNU ld... yes >checking for BSD- or MS-compatible name lister (nm)... /usr/bin/nm -B >checking the name lister (/usr/bin/nm -B) interface... BSD nm >checking whether ln -s works... yes >checking the maximum length of command line arguments... 1572864 >checking whether the shell understands some XSI constructs... yes >checking whether the shell understands "+="... yes >checking how to convert x86_64-pc-linux-gnu file names to x86_64-pc-linux-gnu format... func_convert_file_noop >checking how to convert x86_64-pc-linux-gnu file names to toolchain format... func_convert_file_noop >checking for /usr/x86_64-pc-linux-gnu/bin/ld option to reload object files... -r >checking for x86_64-pc-linux-gnu-objdump... x86_64-pc-linux-gnu-objdump >checking how to recognize dependent libraries... pass_all >checking for x86_64-pc-linux-gnu-dlltool... no >checking for dlltool... no >checking how to associate runtime and link libraries... printf %s\n >checking for x86_64-pc-linux-gnu-ar... x86_64-pc-linux-gnu-ar >checking for archiver @FILE support... @ >checking for x86_64-pc-linux-gnu-strip... x86_64-pc-linux-gnu-strip >checking for x86_64-pc-linux-gnu-ranlib... x86_64-pc-linux-gnu-ranlib >checking command to parse /usr/bin/nm -B output from x86_64-pc-linux-gnu-gcc object... ok >checking for sysroot... no >checking for x86_64-pc-linux-gnu-mt... no >checking for mt... no >checking if : is a manifest tool... no >checking for ANSI C header files... yes >checking for sys/types.h... yes >checking for sys/stat.h... yes >checking for stdlib.h... yes >checking for string.h... yes >checking for memory.h... yes >checking for strings.h... yes >checking for inttypes.h... yes >checking for stdint.h... yes >checking for unistd.h... yes >checking for dlfcn.h... yes >checking for objdir... .libs >checking if x86_64-pc-linux-gnu-gcc supports -fno-rtti -fno-exceptions... no >checking for x86_64-pc-linux-gnu-gcc option to produce PIC... -fPIC -DPIC >checking if x86_64-pc-linux-gnu-gcc PIC flag -fPIC -DPIC works... yes >checking if x86_64-pc-linux-gnu-gcc static flag -static works... yes >checking if x86_64-pc-linux-gnu-gcc supports -c -o file.o... yes >checking if x86_64-pc-linux-gnu-gcc supports -c -o file.o... (cached) yes >checking whether the x86_64-pc-linux-gnu-gcc linker (/usr/x86_64-pc-linux-gnu/bin/ld -m elf_x86_64) supports shared libraries... yes >checking whether -lc should be explicitly linked in... no >checking dynamic linker characteristics... GNU/Linux ld.so >checking how to hardcode library paths into programs... immediate >checking whether stripping libraries is possible... yes >checking if libtool supports shared libraries... yes >checking whether to build shared libraries... yes >checking whether to build static libraries... no >checking how to run the C++ preprocessor... x86_64-pc-linux-gnu-g++ -E >checking for ld used by x86_64-pc-linux-gnu-g++... /usr/x86_64-pc-linux-gnu/bin/ld -m elf_x86_64 >checking if the linker (/usr/x86_64-pc-linux-gnu/bin/ld -m elf_x86_64) is GNU ld... yes >checking whether the x86_64-pc-linux-gnu-g++ linker (/usr/x86_64-pc-linux-gnu/bin/ld -m elf_x86_64) supports shared libraries... yes >checking for x86_64-pc-linux-gnu-g++ option to produce PIC... -fPIC -DPIC >checking if x86_64-pc-linux-gnu-g++ PIC flag -fPIC -DPIC works... yes >checking if x86_64-pc-linux-gnu-g++ static flag -static works... yes >checking if x86_64-pc-linux-gnu-g++ supports -c -o file.o... yes >checking if x86_64-pc-linux-gnu-g++ supports -c -o file.o... (cached) yes >checking whether the x86_64-pc-linux-gnu-g++ linker (/usr/x86_64-pc-linux-gnu/bin/ld -m elf_x86_64) supports shared libraries... yes >checking dynamic linker characteristics... (cached) GNU/Linux ld.so >checking how to hardcode library paths into programs... immediate >checking for ANSI C header files... (cached) yes >checking ext/rope usability... no >checking ext/rope presence... no >checking for ext/rope... no >checking getopt.h usability... yes >checking getopt.h presence... yes >checking for getopt.h... yes >checking malloc.h usability... yes >checking malloc.h presence... yes >checking for malloc.h... yes >checking sys/mman.h usability... yes >checking sys/mman.h presence... yes >checking for sys/mman.h... yes >checking sys/time.h usability... yes >checking sys/time.h presence... yes >checking for sys/time.h... yes >checking for unistd.h... (cached) yes >checking windows.h usability... no >checking windows.h presence... no >checking for windows.h... no >checking for gettimeofday... yes >checking for QueryPerformanceCounter... no >checking for memalign... yes >checking for posix_memalign... yes >checking for mprotect... yes >checking for stdint.h... (cached) yes >checking for sys/types.h... (cached) yes >checking for inttypes.h... (cached) yes >checking fnmatch.h usability... yes >checking fnmatch.h presence... yes >checking for fnmatch.h... yes >checking for uint16_t... yes >checking for u_int16_t... yes >checking for __int16... no >checking for strtoll... yes >checking for strtoq... yes >checking for setenv... yes >checking for putenv... yes >checking for __attribute__... yes >checking for the pthreads library -lpthreads... no >checking whether pthreads work without any flags... no >checking whether pthreads work with -Kthread... no >checking whether pthreads work with -kthread... no >checking for the pthreads library -llthread... no >checking whether pthreads work with -pthread... yes >checking for joinable pthread attribute... PTHREAD_CREATE_JOINABLE >checking if more special flags are required for pthreads... no >checking whether to check for GCC pthread/shared inconsistencies... yes >checking whether -pthread is sufficient with -shared... yes >checking whether the compiler implements namespaces... yes >checking what namespace STL code is in... std >configure: creating ./config.status >config.status: creating Makefile >config.status: creating gflags/src/gflags/gflags.h >config.status: creating gflags/src/gflags/gflags_completions.h >config.status: creating src/config.h >config.status: executing depfiles commands >config.status: executing libtool commands >>>> Source configured. >>>> Compiling source in /var/tmp/portage/dev-util/open-vcdiff-0.8.4-r1/work/open-vcdiff-0.8.4 ... >make -j1 >/bin/sh ./libtool --tag=CC --mode=compile x86_64-pc-linux-gnu-gcc -DHAVE_CONFIG_H -I. -I./src -I./src -I./src/zlib -I./gflags/src -I./gtest -I./gtest/include -O2 -pipe -march=native -Wall -c -o adler32.lo `test -f 'src/zlib/adler32.c' || echo './'`src/zlib/adler32.c >libtool: compile: x86_64-pc-linux-gnu-gcc -DHAVE_CONFIG_H -I. -I./src -I./src -I./src/zlib -I./gflags/src -I./gtest -I./gtest/include -O2 -pipe -march=native -Wall -c src/zlib/adler32.c -fPIC -DPIC -o .libs/adler32.o >/bin/sh ./libtool --tag=CXX --mode=compile x86_64-pc-linux-gnu-g++ -DHAVE_CONFIG_H -I. -I./src -I./src -I./src/zlib -I./gflags/src -I./gtest -I./gtest/include -DNDEBUG -DNO_THREADS -DGTEST_HAS_TR1_TUPLE=0 -Wall -Wwrite-strings -Woverloaded-virtual -W -Werror=terminate -O2 -pipe -march=native -c -o addrcache.lo `test -f 'src/addrcache.cc' || echo './'`src/addrcache.cc >libtool: compile: x86_64-pc-linux-gnu-g++ -DHAVE_CONFIG_H -I. -I./src -I./src -I./src/zlib -I./gflags/src -I./gtest -I./gtest/include -DNDEBUG -DNO_THREADS -DGTEST_HAS_TR1_TUPLE=0 -Wall -Wwrite-strings -Woverloaded-virtual -W -Werror=terminate -O2 -pipe -march=native -c src/addrcache.cc -fPIC -DPIC -o .libs/addrcache.o >/bin/sh ./libtool --tag=CXX --mode=compile x86_64-pc-linux-gnu-g++ -DHAVE_CONFIG_H -I. -I./src -I./src -I./src/zlib -I./gflags/src -I./gtest -I./gtest/include -DNDEBUG -DNO_THREADS -DGTEST_HAS_TR1_TUPLE=0 -Wall -Wwrite-strings -Woverloaded-virtual -W -Werror=terminate -O2 -pipe -march=native -c -o codetable.lo `test -f 'src/codetable.cc' || echo './'`src/codetable.cc >libtool: compile: x86_64-pc-linux-gnu-g++ -DHAVE_CONFIG_H -I. -I./src -I./src -I./src/zlib -I./gflags/src -I./gtest -I./gtest/include -DNDEBUG -DNO_THREADS -DGTEST_HAS_TR1_TUPLE=0 -Wall -Wwrite-strings -Woverloaded-virtual -W -Werror=terminate -O2 -pipe -march=native -c src/codetable.cc -fPIC -DPIC -o .libs/codetable.o >/bin/sh ./libtool --tag=CXX --mode=compile x86_64-pc-linux-gnu-g++ -DHAVE_CONFIG_H -I. -I./src -I./src -I./src/zlib -I./gflags/src -I./gtest -I./gtest/include -DNDEBUG -DNO_THREADS -DGTEST_HAS_TR1_TUPLE=0 -Wall -Wwrite-strings -Woverloaded-virtual -W -Werror=terminate -O2 -pipe -march=native -c -o logging.lo `test -f 'src/logging.cc' || echo './'`src/logging.cc >libtool: compile: x86_64-pc-linux-gnu-g++ -DHAVE_CONFIG_H -I. -I./src -I./src -I./src/zlib -I./gflags/src -I./gtest -I./gtest/include -DNDEBUG -DNO_THREADS -DGTEST_HAS_TR1_TUPLE=0 -Wall -Wwrite-strings -Woverloaded-virtual -W -Werror=terminate -O2 -pipe -march=native -c src/logging.cc -fPIC -DPIC -o .libs/logging.o >/bin/sh ./libtool --tag=CXX --mode=compile x86_64-pc-linux-gnu-g++ -DHAVE_CONFIG_H -I. -I./src -I./src -I./src/zlib -I./gflags/src -I./gtest -I./gtest/include -DNDEBUG -DNO_THREADS -DGTEST_HAS_TR1_TUPLE=0 -Wall -Wwrite-strings -Woverloaded-virtual -W -Werror=terminate -O2 -pipe -march=native -c -o varint_bigendian.lo `test -f 'src/varint_bigendian.cc' || echo './'`src/varint_bigendian.cc >libtool: compile: x86_64-pc-linux-gnu-g++ -DHAVE_CONFIG_H -I. -I./src -I./src -I./src/zlib -I./gflags/src -I./gtest -I./gtest/include -DNDEBUG -DNO_THREADS -DGTEST_HAS_TR1_TUPLE=0 -Wall -Wwrite-strings -Woverloaded-virtual -W -Werror=terminate -O2 -pipe -march=native -c src/varint_bigendian.cc -fPIC -DPIC -o .libs/varint_bigendian.o >/bin/sh ./libtool --tag=CXX --mode=link x86_64-pc-linux-gnu-g++ -DNDEBUG -DNO_THREADS -DGTEST_HAS_TR1_TUPLE=0 -Wall -Wwrite-strings -Woverloaded-virtual -W -Werror=terminate -O2 -pipe -march=native -no-undefined -Wl,-O1 -Wl,--as-needed -o libvcdcom.la -rpath /usr/lib64 adler32.lo addrcache.lo codetable.lo logging.lo varint_bigendian.lo >libtool: link: x86_64-pc-linux-gnu-g++ -fPIC -DPIC -shared -nostdlib /usr/lib/gcc/x86_64-pc-linux-gnu/6.4.0/../../../../lib64/crti.o /usr/lib/gcc/x86_64-pc-linux-gnu/6.4.0/crtbeginS.o .libs/adler32.o .libs/addrcache.o .libs/codetable.o .libs/logging.o .libs/varint_bigendian.o -L/usr/lib/gcc/x86_64-pc-linux-gnu/6.4.0 -L/usr/lib/gcc/x86_64-pc-linux-gnu/6.4.0/../../../../lib64 -L/lib/../lib64 -L/usr/lib/../lib64 -L/usr/lib/gcc/x86_64-pc-linux-gnu/6.4.0/../../../../x86_64-pc-linux-gnu/lib -L/usr/lib/gcc/x86_64-pc-linux-gnu/6.4.0/../../.. -lstdc++ -lm -lc -lgcc_s /usr/lib/gcc/x86_64-pc-linux-gnu/6.4.0/crtendS.o /usr/lib/gcc/x86_64-pc-linux-gnu/6.4.0/../../../../lib64/crtn.o -O2 -march=native -Wl,-O1 -Wl,--as-needed -Wl,-soname -Wl,libvcdcom.so.0 -o .libs/libvcdcom.so.0.0.0 >libtool: link: (cd ".libs" && rm -f "libvcdcom.so.0" && ln -s "libvcdcom.so.0.0.0" "libvcdcom.so.0") >libtool: link: (cd ".libs" && rm -f "libvcdcom.so" && ln -s "libvcdcom.so.0.0.0" "libvcdcom.so") >libtool: link: ( cd ".libs" && rm -f "libvcdcom.la" && ln -s "../libvcdcom.la" "libvcdcom.la" ) >/bin/sh ./libtool --tag=CXX --mode=compile x86_64-pc-linux-gnu-g++ -DHAVE_CONFIG_H -I. -I./src -I./src -I./src/zlib -I./gflags/src -I./gtest -I./gtest/include -DNDEBUG -DNO_THREADS -DGTEST_HAS_TR1_TUPLE=0 -Wall -Wwrite-strings -Woverloaded-virtual -W -Werror=terminate -O2 -pipe -march=native -c -o decodetable.lo `test -f 'src/decodetable.cc' || echo './'`src/decodetable.cc >libtool: compile: x86_64-pc-linux-gnu-g++ -DHAVE_CONFIG_H -I. -I./src -I./src -I./src/zlib -I./gflags/src -I./gtest -I./gtest/include -DNDEBUG -DNO_THREADS -DGTEST_HAS_TR1_TUPLE=0 -Wall -Wwrite-strings -Woverloaded-virtual -W -Werror=terminate -O2 -pipe -march=native -c src/decodetable.cc -fPIC -DPIC -o .libs/decodetable.o >In file included from src/decodetable.cc:19:0: >src/decodetable.h:136:8: warning: 'template<class> class std::auto_ptr' is deprecated [-Wdeprecated-declarations] > std::auto_ptr<VCDiffCodeTableData> non_default_code_table_data_; > ^~~~~~~~ >In file included from /usr/lib/gcc/x86_64-pc-linux-gnu/6.4.0/include/g++-v6/memory:81:0, > from src/decodetable.h:21, > from src/decodetable.cc:19: >/usr/lib/gcc/x86_64-pc-linux-gnu/6.4.0/include/g++-v6/bits/unique_ptr.h:49:28: note: declared here > template<typename> class auto_ptr; > ^~~~~~~~ >/bin/sh ./libtool --tag=CXX --mode=compile x86_64-pc-linux-gnu-g++ -DHAVE_CONFIG_H -I. -I./src -I./src -I./src/zlib -I./gflags/src -I./gtest -I./gtest/include -DNDEBUG -DNO_THREADS -DGTEST_HAS_TR1_TUPLE=0 -Wall -Wwrite-strings -Woverloaded-virtual -W -Werror=terminate -O2 -pipe -march=native -c -o headerparser.lo `test -f 'src/headerparser.cc' || echo './'`src/headerparser.cc >libtool: compile: x86_64-pc-linux-gnu-g++ -DHAVE_CONFIG_H -I. -I./src -I./src -I./src/zlib -I./gflags/src -I./gtest -I./gtest/include -DNDEBUG -DNO_THREADS -DGTEST_HAS_TR1_TUPLE=0 -Wall -Wwrite-strings -Woverloaded-virtual -W -Werror=terminate -O2 -pipe -march=native -c src/headerparser.cc -fPIC -DPIC -o .libs/headerparser.o >/bin/sh ./libtool --tag=CXX --mode=compile x86_64-pc-linux-gnu-g++ -DHAVE_CONFIG_H -I. -I./src -I./src -I./src/zlib -I./gflags/src -I./gtest -I./gtest/include -DNDEBUG -DNO_THREADS -DGTEST_HAS_TR1_TUPLE=0 -Wall -Wwrite-strings -Woverloaded-virtual -W -Werror=terminate -O2 -pipe -march=native -c -o vcdecoder.lo `test -f 'src/vcdecoder.cc' || echo './'`src/vcdecoder.cc >libtool: compile: x86_64-pc-linux-gnu-g++ -DHAVE_CONFIG_H -I. -I./src -I./src -I./src/zlib -I./gflags/src -I./gtest -I./gtest/include -DNDEBUG -DNO_THREADS -DGTEST_HAS_TR1_TUPLE=0 -Wall -Wwrite-strings -Woverloaded-virtual -W -Werror=terminate -O2 -pipe -march=native -c src/vcdecoder.cc -fPIC -DPIC -o .libs/vcdecoder.o >In file included from src/vcdecoder.cc:38:0: >src/decodetable.h:136:8: warning: 'template<class> class std::auto_ptr' is deprecated [-Wdeprecated-declarations] > std::auto_ptr<VCDiffCodeTableData> non_default_code_table_data_; > ^~~~~~~~ >In file included from /usr/lib/gcc/x86_64-pc-linux-gnu/6.4.0/include/g++-v6/memory:81:0, > from src/decodetable.h:21, > from src/vcdecoder.cc:38: >/usr/lib/gcc/x86_64-pc-linux-gnu/6.4.0/include/g++-v6/bits/unique_ptr.h:49:28: note: declared here > template<typename> class auto_ptr; > ^~~~~~~~ >/bin/sh ./libtool --tag=CXX --mode=link x86_64-pc-linux-gnu-g++ -DNDEBUG -DNO_THREADS -DGTEST_HAS_TR1_TUPLE=0 -Wall -Wwrite-strings -Woverloaded-virtual -W -Werror=terminate -O2 -pipe -march=native -no-undefined -Wl,-O1 -Wl,--as-needed -o libvcddec.la -rpath /usr/lib64 decodetable.lo headerparser.lo vcdecoder.lo libvcdcom.la >libtool: link: x86_64-pc-linux-gnu-g++ -fPIC -DPIC -shared -nostdlib /usr/lib/gcc/x86_64-pc-linux-gnu/6.4.0/../../../../lib64/crti.o /usr/lib/gcc/x86_64-pc-linux-gnu/6.4.0/crtbeginS.o .libs/decodetable.o .libs/headerparser.o .libs/vcdecoder.o -Wl,-rpath -Wl,/var/tmp/portage/dev-util/open-vcdiff-0.8.4-r1/work/open-vcdiff-0.8.4/.libs ./.libs/libvcdcom.so -L/usr/lib/gcc/x86_64-pc-linux-gnu/6.4.0 -L/usr/lib/gcc/x86_64-pc-linux-gnu/6.4.0/../../../../lib64 -L/lib/../lib64 -L/usr/lib/../lib64 -L/usr/lib/gcc/x86_64-pc-linux-gnu/6.4.0/../../../../x86_64-pc-linux-gnu/lib -L/usr/lib/gcc/x86_64-pc-linux-gnu/6.4.0/../../.. -lstdc++ -lm -lc -lgcc_s /usr/lib/gcc/x86_64-pc-linux-gnu/6.4.0/crtendS.o /usr/lib/gcc/x86_64-pc-linux-gnu/6.4.0/../../../../lib64/crtn.o -O2 -march=native -Wl,-O1 -Wl,--as-needed -Wl,-soname -Wl,libvcddec.so.0 -o .libs/libvcddec.so.0.0.0 >libtool: link: (cd ".libs" && rm -f "libvcddec.so.0" && ln -s "libvcddec.so.0.0.0" "libvcddec.so.0") >libtool: link: (cd ".libs" && rm -f "libvcddec.so" && ln -s "libvcddec.so.0.0.0" "libvcddec.so") >libtool: link: ( cd ".libs" && rm -f "libvcddec.la" && ln -s "../libvcddec.la" "libvcddec.la" ) >/bin/sh ./libtool --tag=CXX --mode=compile x86_64-pc-linux-gnu-g++ -DHAVE_CONFIG_H -I. -I./src -I./src -I./src/zlib -I./gflags/src -I./gtest -I./gtest/include -DNDEBUG -DNO_THREADS -DGTEST_HAS_TR1_TUPLE=0 -Wall -Wwrite-strings -Woverloaded-virtual -W -Werror=terminate -O2 -pipe -march=native -c -o blockhash.lo `test -f 'src/blockhash.cc' || echo './'`src/blockhash.cc >libtool: compile: x86_64-pc-linux-gnu-g++ -DHAVE_CONFIG_H -I. -I./src -I./src -I./src/zlib -I./gflags/src -I./gtest -I./gtest/include -DNDEBUG -DNO_THREADS -DGTEST_HAS_TR1_TUPLE=0 -Wall -Wwrite-strings -Woverloaded-virtual -W -Werror=terminate -O2 -pipe -march=native -c src/blockhash.cc -fPIC -DPIC -o .libs/blockhash.o >In file included from src/blockhash.cc:20:0: >src/rolling_hash.h: In static member function 'static void open_vcdiff::RollingHash<window_size>::Init()': >src/rolling_hash.h:178:22: warning: typedef 'RollingHash_window_size_must_be_at_least_2' locally defined but not used [-Wunused-local-typedefs] > RollingHash_window_size_must_be_at_least_2); > ^ >src/compile_assert.h:55:7: note: in definition of macro 'VCD_COMPILE_ASSERT' > msg[static_cast<bool>(expr) ? 1 : -1] > ^~~ >/bin/sh ./libtool --tag=CXX --mode=compile x86_64-pc-linux-gnu-g++ -DHAVE_CONFIG_H -I. -I./src -I./src -I./src/zlib -I./gflags/src -I./gtest -I./gtest/include -DNDEBUG -DNO_THREADS -DGTEST_HAS_TR1_TUPLE=0 -Wall -Wwrite-strings -Woverloaded-virtual -W -Werror=terminate -O2 -pipe -march=native -c -o encodetable.lo `test -f 'src/encodetable.cc' || echo './'`src/encodetable.cc >libtool: compile: x86_64-pc-linux-gnu-g++ -DHAVE_CONFIG_H -I. -I./src -I./src -I./src/zlib -I./gflags/src -I./gtest -I./gtest/include -DNDEBUG -DNO_THREADS -DGTEST_HAS_TR1_TUPLE=0 -Wall -Wwrite-strings -Woverloaded-virtual -W -Werror=terminate -O2 -pipe -march=native -c src/encodetable.cc -fPIC -DPIC -o .libs/encodetable.o >/bin/sh ./libtool --tag=CXX --mode=compile x86_64-pc-linux-gnu-g++ -DHAVE_CONFIG_H -I. -I./src -I./src -I./src/zlib -I./gflags/src -I./gtest -I./gtest/include -DNDEBUG -DNO_THREADS -DGTEST_HAS_TR1_TUPLE=0 -Wall -Wwrite-strings -Woverloaded-virtual -W -Werror=terminate -O2 -pipe -march=native -c -o instruction_map.lo `test -f 'src/instruction_map.cc' || echo './'`src/instruction_map.cc >libtool: compile: x86_64-pc-linux-gnu-g++ -DHAVE_CONFIG_H -I. -I./src -I./src -I./src/zlib -I./gflags/src -I./gtest -I./gtest/include -DNDEBUG -DNO_THREADS -DGTEST_HAS_TR1_TUPLE=0 -Wall -Wwrite-strings -Woverloaded-virtual -W -Werror=terminate -O2 -pipe -march=native -c src/instruction_map.cc -fPIC -DPIC -o .libs/instruction_map.o >/bin/sh ./libtool --tag=CXX --mode=compile x86_64-pc-linux-gnu-g++ -DHAVE_CONFIG_H -I. -I./src -I./src -I./src/zlib -I./gflags/src -I./gtest -I./gtest/include -DNDEBUG -DNO_THREADS -DGTEST_HAS_TR1_TUPLE=0 -Wall -Wwrite-strings -Woverloaded-virtual -W -Werror=terminate -O2 -pipe -march=native -c -o jsonwriter.lo `test -f 'src/jsonwriter.cc' || echo './'`src/jsonwriter.cc >libtool: compile: x86_64-pc-linux-gnu-g++ -DHAVE_CONFIG_H -I. -I./src -I./src -I./src/zlib -I./gflags/src -I./gtest -I./gtest/include -DNDEBUG -DNO_THREADS -DGTEST_HAS_TR1_TUPLE=0 -Wall -Wwrite-strings -Woverloaded-virtual -W -Werror=terminate -O2 -pipe -march=native -c src/jsonwriter.cc -fPIC -DPIC -o .libs/jsonwriter.o >/bin/sh ./libtool --tag=CXX --mode=compile x86_64-pc-linux-gnu-g++ -DHAVE_CONFIG_H -I. -I./src -I./src -I./src/zlib -I./gflags/src -I./gtest -I./gtest/include -DNDEBUG -DNO_THREADS -DGTEST_HAS_TR1_TUPLE=0 -Wall -Wwrite-strings -Woverloaded-virtual -W -Werror=terminate -O2 -pipe -march=native -c -o vcdiffengine.lo `test -f 'src/vcdiffengine.cc' || echo './'`src/vcdiffengine.cc >libtool: compile: x86_64-pc-linux-gnu-g++ -DHAVE_CONFIG_H -I. -I./src -I./src -I./src/zlib -I./gflags/src -I./gtest -I./gtest/include -DNDEBUG -DNO_THREADS -DGTEST_HAS_TR1_TUPLE=0 -Wall -Wwrite-strings -Woverloaded-virtual -W -Werror=terminate -O2 -pipe -march=native -c src/vcdiffengine.cc -fPIC -DPIC -o .libs/vcdiffengine.o >In file included from src/rolling_hash.h:20:0, > from src/vcdiffengine.cc:22: >src/rolling_hash.h: In static member function 'static void open_vcdiff::RollingHash<window_size>::Init()': >src/rolling_hash.h:178:22: warning: typedef 'RollingHash_window_size_must_be_at_least_2' locally defined but not used [-Wunused-local-typedefs] > RollingHash_window_size_must_be_at_least_2); > ^ >src/compile_assert.h:55:7: note: in definition of macro 'VCD_COMPILE_ASSERT' > msg[static_cast<bool>(expr) ? 1 : -1] > ^~~ >/bin/sh ./libtool --tag=CXX --mode=compile x86_64-pc-linux-gnu-g++ -DHAVE_CONFIG_H -I. -I./src -I./src -I./src/zlib -I./gflags/src -I./gtest -I./gtest/include -DNDEBUG -DNO_THREADS -DGTEST_HAS_TR1_TUPLE=0 -Wall -Wwrite-strings -Woverloaded-virtual -W -Werror=terminate -O2 -pipe -march=native -c -o vcencoder.lo `test -f 'src/vcencoder.cc' || echo './'`src/vcencoder.cc >libtool: compile: x86_64-pc-linux-gnu-g++ -DHAVE_CONFIG_H -I. -I./src -I./src -I./src/zlib -I./gflags/src -I./gtest -I./gtest/include -DNDEBUG -DNO_THREADS -DGTEST_HAS_TR1_TUPLE=0 -Wall -Wwrite-strings -Woverloaded-virtual -W -Werror=terminate -O2 -pipe -march=native -c src/vcencoder.cc -fPIC -DPIC -o .libs/vcencoder.o >/bin/sh ./libtool --tag=CXX --mode=link x86_64-pc-linux-gnu-g++ -DNDEBUG -DNO_THREADS -DGTEST_HAS_TR1_TUPLE=0 -Wall -Wwrite-strings -Woverloaded-virtual -W -Werror=terminate -O2 -pipe -march=native -no-undefined -Wl,-O1 -Wl,--as-needed -o libvcdenc.la -rpath /usr/lib64 blockhash.lo encodetable.lo instruction_map.lo jsonwriter.lo vcdiffengine.lo vcencoder.lo libvcdcom.la >libtool: link: x86_64-pc-linux-gnu-g++ -fPIC -DPIC -shared -nostdlib /usr/lib/gcc/x86_64-pc-linux-gnu/6.4.0/../../../../lib64/crti.o /usr/lib/gcc/x86_64-pc-linux-gnu/6.4.0/crtbeginS.o .libs/blockhash.o .libs/encodetable.o .libs/instruction_map.o .libs/jsonwriter.o .libs/vcdiffengine.o .libs/vcencoder.o -Wl,-rpath -Wl,/var/tmp/portage/dev-util/open-vcdiff-0.8.4-r1/work/open-vcdiff-0.8.4/.libs ./.libs/libvcdcom.so -L/usr/lib/gcc/x86_64-pc-linux-gnu/6.4.0 -L/usr/lib/gcc/x86_64-pc-linux-gnu/6.4.0/../../../../lib64 -L/lib/../lib64 -L/usr/lib/../lib64 -L/usr/lib/gcc/x86_64-pc-linux-gnu/6.4.0/../../../../x86_64-pc-linux-gnu/lib -L/usr/lib/gcc/x86_64-pc-linux-gnu/6.4.0/../../.. -lstdc++ -lm -lc -lgcc_s /usr/lib/gcc/x86_64-pc-linux-gnu/6.4.0/crtendS.o /usr/lib/gcc/x86_64-pc-linux-gnu/6.4.0/../../../../lib64/crtn.o -O2 -march=native -Wl,-O1 -Wl,--as-needed -Wl,-soname -Wl,libvcdenc.so.0 -o .libs/libvcdenc.so.0.0.0 >libtool: link: (cd ".libs" && rm -f "libvcdenc.so.0" && ln -s "libvcdenc.so.0.0.0" "libvcdenc.so.0") >libtool: link: (cd ".libs" && rm -f "libvcdenc.so" && ln -s "libvcdenc.so.0.0.0" "libvcdenc.so") >libtool: link: ( cd ".libs" && rm -f "libvcdenc.la" && ln -s "../libvcdenc.la" "libvcdenc.la" ) >/bin/sh ./libtool --tag=CXX --mode=compile x86_64-pc-linux-gnu-g++ -DHAVE_CONFIG_H -I. -I./src -I./src -I./src/zlib -I./gflags/src -I./gtest -I./gtest/include -DNDEBUG -DNO_THREADS -DGTEST_HAS_TR1_TUPLE=0 -Wall -Wwrite-strings -Woverloaded-virtual -W -Werror=terminate -O2 -pipe -march=native -c -o gflags.lo `test -f 'gflags/src/gflags.cc' || echo './'`gflags/src/gflags.cc >libtool: compile: x86_64-pc-linux-gnu-g++ -DHAVE_CONFIG_H -I. -I./src -I./src -I./src/zlib -I./gflags/src -I./gtest -I./gtest/include -DNDEBUG -DNO_THREADS -DGTEST_HAS_TR1_TUPLE=0 -Wall -Wwrite-strings -Woverloaded-virtual -W -Werror=terminate -O2 -pipe -march=native -c gflags/src/gflags.cc -fPIC -DPIC -o .libs/gflags.o >gflags/src/gflags.cc:361:40: warning: invalid suffix on literal; C++11 requires a space between literal and string macro [-Wliteral-suffix] > snprintf(intbuf, sizeof(intbuf), "%"PRId32, VALUE_AS(int32)); > ^ >gflags/src/gflags.cc:364:40: warning: invalid suffix on literal; C++11 requires a space between literal and string macro [-Wliteral-suffix] > snprintf(intbuf, sizeof(intbuf), "%"PRId64, VALUE_AS(int64)); > ^ >gflags/src/gflags.cc:367:40: warning: invalid suffix on literal; C++11 requires a space between literal and string macro [-Wliteral-suffix] > snprintf(intbuf, sizeof(intbuf), "%"PRIu64, VALUE_AS(uint64)); > ^ >In file included from gflags/src/gflags.cc:115:0: >./gflags/src/gflags/gflags.h:532:80: warning: dereferencing type-punned pointer will break strict-aliasing rules [-Wstrict-aliasing] > d::string& FLAGS_##name = *(reinterpret_cast<std::string*>(s_##name[0].s)); \ > ^ >gflags/src/gflags.cc:148:1: note: in expansion of macro 'DEFINE_string' > DEFINE_string(flagfile, "", > ^~~~~~~~~~~~~ >./gflags/src/gflags/gflags.h:532:80: warning: dereferencing type-punned pointer will break strict-aliasing rules [-Wstrict-aliasing] > d::string& FLAGS_##name = *(reinterpret_cast<std::string*>(s_##name[0].s)); \ > ^ >gflags/src/gflags.cc:150:1: note: in expansion of macro 'DEFINE_string' > DEFINE_string(fromenv, "", > ^~~~~~~~~~~~~ >./gflags/src/gflags/gflags.h:532:80: warning: dereferencing type-punned pointer will break strict-aliasing rules [-Wstrict-aliasing] > d::string& FLAGS_##name = *(reinterpret_cast<std::string*>(s_##name[0].s)); \ > ^ >gflags/src/gflags.cc:153:1: note: in expansion of macro 'DEFINE_string' > DEFINE_string(tryfromenv, "", > ^~~~~~~~~~~~~ >./gflags/src/gflags/gflags.h:532:80: warning: dereferencing type-punned pointer will break strict-aliasing rules [-Wstrict-aliasing] > d::string& FLAGS_##name = *(reinterpret_cast<std::string*>(s_##name[0].s)); \ > ^ >gflags/src/gflags.cc:157:1: note: in expansion of macro 'DEFINE_string' > DEFINE_string(undefok, "", > ^~~~~~~~~~~~~ >/bin/sh ./libtool --tag=CXX --mode=compile x86_64-pc-linux-gnu-g++ -DHAVE_CONFIG_H -I. -I./src -I./src -I./src/zlib -I./gflags/src -I./gtest -I./gtest/include -DNDEBUG -DNO_THREADS -DGTEST_HAS_TR1_TUPLE=0 -Wall -Wwrite-strings -Woverloaded-virtual -W -Werror=terminate -O2 -pipe -march=native -c -o gflags_completions.lo `test -f 'gflags/src/gflags_completions.cc' || echo './'`gflags/src/gflags_completions.cc >libtool: compile: x86_64-pc-linux-gnu-g++ -DHAVE_CONFIG_H -I. -I./src -I./src -I./src/zlib -I./gflags/src -I./gtest -I./gtest/include -DNDEBUG -DNO_THREADS -DGTEST_HAS_TR1_TUPLE=0 -Wall -Wwrite-strings -Woverloaded-virtual -W -Werror=terminate -O2 -pipe -march=native -c gflags/src/gflags_completions.cc -fPIC -DPIC -o .libs/gflags_completions.o >In file included from gflags/src/gflags_completions.cc:61:0: >./gflags/src/gflags/gflags.h:532:80: warning: dereferencing type-punned pointer will break strict-aliasing rules [-Wstrict-aliasing] > d::string& FLAGS_##name = *(reinterpret_cast<std::string*>(s_##name[0].s)); \ > ^ >gflags/src/gflags_completions.cc:67:1: note: in expansion of macro 'DEFINE_string' > DEFINE_string(tab_completion_word, "", > ^~~~~~~~~~~~~ >/bin/sh ./libtool --tag=CXX --mode=compile x86_64-pc-linux-gnu-g++ -DHAVE_CONFIG_H -I. -I./src -I./src -I./src/zlib -I./gflags/src -I./gtest -I./gtest/include -DNDEBUG -DNO_THREADS -DGTEST_HAS_TR1_TUPLE=0 -Wall -Wwrite-strings -Woverloaded-virtual -W -Werror=terminate -O2 -pipe -march=native -c -o gflags_reporting.lo `test -f 'gflags/src/gflags_reporting.cc' || echo './'`gflags/src/gflags_reporting.cc >libtool: compile: x86_64-pc-linux-gnu-g++ -DHAVE_CONFIG_H -I. -I./src -I./src -I./src/zlib -I./gflags/src -I./gtest -I./gtest/include -DNDEBUG -DNO_THREADS -DGTEST_HAS_TR1_TUPLE=0 -Wall -Wwrite-strings -Woverloaded-virtual -W -Werror=terminate -O2 -pipe -march=native -c gflags/src/gflags_reporting.cc -fPIC -DPIC -o .libs/gflags_reporting.o >In file included from gflags/src/gflags_reporting.cc:58:0: >./gflags/src/gflags/gflags.h:532:80: warning: dereferencing type-punned pointer will break strict-aliasing rules [-Wstrict-aliasing] > d::string& FLAGS_##name = *(reinterpret_cast<std::string*>(s_##name[0].s)); \ > ^ >gflags/src/gflags_reporting.cc:72:1: note: in expansion of macro 'DEFINE_string' > DEFINE_string(helpon, "", > ^~~~~~~~~~~~~ >./gflags/src/gflags/gflags.h:532:80: warning: dereferencing type-punned pointer will break strict-aliasing rules [-Wstrict-aliasing] > d::string& FLAGS_##name = *(reinterpret_cast<std::string*>(s_##name[0].s)); \ > ^ >gflags/src/gflags_reporting.cc:74:1: note: in expansion of macro 'DEFINE_string' > DEFINE_string(helpmatch, "", > ^~~~~~~~~~~~~ >/bin/sh ./libtool --tag=CXX --mode=link x86_64-pc-linux-gnu-g++ -DNDEBUG -DNO_THREADS -DGTEST_HAS_TR1_TUPLE=0 -Wall -Wwrite-strings -Woverloaded-virtual -W -Werror=terminate -O2 -pipe -march=native -no-undefined -Wl,-O1 -Wl,--as-needed -o libgflags.la gflags.lo gflags_completions.lo gflags_reporting.lo >libtool: link: x86_64-pc-linux-gnu-ar cru .libs/libgflags.a .libs/gflags.o .libs/gflags_completions.o .libs/gflags_reporting.o >libtool: link: x86_64-pc-linux-gnu-ranlib .libs/libgflags.a >libtool: link: ( cd ".libs" && rm -f "libgflags.la" && ln -s "../libgflags.la" "libgflags.la" ) >/bin/sh ./libtool --tag=CXX --mode=compile x86_64-pc-linux-gnu-g++ -DHAVE_CONFIG_H -I. -I./src -I./src -I./src/zlib -I./gflags/src -I./gtest -I./gtest/include -DNDEBUG -DNO_THREADS -DGTEST_HAS_TR1_TUPLE=0 -Wall -Wwrite-strings -Woverloaded-virtual -W -Werror=terminate -O2 -pipe -march=native -c -o gtest.lo `test -f 'gtest/src/gtest.cc' || echo './'`gtest/src/gtest.cc >libtool: compile: x86_64-pc-linux-gnu-g++ -DHAVE_CONFIG_H -I. -I./src -I./src -I./src/zlib -I./gflags/src -I./gtest -I./gtest/include -DNDEBUG -DNO_THREADS -DGTEST_HAS_TR1_TUPLE=0 -Wall -Wwrite-strings -Woverloaded-virtual -W -Werror=terminate -O2 -pipe -march=native -c gtest/src/gtest.cc -fPIC -DPIC -o .libs/gtest.o >/bin/sh ./libtool --tag=CXX --mode=compile x86_64-pc-linux-gnu-g++ -DHAVE_CONFIG_H -I. -I./src -I./src -I./src/zlib -I./gflags/src -I./gtest -I./gtest/include -DNDEBUG -DNO_THREADS -DGTEST_HAS_TR1_TUPLE=0 -Wall -Wwrite-strings -Woverloaded-virtual -W -Werror=terminate -O2 -pipe -march=native -c -o gtest-death-test.lo `test -f 'gtest/src/gtest-death-test.cc' || echo './'`gtest/src/gtest-death-test.cc >libtool: compile: x86_64-pc-linux-gnu-g++ -DHAVE_CONFIG_H -I. -I./src -I./src -I./src/zlib -I./gflags/src -I./gtest -I./gtest/include -DNDEBUG -DNO_THREADS -DGTEST_HAS_TR1_TUPLE=0 -Wall -Wwrite-strings -Woverloaded-virtual -W -Werror=terminate -O2 -pipe -march=native -c gtest/src/gtest-death-test.cc -fPIC -DPIC -o .libs/gtest-death-test.o >/bin/sh ./libtool --tag=CXX --mode=compile x86_64-pc-linux-gnu-g++ -DHAVE_CONFIG_H -I. -I./src -I./src -I./src/zlib -I./gflags/src -I./gtest -I./gtest/include -DNDEBUG -DNO_THREADS -DGTEST_HAS_TR1_TUPLE=0 -Wall -Wwrite-strings -Woverloaded-virtual -W -Werror=terminate -O2 -pipe -march=native -c -o gtest-filepath.lo `test -f 'gtest/src/gtest-filepath.cc' || echo './'`gtest/src/gtest-filepath.cc >libtool: compile: x86_64-pc-linux-gnu-g++ -DHAVE_CONFIG_H -I. -I./src -I./src -I./src/zlib -I./gflags/src -I./gtest -I./gtest/include -DNDEBUG -DNO_THREADS -DGTEST_HAS_TR1_TUPLE=0 -Wall -Wwrite-strings -Woverloaded-virtual -W -Werror=terminate -O2 -pipe -march=native -c gtest/src/gtest-filepath.cc -fPIC -DPIC -o .libs/gtest-filepath.o >/bin/sh ./libtool --tag=CXX --mode=compile x86_64-pc-linux-gnu-g++ -DHAVE_CONFIG_H -I. -I./src -I./src -I./src/zlib -I./gflags/src -I./gtest -I./gtest/include -DNDEBUG -DNO_THREADS -DGTEST_HAS_TR1_TUPLE=0 -Wall -Wwrite-strings -Woverloaded-virtual -W -Werror=terminate -O2 -pipe -march=native -c -o gtest-port.lo `test -f 'gtest/src/gtest-port.cc' || echo './'`gtest/src/gtest-port.cc >libtool: compile: x86_64-pc-linux-gnu-g++ -DHAVE_CONFIG_H -I. -I./src -I./src -I./src/zlib -I./gflags/src -I./gtest -I./gtest/include -DNDEBUG -DNO_THREADS -DGTEST_HAS_TR1_TUPLE=0 -Wall -Wwrite-strings -Woverloaded-virtual -W -Werror=terminate -O2 -pipe -march=native -c gtest/src/gtest-port.cc -fPIC -DPIC -o .libs/gtest-port.o >/bin/sh ./libtool --tag=CXX --mode=compile x86_64-pc-linux-gnu-g++ -DHAVE_CONFIG_H -I. -I./src -I./src -I./src/zlib -I./gflags/src -I./gtest -I./gtest/include -DNDEBUG -DNO_THREADS -DGTEST_HAS_TR1_TUPLE=0 -Wall -Wwrite-strings -Woverloaded-virtual -W -Werror=terminate -O2 -pipe -march=native -c -o gtest-test-part.lo `test -f 'gtest/src/gtest-test-part.cc' || echo './'`gtest/src/gtest-test-part.cc >libtool: compile: x86_64-pc-linux-gnu-g++ -DHAVE_CONFIG_H -I. -I./src -I./src -I./src/zlib -I./gflags/src -I./gtest -I./gtest/include -DNDEBUG -DNO_THREADS -DGTEST_HAS_TR1_TUPLE=0 -Wall -Wwrite-strings -Woverloaded-virtual -W -Werror=terminate -O2 -pipe -march=native -c gtest/src/gtest-test-part.cc -fPIC -DPIC -o .libs/gtest-test-part.o >/bin/sh ./libtool --tag=CXX --mode=compile x86_64-pc-linux-gnu-g++ -DHAVE_CONFIG_H -I. -I./src -I./src -I./src/zlib -I./gflags/src -I./gtest -I./gtest/include -DNDEBUG -DNO_THREADS -DGTEST_HAS_TR1_TUPLE=0 -Wall -Wwrite-strings -Woverloaded-virtual -W -Werror=terminate -O2 -pipe -march=native -c -o gtest-typed-test.lo `test -f 'gtest/src/gtest-typed-test.cc' || echo './'`gtest/src/gtest-typed-test.cc >libtool: compile: x86_64-pc-linux-gnu-g++ -DHAVE_CONFIG_H -I. -I./src -I./src -I./src/zlib -I./gflags/src -I./gtest -I./gtest/include -DNDEBUG -DNO_THREADS -DGTEST_HAS_TR1_TUPLE=0 -Wall -Wwrite-strings -Woverloaded-virtual -W -Werror=terminate -O2 -pipe -march=native -c gtest/src/gtest-typed-test.cc -fPIC -DPIC -o .libs/gtest-typed-test.o >/bin/sh ./libtool --tag=CXX --mode=compile x86_64-pc-linux-gnu-g++ -DHAVE_CONFIG_H -I. -I./src -I./src -I./src/zlib -I./gflags/src -I./gtest -I./gtest/include -DNDEBUG -DNO_THREADS -DGTEST_HAS_TR1_TUPLE=0 -Wall -Wwrite-strings -Woverloaded-virtual -W -Werror=terminate -O2 -pipe -march=native -c -o gtest_main.lo `test -f 'gtest/src/gtest_main.cc' || echo './'`gtest/src/gtest_main.cc >libtool: compile: x86_64-pc-linux-gnu-g++ -DHAVE_CONFIG_H -I. -I./src -I./src -I./src/zlib -I./gflags/src -I./gtest -I./gtest/include -DNDEBUG -DNO_THREADS -DGTEST_HAS_TR1_TUPLE=0 -Wall -Wwrite-strings -Woverloaded-virtual -W -Werror=terminate -O2 -pipe -march=native -c gtest/src/gtest_main.cc -fPIC -DPIC -o .libs/gtest_main.o >/bin/sh ./libtool --tag=CXX --mode=link x86_64-pc-linux-gnu-g++ -DNDEBUG -DNO_THREADS -DGTEST_HAS_TR1_TUPLE=0 -Wall -Wwrite-strings -Woverloaded-virtual -W -Werror=terminate -O2 -pipe -march=native -no-undefined -Wl,-O1 -Wl,--as-needed -o libgtest_main.la gtest.lo gtest-death-test.lo gtest-filepath.lo gtest-port.lo gtest-test-part.lo gtest-typed-test.lo gtest_main.lo >libtool: link: x86_64-pc-linux-gnu-ar cru .libs/libgtest_main.a .libs/gtest.o .libs/gtest-death-test.o .libs/gtest-filepath.o .libs/gtest-port.o .libs/gtest-test-part.o .libs/gtest-typed-test.o .libs/gtest_main.o >libtool: link: x86_64-pc-linux-gnu-ranlib .libs/libgtest_main.a >libtool: link: ( cd ".libs" && rm -f "libgtest_main.la" && ln -s "../libgtest_main.la" "libgtest_main.la" ) >/bin/sh ./libtool --tag=CXX --mode=compile x86_64-pc-linux-gnu-g++ -DHAVE_CONFIG_H -I. -I./src -I./src -I./src/zlib -I./gflags/src -I./gtest -I./gtest/include -DNDEBUG -DNO_THREADS -DGTEST_HAS_TR1_TUPLE=0 -Wall -Wwrite-strings -Woverloaded-virtual -W -Werror=terminate -O2 -pipe -march=native -c -o vcdecoder_test.lo `test -f 'src/vcdecoder_test.cc' || echo './'`src/vcdecoder_test.cc >libtool: compile: x86_64-pc-linux-gnu-g++ -DHAVE_CONFIG_H -I. -I./src -I./src -I./src/zlib -I./gflags/src -I./gtest -I./gtest/include -DNDEBUG -DNO_THREADS -DGTEST_HAS_TR1_TUPLE=0 -Wall -Wwrite-strings -Woverloaded-virtual -W -Werror=terminate -O2 -pipe -march=native -c src/vcdecoder_test.cc -fPIC -DPIC -o .libs/vcdecoder_test.o >/bin/sh ./libtool --tag=CXX --mode=link x86_64-pc-linux-gnu-g++ -DNDEBUG -DNO_THREADS -DGTEST_HAS_TR1_TUPLE=0 -Wall -Wwrite-strings -Woverloaded-virtual -W -Werror=terminate -O2 -pipe -march=native -no-undefined -Wl,-O1 -Wl,--as-needed -o libvcdecoder_test_common.la vcdecoder_test.lo libvcddec.la libgtest_main.la >libtool: link: (cd .libs/libvcdecoder_test_common.lax/libgtest_main.a && x86_64-pc-linux-gnu-ar x "/var/tmp/portage/dev-util/open-vcdiff-0.8.4-r1/work/open-vcdiff-0.8.4/./.libs/libgtest_main.a") >libtool: link: x86_64-pc-linux-gnu-ar cru .libs/libvcdecoder_test_common.a .libs/vcdecoder_test.o .libs/libvcdecoder_test_common.lax/libgtest_main.a/gtest-death-test.o .libs/libvcdecoder_test_common.lax/libgtest_main.a/gtest-filepath.o .libs/libvcdecoder_test_common.lax/libgtest_main.a/gtest-port.o .libs/libvcdecoder_test_common.lax/libgtest_main.a/gtest-test-part.o .libs/libvcdecoder_test_common.lax/libgtest_main.a/gtest-typed-test.o .libs/libvcdecoder_test_common.lax/libgtest_main.a/gtest.o .libs/libvcdecoder_test_common.lax/libgtest_main.a/gtest_main.o >libtool: link: x86_64-pc-linux-gnu-ranlib .libs/libvcdecoder_test_common.a >libtool: link: rm -fr .libs/libvcdecoder_test_common.lax >libtool: link: ( cd ".libs" && rm -f "libvcdecoder_test_common.la" && ln -s "../libvcdecoder_test_common.la" "libvcdecoder_test_common.la" ) >x86_64-pc-linux-gnu-g++ -DHAVE_CONFIG_H -I. -I./src -I./src -I./src/zlib -I./gflags/src -I./gtest -I./gtest/include -DNDEBUG -DNO_THREADS -DGTEST_HAS_TR1_TUPLE=0 -Wall -Wwrite-strings -Woverloaded-virtual -W -Werror=terminate -O2 -pipe -march=native -c -o vcdiff_main.o `test -f 'src/vcdiff_main.cc' || echo './'`src/vcdiff_main.cc >In file included from src/vcdiff_main.cc:29:0: >./gflags/src/gflags/gflags.h:532:80: warning: dereferencing type-punned pointer will break strict-aliasing rules [-Wstrict-aliasing] > d::string& FLAGS_##name = *(reinterpret_cast<std::string*>(s_##name[0].s)); \ > ^ >src/vcdiff_main.cc:43:1: note: in expansion of macro âDEFINE_stringâ > DEFINE_string(dictionary, "", > ^~~~~~~~~~~~~ >./gflags/src/gflags/gflags.h:532:80: warning: dereferencing type-punned pointer will break strict-aliasing rules [-Wstrict-aliasing] > d::string& FLAGS_##name = *(reinterpret_cast<std::string*>(s_##name[0].s)); \ > ^ >src/vcdiff_main.cc:45:1: note: in expansion of macro âDEFINE_stringâ > DEFINE_string(target, "", > ^~~~~~~~~~~~~ >./gflags/src/gflags/gflags.h:532:80: warning: dereferencing type-punned pointer will break strict-aliasing rules [-Wstrict-aliasing] > d::string& FLAGS_##name = *(reinterpret_cast<std::string*>(s_##name[0].s)); \ > ^ >src/vcdiff_main.cc:47:1: note: in expansion of macro âDEFINE_stringâ > DEFINE_string(delta, "", > ^~~~~~~~~~~~~ >/bin/sh ./libtool --tag=CXX --mode=link x86_64-pc-linux-gnu-g++ -DNDEBUG -DNO_THREADS -DGTEST_HAS_TR1_TUPLE=0 -Wall -Wwrite-strings -Woverloaded-virtual -W -Werror=terminate -O2 -pipe -march=native -no-undefined -Wl,-O1 -Wl,--as-needed -o vcdiff vcdiff_main.o libvcddec.la libvcdenc.la libgflags.la >libtool: link: x86_64-pc-linux-gnu-g++ -DNDEBUG -DNO_THREADS -DGTEST_HAS_TR1_TUPLE=0 -Wall -Wwrite-strings -Woverloaded-virtual -W -Werror=terminate -O2 -pipe -march=native -Wl,-O1 -Wl,--as-needed -o .libs/vcdiff vcdiff_main.o ./.libs/libvcddec.so ./.libs/libvcdenc.so ./.libs/libgflags.a >>>> Source compiled. >>>> Test phase: dev-util/open-vcdiff-0.8.4-r1 >make -j1 check >make addrcache_test blockhash_test codetable_test decodetable_test encodetable_test headerparser_test instruction_map_test output_string_test rolling_hash_test varint_bigendian_test vcdecoder1_test vcdecoder2_test vcdecoder3_test vcdecoder4_test vcdecoder5_test vcdiffengine_test vcencoder_test jsonwriter_test src/vcdiff_test.sh >make[1]: Entering directory '/var/tmp/portage/dev-util/open-vcdiff-0.8.4-r1/work/open-vcdiff-0.8.4' >x86_64-pc-linux-gnu-g++ -DHAVE_CONFIG_H -I. -I./src -I./src -I./src/zlib -I./gflags/src -I./gtest -I./gtest/include -DNDEBUG -DNO_THREADS -DGTEST_HAS_TR1_TUPLE=0 -Wall -Wwrite-strings -Woverloaded-virtual -W -Werror=terminate -O2 -pipe -march=native -c -o addrcache_test.o `test -f 'src/addrcache_test.cc' || echo './'`src/addrcache_test.cc >/bin/sh ./libtool --tag=CXX --mode=link x86_64-pc-linux-gnu-g++ -DNDEBUG -DNO_THREADS -DGTEST_HAS_TR1_TUPLE=0 -Wall -Wwrite-strings -Woverloaded-virtual -W -Werror=terminate -O2 -pipe -march=native -no-undefined -Wl,-O1 -Wl,--as-needed -o addrcache_test addrcache_test.o libvcdcom.la libgtest_main.la >libtool: link: x86_64-pc-linux-gnu-g++ -DNDEBUG -DNO_THREADS -DGTEST_HAS_TR1_TUPLE=0 -Wall -Wwrite-strings -Woverloaded-virtual -W -Werror=terminate -O2 -pipe -march=native -Wl,-O1 -Wl,--as-needed -o .libs/addrcache_test addrcache_test.o ./.libs/libvcdcom.so ./.libs/libgtest_main.a >x86_64-pc-linux-gnu-g++ -DHAVE_CONFIG_H -I. -I./src -I./src -I./src/zlib -I./gflags/src -I./gtest -I./gtest/include -DNDEBUG -DNO_THREADS -DGTEST_HAS_TR1_TUPLE=0 -Wall -Wwrite-strings -Woverloaded-virtual -W -Werror=terminate -O2 -pipe -march=native -c -o blockhash_test.o `test -f 'src/blockhash_test.cc' || echo './'`src/blockhash_test.cc >In file included from src/rolling_hash.h:20:0, > from src/blockhash_test.cc:21: >src/rolling_hash.h: In static member function âstatic void open_vcdiff::RollingHash<window_size>::Init()â: >src/rolling_hash.h:178:22: warning: typedef âRollingHash_window_size_must_be_at_least_2â locally defined but not used [-Wunused-local-typedefs] > RollingHash_window_size_must_be_at_least_2); > ^ >src/compile_assert.h:55:7: note: in definition of macro âVCD_COMPILE_ASSERTâ > msg[static_cast<bool>(expr) ? 1 : -1] > ^~~ >/bin/sh ./libtool --tag=CXX --mode=link x86_64-pc-linux-gnu-g++ -DNDEBUG -DNO_THREADS -DGTEST_HAS_TR1_TUPLE=0 -Wall -Wwrite-strings -Woverloaded-virtual -W -Werror=terminate -O2 -pipe -march=native -no-undefined -Wl,-O1 -Wl,--as-needed -o blockhash_test blockhash_test.o libvcdenc.la libgtest_main.la >libtool: link: x86_64-pc-linux-gnu-g++ -DNDEBUG -DNO_THREADS -DGTEST_HAS_TR1_TUPLE=0 -Wall -Wwrite-strings -Woverloaded-virtual -W -Werror=terminate -O2 -pipe -march=native -Wl,-O1 -Wl,--as-needed -o .libs/blockhash_test blockhash_test.o ./.libs/libvcdenc.so ./.libs/libgtest_main.a >x86_64-pc-linux-gnu-g++ -DHAVE_CONFIG_H -I. -I./src -I./src -I./src/zlib -I./gflags/src -I./gtest -I./gtest/include -DNDEBUG -DNO_THREADS -DGTEST_HAS_TR1_TUPLE=0 -Wall -Wwrite-strings -Woverloaded-virtual -W -Werror=terminate -O2 -pipe -march=native -c -o codetable_test.o `test -f 'src/codetable_test.cc' || echo './'`src/codetable_test.cc >/bin/sh ./libtool --tag=CXX --mode=link x86_64-pc-linux-gnu-g++ -DNDEBUG -DNO_THREADS -DGTEST_HAS_TR1_TUPLE=0 -Wall -Wwrite-strings -Woverloaded-virtual -W -Werror=terminate -O2 -pipe -march=native -no-undefined -Wl,-O1 -Wl,--as-needed -o codetable_test codetable_test.o libvcdcom.la libgtest_main.la >libtool: link: x86_64-pc-linux-gnu-g++ -DNDEBUG -DNO_THREADS -DGTEST_HAS_TR1_TUPLE=0 -Wall -Wwrite-strings -Woverloaded-virtual -W -Werror=terminate -O2 -pipe -march=native -Wl,-O1 -Wl,--as-needed -o .libs/codetable_test codetable_test.o ./.libs/libvcdcom.so ./.libs/libgtest_main.a >x86_64-pc-linux-gnu-g++ -DHAVE_CONFIG_H -I. -I./src -I./src -I./src/zlib -I./gflags/src -I./gtest -I./gtest/include -DNDEBUG -DNO_THREADS -DGTEST_HAS_TR1_TUPLE=0 -Wall -Wwrite-strings -Woverloaded-virtual -W -Werror=terminate -O2 -pipe -march=native -c -o decodetable_test.o `test -f 'src/decodetable_test.cc' || echo './'`src/decodetable_test.cc >In file included from src/decodetable_test.cc:18:0: >src/decodetable.h:136:8: warning: âtemplate<class> class std::auto_ptrâ is deprecated [-Wdeprecated-declarations] > std::auto_ptr<VCDiffCodeTableData> non_default_code_table_data_; > ^~~~~~~~ >In file included from /usr/lib/gcc/x86_64-pc-linux-gnu/6.4.0/include/g++-v6/memory:81:0, > from src/decodetable.h:21, > from src/decodetable_test.cc:18: >/usr/lib/gcc/x86_64-pc-linux-gnu/6.4.0/include/g++-v6/bits/unique_ptr.h:49:28: note: declared here > template<typename> class auto_ptr; > ^~~~~~~~ >/bin/sh ./libtool --tag=CXX --mode=link x86_64-pc-linux-gnu-g++ -DNDEBUG -DNO_THREADS -DGTEST_HAS_TR1_TUPLE=0 -Wall -Wwrite-strings -Woverloaded-virtual -W -Werror=terminate -O2 -pipe -march=native -no-undefined -Wl,-O1 -Wl,--as-needed -o decodetable_test decodetable_test.o libvcddec.la libvcdcom.la libgtest_main.la >libtool: link: x86_64-pc-linux-gnu-g++ -DNDEBUG -DNO_THREADS -DGTEST_HAS_TR1_TUPLE=0 -Wall -Wwrite-strings -Woverloaded-virtual -W -Werror=terminate -O2 -pipe -march=native -Wl,-O1 -Wl,--as-needed -o .libs/decodetable_test decodetable_test.o ./.libs/libvcddec.so ./.libs/libvcdcom.so ./.libs/libgtest_main.a >x86_64-pc-linux-gnu-g++ -DHAVE_CONFIG_H -I. -I./src -I./src -I./src/zlib -I./gflags/src -I./gtest -I./gtest/include -DNDEBUG -DNO_THREADS -DGTEST_HAS_TR1_TUPLE=0 -Wall -Wwrite-strings -Woverloaded-virtual -W -Werror=terminate -O2 -pipe -march=native -c -o encodetable_test.o `test -f 'src/encodetable_test.cc' || echo './'`src/encodetable_test.cc >/bin/sh ./libtool --tag=CXX --mode=link x86_64-pc-linux-gnu-g++ -DNDEBUG -DNO_THREADS -DGTEST_HAS_TR1_TUPLE=0 -Wall -Wwrite-strings -Woverloaded-virtual -W -Werror=terminate -O2 -pipe -march=native -no-undefined -Wl,-O1 -Wl,--as-needed -o encodetable_test encodetable_test.o libvcdenc.la libvcdcom.la libgtest_main.la >libtool: link: x86_64-pc-linux-gnu-g++ -DNDEBUG -DNO_THREADS -DGTEST_HAS_TR1_TUPLE=0 -Wall -Wwrite-strings -Woverloaded-virtual -W -Werror=terminate -O2 -pipe -march=native -Wl,-O1 -Wl,--as-needed -o .libs/encodetable_test encodetable_test.o ./.libs/libvcdenc.so ./.libs/libvcdcom.so ./.libs/libgtest_main.a >x86_64-pc-linux-gnu-g++ -DHAVE_CONFIG_H -I. -I./src -I./src -I./src/zlib -I./gflags/src -I./gtest -I./gtest/include -DNDEBUG -DNO_THREADS -DGTEST_HAS_TR1_TUPLE=0 -Wall -Wwrite-strings -Woverloaded-virtual -W -Werror=terminate -O2 -pipe -march=native -c -o headerparser_test.o `test -f 'src/headerparser_test.cc' || echo './'`src/headerparser_test.cc >/bin/sh ./libtool --tag=CXX --mode=link x86_64-pc-linux-gnu-g++ -DNDEBUG -DNO_THREADS -DGTEST_HAS_TR1_TUPLE=0 -Wall -Wwrite-strings -Woverloaded-virtual -W -Werror=terminate -O2 -pipe -march=native -no-undefined -Wl,-O1 -Wl,--as-needed -o headerparser_test headerparser_test.o libvcddec.la libvcdcom.la libgtest_main.la >libtool: link: x86_64-pc-linux-gnu-g++ -DNDEBUG -DNO_THREADS -DGTEST_HAS_TR1_TUPLE=0 -Wall -Wwrite-strings -Woverloaded-virtual -W -Werror=terminate -O2 -pipe -march=native -Wl,-O1 -Wl,--as-needed -o .libs/headerparser_test headerparser_test.o ./.libs/libvcddec.so ./.libs/libvcdcom.so ./.libs/libgtest_main.a >x86_64-pc-linux-gnu-g++ -DHAVE_CONFIG_H -I. -I./src -I./src -I./src/zlib -I./gflags/src -I./gtest -I./gtest/include -DNDEBUG -DNO_THREADS -DGTEST_HAS_TR1_TUPLE=0 -Wall -Wwrite-strings -Woverloaded-virtual -W -Werror=terminate -O2 -pipe -march=native -c -o instruction_map_test.o `test -f 'src/instruction_map_test.cc' || echo './'`src/instruction_map_test.cc >/bin/sh ./libtool --tag=CXX --mode=link x86_64-pc-linux-gnu-g++ -DNDEBUG -DNO_THREADS -DGTEST_HAS_TR1_TUPLE=0 -Wall -Wwrite-strings -Woverloaded-virtual -W -Werror=terminate -O2 -pipe -march=native -no-undefined -Wl,-O1 -Wl,--as-needed -o instruction_map_test instruction_map_test.o libvcdenc.la libvcdcom.la libgtest_main.la >libtool: link: x86_64-pc-linux-gnu-g++ -DNDEBUG -DNO_THREADS -DGTEST_HAS_TR1_TUPLE=0 -Wall -Wwrite-strings -Woverloaded-virtual -W -Werror=terminate -O2 -pipe -march=native -Wl,-O1 -Wl,--as-needed -o .libs/instruction_map_test instruction_map_test.o ./.libs/libvcdenc.so ./.libs/libvcdcom.so ./.libs/libgtest_main.a >x86_64-pc-linux-gnu-g++ -DHAVE_CONFIG_H -I. -I./src -I./src -I./src/zlib -I./gflags/src -I./gtest -I./gtest/include -DNDEBUG -DNO_THREADS -DGTEST_HAS_TR1_TUPLE=0 -Wall -Wwrite-strings -Woverloaded-virtual -W -Werror=terminate -O2 -pipe -march=native -c -o output_string_test.o `test -f 'src/output_string_test.cc' || echo './'`src/output_string_test.cc >/bin/sh ./libtool --tag=CXX --mode=link x86_64-pc-linux-gnu-g++ -DNDEBUG -DNO_THREADS -DGTEST_HAS_TR1_TUPLE=0 -Wall -Wwrite-strings -Woverloaded-virtual -W -Werror=terminate -O2 -pipe -march=native -no-undefined -Wl,-O1 -Wl,--as-needed -o output_string_test output_string_test.o libgtest_main.la >libtool: link: x86_64-pc-linux-gnu-g++ -DNDEBUG -DNO_THREADS -DGTEST_HAS_TR1_TUPLE=0 -Wall -Wwrite-strings -Woverloaded-virtual -W -Werror=terminate -O2 -pipe -march=native -Wl,-O1 -Wl,--as-needed -o output_string_test output_string_test.o ./.libs/libgtest_main.a >x86_64-pc-linux-gnu-g++ -DHAVE_CONFIG_H -I. -I./src -I./src -I./src/zlib -I./gflags/src -I./gtest -I./gtest/include -DNDEBUG -DNO_THREADS -DGTEST_HAS_TR1_TUPLE=0 -Wall -Wwrite-strings -Woverloaded-virtual -W -Werror=terminate -O2 -pipe -march=native -c -o rolling_hash_test.o `test -f 'src/rolling_hash_test.cc' || echo './'`src/rolling_hash_test.cc >In file included from src/rolling_hash.h:20:0, > from src/rolling_hash_test.cc:16: >src/rolling_hash.h: In static member function âstatic void open_vcdiff::RollingHash<window_size>::Init()â: >src/rolling_hash.h:178:22: warning: typedef âRollingHash_window_size_must_be_at_least_2â locally defined but not used [-Wunused-local-typedefs] > RollingHash_window_size_must_be_at_least_2); > ^ >src/compile_assert.h:55:7: note: in definition of macro âVCD_COMPILE_ASSERTâ > msg[static_cast<bool>(expr) ? 1 : -1] > ^~~ >/bin/sh ./libtool --tag=CXX --mode=link x86_64-pc-linux-gnu-g++ -DNDEBUG -DNO_THREADS -DGTEST_HAS_TR1_TUPLE=0 -Wall -Wwrite-strings -Woverloaded-virtual -W -Werror=terminate -O2 -pipe -march=native -no-undefined -Wl,-O1 -Wl,--as-needed -o rolling_hash_test rolling_hash_test.o libvcdcom.la libgtest_main.la >libtool: link: x86_64-pc-linux-gnu-g++ -DNDEBUG -DNO_THREADS -DGTEST_HAS_TR1_TUPLE=0 -Wall -Wwrite-strings -Woverloaded-virtual -W -Werror=terminate -O2 -pipe -march=native -Wl,-O1 -Wl,--as-needed -o .libs/rolling_hash_test rolling_hash_test.o ./.libs/libvcdcom.so ./.libs/libgtest_main.a >x86_64-pc-linux-gnu-g++ -DHAVE_CONFIG_H -I. -I./src -I./src -I./src/zlib -I./gflags/src -I./gtest -I./gtest/include -DNDEBUG -DNO_THREADS -DGTEST_HAS_TR1_TUPLE=0 -Wall -Wwrite-strings -Woverloaded-virtual -W -Werror=terminate -O2 -pipe -march=native -c -o varint_bigendian_test.o `test -f 'src/varint_bigendian_test.cc' || echo './'`src/varint_bigendian_test.cc >src/varint_bigendian_test.cc:109:66: error: narrowing conversion of â255â from âintâ to âcharâ inside { } [-Wnarrowing] > { 0xFF, 0xFF, 0xFF, 0xFF, 0xFF, 0xFF, 0xFF, 0xFF, 0xFF, 0xFF }; > ^ >src/varint_bigendian_test.cc:109:66: error: narrowing conversion of â255â from âintâ to âcharâ inside { } [-Wnarrowing] >src/varint_bigendian_test.cc:109:66: error: narrowing conversion of â255â from âintâ to âcharâ inside { } [-Wnarrowing] >src/varint_bigendian_test.cc:109:66: error: narrowing conversion of â255â from âintâ to âcharâ inside { } [-Wnarrowing] >src/varint_bigendian_test.cc:109:66: error: narrowing conversion of â255â from âintâ to âcharâ inside { } [-Wnarrowing] >src/varint_bigendian_test.cc:109:66: error: narrowing conversion of â255â from âintâ to âcharâ inside { } [-Wnarrowing] >src/varint_bigendian_test.cc:109:66: error: narrowing conversion of â255â from âintâ to âcharâ inside { } [-Wnarrowing] >src/varint_bigendian_test.cc:109:66: error: narrowing conversion of â255â from âintâ to âcharâ inside { } [-Wnarrowing] >src/varint_bigendian_test.cc:109:66: error: narrowing conversion of â255â from âintâ to âcharâ inside { } [-Wnarrowing] >src/varint_bigendian_test.cc:109:66: error: narrowing conversion of â255â from âintâ to âcharâ inside { } [-Wnarrowing] >src/varint_bigendian_test.cc:112:24: error: narrowing conversion of â202â from âintâ to âcharâ inside { } [-Wnarrowing] > { 0xCA, 0xDA, 0x01 }; > ^ >src/varint_bigendian_test.cc:112:24: error: narrowing conversion of â218â from âintâ to âcharâ inside { } [-Wnarrowing] >src/varint_bigendian_test.cc: In member function âvirtual void open_vcdiff::{anonymous}::VarintBEInt32Test_Decode32Bits_Test::TestBody()â: >src/varint_bigendian_test.cc:294:68: error: narrowing conversion of â136â from âintâ to âcharâ inside { } [-Wnarrowing] > const char parse_data_32_bits[] = { 0x88, 0x80, 0x80, 0x80, 0x00 }; > ^ >src/varint_bigendian_test.cc:294:68: error: narrowing conversion of â128â from âintâ to âcharâ inside { } [-Wnarrowing] >src/varint_bigendian_test.cc:294:68: error: narrowing conversion of â128â from âintâ to âcharâ inside { } [-Wnarrowing] >src/varint_bigendian_test.cc:294:68: error: narrowing conversion of â128â from âintâ to âcharâ inside { } [-Wnarrowing] >src/varint_bigendian_test.cc: In member function âvirtual void open_vcdiff::{anonymous}::VarintBEInt64Test_Decode32Bits_Test::TestBody()â: >src/varint_bigendian_test.cc:302:68: error: narrowing conversion of â136â from âintâ to âcharâ inside { } [-Wnarrowing] > const char parse_data_32_bits[] = { 0x88, 0x80, 0x80, 0x80, 0x00 }; > ^ >src/varint_bigendian_test.cc:302:68: error: narrowing conversion of â128â from âintâ to âcharâ inside { } [-Wnarrowing] >src/varint_bigendian_test.cc:302:68: error: narrowing conversion of â128â from âintâ to âcharâ inside { } [-Wnarrowing] >src/varint_bigendian_test.cc:302:68: error: narrowing conversion of â128â from âintâ to âcharâ inside { } [-Wnarrowing] >src/varint_bigendian_test.cc: In instantiation of âvoid open_vcdiff::{anonymous}::VarintBETestTemplate<SignedIntegerType>::TemplateTestParse123456789() [with SignedIntegerType = int]â: >src/varint_bigendian_test.cc:277:1: required from here >src/varint_bigendian_test.cc:278:78: error: narrowing conversion of â186â from âintâ to âcharâ inside { } [-Wnarrowing] > const char parse_data_123456789[] = { 0x80 + 58, 0x80 + 111, 0x80 + 26, 21 }; > ^ >src/varint_bigendian_test.cc:278:78: error: narrowing conversion of â239â from âintâ to âcharâ inside { } [-Wnarrowing] >src/varint_bigendian_test.cc:278:78: error: narrowing conversion of â154â from âintâ to âcharâ inside { } [-Wnarrowing] >src/varint_bigendian_test.cc: In instantiation of âvoid open_vcdiff::{anonymous}::VarintBETestTemplate<SignedIntegerType>::TemplateTestParse123456789() [with SignedIntegerType = long int]â: >src/varint_bigendian_test.cc:277:1: required from here >src/varint_bigendian_test.cc:278:78: error: narrowing conversion of â186â from âintâ to âcharâ inside { } [-Wnarrowing] >src/varint_bigendian_test.cc:278:78: error: narrowing conversion of â239â from âintâ to âcharâ inside { } [-Wnarrowing] >src/varint_bigendian_test.cc:278:78: error: narrowing conversion of â154â from âintâ to âcharâ inside { } [-Wnarrowing] >src/varint_bigendian_test.cc: In instantiation of âvoid open_vcdiff::{anonymous}::VarintBETestTemplate<SignedIntegerType>::TemplateTestDecode31Bits() [with SignedIntegerType = int]â: >src/varint_bigendian_test.cc:285:1: required from here >src/varint_bigendian_test.cc:286:68: error: narrowing conversion of â135â from âintâ to âcharâ inside { } [-Wnarrowing] > const char parse_data_31_bits[] = { 0x87, 0xFF, 0xFF, 0xFF, 0x7F }; > ^ >src/varint_bigendian_test.cc:286:68: error: narrowing conversion of â255â from âintâ to âcharâ inside { } [-Wnarrowing] >src/varint_bigendian_test.cc:286:68: error: narrowing conversion of â255â from âintâ to âcharâ inside { } [-Wnarrowing] >src/varint_bigendian_test.cc:286:68: error: narrowing conversion of â255â from âintâ to âcharâ inside { } [-Wnarrowing] >src/varint_bigendian_test.cc: In instantiation of âvoid open_vcdiff::{anonymous}::VarintBETestTemplate<SignedIntegerType>::TemplateTestDecode31Bits() [with SignedIntegerType = long int]â: >src/varint_bigendian_test.cc:285:1: required from here >src/varint_bigendian_test.cc:286:68: error: narrowing conversion of â135â from âintâ to âcharâ inside { } [-Wnarrowing] >src/varint_bigendian_test.cc:286:68: error: narrowing conversion of â255â from âintâ to âcharâ inside { } [-Wnarrowing] >src/varint_bigendian_test.cc:286:68: error: narrowing conversion of â255â from âintâ to âcharâ inside { } [-Wnarrowing] >src/varint_bigendian_test.cc:286:68: error: narrowing conversion of â255â from âintâ to âcharâ inside { } [-Wnarrowing] >src/varint_bigendian_test.cc: In instantiation of âvoid open_vcdiff::{anonymous}::VarintBETestTemplate<SignedIntegerType>::TemplateTestContinuationBytesPastEndOfInput() [with SignedIntegerType = int]â: >src/varint_bigendian_test.cc:339:1: required from here >src/varint_bigendian_test.cc:343:12: error: narrowing conversion of â128â from âintâ to âcharâ inside { } [-Wnarrowing] > 0x00 }; > ^ >src/varint_bigendian_test.cc:343:12: error: narrowing conversion of â128â from âintâ to âcharâ inside { } [-Wnarrowing] >src/varint_bigendian_test.cc:343:12: error: narrowing conversion of â128â from âintâ to âcharâ inside { } [-Wnarrowing] >src/varint_bigendian_test.cc:343:12: error: narrowing conversion of â128â from âintâ to âcharâ inside { } [-Wnarrowing] >src/varint_bigendian_test.cc:343:12: error: narrowing conversion of â128â from âintâ to âcharâ inside { } [-Wnarrowing] >src/varint_bigendian_test.cc:343:12: error: narrowing conversion of â128â from âintâ to âcharâ inside { } [-Wnarrowing] >src/varint_bigendian_test.cc:343:12: error: narrowing conversion of â128â from âintâ to âcharâ inside { } [-Wnarrowing] >src/varint_bigendian_test.cc:343:12: error: narrowing conversion of â128â from âintâ to âcharâ inside { } [-Wnarrowing] >src/varint_bigendian_test.cc:343:12: error: narrowing conversion of â128â from âintâ to âcharâ inside { } [-Wnarrowing] >src/varint_bigendian_test.cc:343:12: error: narrowing conversion of â128â from âintâ to âcharâ inside { } [-Wnarrowing] >src/varint_bigendian_test.cc:343:12: error: narrowing conversion of â128â from âintâ to âcharâ inside { } [-Wnarrowing] >src/varint_bigendian_test.cc:343:12: error: narrowing conversion of â128â from âintâ to âcharâ inside { } [-Wnarrowing] >src/varint_bigendian_test.cc:343:12: error: narrowing conversion of â128â from âintâ to âcharâ inside { } [-Wnarrowing] >src/varint_bigendian_test.cc:343:12: error: narrowing conversion of â128â from âintâ to âcharâ inside { } [-Wnarrowing] >src/varint_bigendian_test.cc:343:12: error: narrowing conversion of â128â from âintâ to âcharâ inside { } [-Wnarrowing] >src/varint_bigendian_test.cc:343:12: error: narrowing conversion of â128â from âintâ to âcharâ inside { } [-Wnarrowing] >src/varint_bigendian_test.cc:343:12: error: narrowing conversion of â128â from âintâ to âcharâ inside { } [-Wnarrowing] >src/varint_bigendian_test.cc:343:12: error: narrowing conversion of â128â from âintâ to âcharâ inside { } [-Wnarrowing] >src/varint_bigendian_test.cc:343:12: error: narrowing conversion of â128â from âintâ to âcharâ inside { } [-Wnarrowing] >src/varint_bigendian_test.cc:343:12: error: narrowing conversion of â128â from âintâ to âcharâ inside { } [-Wnarrowing] >src/varint_bigendian_test.cc:343:12: error: narrowing conversion of â128â from âintâ to âcharâ inside { } [-Wnarrowing] >src/varint_bigendian_test.cc:343:12: error: narrowing conversion of â128â from âintâ to âcharâ inside { } [-Wnarrowing] >src/varint_bigendian_test.cc: In instantiation of âvoid open_vcdiff::{anonymous}::VarintBETestTemplate<SignedIntegerType>::TemplateTestContinuationBytesPastEndOfInput() [with SignedIntegerType = long int]â: >src/varint_bigendian_test.cc:339:1: required from here >src/varint_bigendian_test.cc:343:12: error: narrowing conversion of â128â from âintâ to âcharâ inside { } [-Wnarrowing] >src/varint_bigendian_test.cc:343:12: error: narrowing conversion of â128â from âintâ to âcharâ inside { } [-Wnarrowing] >src/varint_bigendian_test.cc:343:12: error: narrowing conversion of â128â from âintâ to âcharâ inside { } [-Wnarrowing] >src/varint_bigendian_test.cc:343:12: error: narrowing conversion of â128â from âintâ to âcharâ inside { } [-Wnarrowing] >src/varint_bigendian_test.cc:343:12: error: narrowing conversion of â128â from âintâ to âcharâ inside { } [-Wnarrowing] >src/varint_bigendian_test.cc:343:12: error: narrowing conversion of â128â from âintâ to âcharâ inside { } [-Wnarrowing] >src/varint_bigendian_test.cc:343:12: error: narrowing conversion of â128â from âintâ to âcharâ inside { } [-Wnarrowing] >src/varint_bigendian_test.cc:343:12: error: narrowing conversion of â128â from âintâ to âcharâ inside { } [-Wnarrowing] >src/varint_bigendian_test.cc:343:12: error: narrowing conversion of â128â from âintâ to âcharâ inside { } [-Wnarrowing] >src/varint_bigendian_test.cc:343:12: error: narrowing conversion of â128â from âintâ to âcharâ inside { } [-Wnarrowing] >src/varint_bigendian_test.cc:343:12: error: narrowing conversion of â128â from âintâ to âcharâ inside { } [-Wnarrowing] >src/varint_bigendian_test.cc:343:12: error: narrowing conversion of â128â from âintâ to âcharâ inside { } [-Wnarrowing] >src/varint_bigendian_test.cc:343:12: error: narrowing conversion of â128â from âintâ to âcharâ inside { } [-Wnarrowing] >src/varint_bigendian_test.cc:343:12: error: narrowing conversion of â128â from âintâ to âcharâ inside { } [-Wnarrowing] >src/varint_bigendian_test.cc:343:12: error: narrowing conversion of â128â from âintâ to âcharâ inside { } [-Wnarrowing] >src/varint_bigendian_test.cc:343:12: error: narrowing conversion of â128â from âintâ to âcharâ inside { } [-Wnarrowing] >src/varint_bigendian_test.cc:343:12: error: narrowing conversion of â128â from âintâ to âcharâ inside { } [-Wnarrowing] >src/varint_bigendian_test.cc:343:12: error: narrowing conversion of â128â from âintâ to âcharâ inside { } [-Wnarrowing] >src/varint_bigendian_test.cc:343:12: error: narrowing conversion of â128â from âintâ to âcharâ inside { } [-Wnarrowing] >src/varint_bigendian_test.cc:343:12: error: narrowing conversion of â128â from âintâ to âcharâ inside { } [-Wnarrowing] >src/varint_bigendian_test.cc:343:12: error: narrowing conversion of â128â from âintâ to âcharâ inside { } [-Wnarrowing] >src/varint_bigendian_test.cc:343:12: error: narrowing conversion of â128â from âintâ to âcharâ inside { } [-Wnarrowing] >make[1]: *** [Makefile:1267: varint_bigendian_test.o] Error 1 >make[1]: Leaving directory '/var/tmp/portage/dev-util/open-vcdiff-0.8.4-r1/work/open-vcdiff-0.8.4' >make: *** [Makefile:1786: check-am] Error 2 > * ERROR: dev-util/open-vcdiff-0.8.4-r1::gentoo failed (test phase): > * Make check failed. See above for details. > * > * Call stack: > * ebuild.sh, line 115: Called src_test > * environment, line 349: Called default > * phase-functions.sh, line 808: Called default_src_test > * phase-functions.sh, line 837: Called __eapi0_src_test > * phase-helpers.sh, line 763: Called die > * The specific snippet of code: > * $emake_cmd ${internal_opts} check || \ > * die "Make check failed. See above for details." > * > * If you need support, post the output of `emerge --info '=dev-util/open-vcdiff-0.8.4-r1::gentoo'`, > * the complete build log and the output of `emerge -pqv '=dev-util/open-vcdiff-0.8.4-r1::gentoo'`. > * The complete build log is located at '/var/log/portage/dev-util:open-vcdiff-0.8.4-r1:20170901-211804.log'. > * For convenience, a symlink to the build log is located at '/var/tmp/portage/dev-util/open-vcdiff-0.8.4-r1/temp/build.log'. > * The ebuild environment file is located at '/var/tmp/portage/dev-util/open-vcdiff-0.8.4-r1/temp/environment'. > * Working directory: '/var/tmp/portage/dev-util/open-vcdiff-0.8.4-r1/work/open-vcdiff-0.8.4' > * S: '/var/tmp/portage/dev-util/open-vcdiff-0.8.4-r1/work/open-vcdiff-0.8.4'
You cannot view the attachment while viewing its details because your browser does not support IFRAMEs.
View the attachment on a separate page
.
View Attachment As Raw
Actions:
View
Attachments on
bug 629598
:
491442
| 491444 |
491446
|
491448
|
491450
|
491452
|
491454
|
562184
|
562186
|
562188
|
562190
|
562192
|
562194
|
562196