Gentoo Websites Logo
Go to: Gentoo Home Documentation Forums Lists Bugs Planet Store Wiki Get Gentoo!
Bug 471114 - dev-lang/python-3.3.2 fails tests
Summary: dev-lang/python-3.3.2 fails tests
Status: RESOLVED OBSOLETE
Alias: None
Product: Gentoo Linux
Classification: Unclassified
Component: New packages (show other bugs)
Hardware: All Linux
: Normal normal (vote)
Assignee: Python Gentoo Team
URL:
Whiteboard:
Keywords:
Depends on:
Blocks:
 
Reported: 2013-05-24 02:46 UTC by Patrick Lauer
Modified: 2018-04-21 18:14 UTC (History)
2 users (show)

See Also:
Package list:
Runtime testing required: ---


Attachments

Note You need to log in before you can comment on or make changes to this bug.
Description Patrick Lauer gentoo-dev 2013-05-24 02:46:52 UTC
test_stty_match (test.test_shutil.TermsizeTests)
Check if stty returns the same results ignoring env ... FAIL
test_absolute_cmd (test.test_shutil.TestWhich) ... ok
test_basic (test.test_shutil.TestWhich) ... ok
test_cwd (test.test_shutil.TestWhich) ... ok
test_empty_path (test.test_shutil.TestWhich) ... ok
test_empty_path_no_PATH (test.test_shutil.TestWhich) ... ok
test_environ_path (test.test_shutil.TestWhich) ... ok
test_non_matching_mode (test.test_shutil.TestWhich) ... FAIL
test_nonexistent_file (test.test_shutil.TestWhich) ... ok
test_pathext_checking (test.test_shutil.TestWhich) ... skipped 'pathext check is Windows-only'
test_relative_cmd (test.test_shutil.TestWhich) ... ok
test_relative_path (test.test_shutil.TestWhich) ... ok

======================================================================
FAIL: test_stty_match (test.test_shutil.TermsizeTests)
Check if stty returns the same results ignoring env
----------------------------------------------------------------------
Traceback (most recent call last):
  File "/var/tmp/portage/dev-lang/python-3.3.2/work/Python-3.3.2/Lib/test/test_shutil.py", line 1704, in test_stty_match
    self.assertEqual(expected, actual)
AssertionError: (237, 67) != os.terminal_size(columns=0, lines=0)

======================================================================
FAIL: test_non_matching_mode (test.test_shutil.TestWhich)
----------------------------------------------------------------------
Traceback (most recent call last):
  File "/var/tmp/portage/dev-lang/python-3.3.2/work/Python-3.3.2/Lib/test/test_shutil.py", line 1334, in test_non_matching_mode
    self.assertIsNone(rv)
AssertionError: '/var/tmp/portage/dev-lang/python-3.3.2/temp/Tmpo5e5af/Tmp7u8lyu.Exe' is not None

----------------------------------------------------------------------
Ran 82 tests in 1.298s

FAILED (failures=2, skipped=3)
test test_shutil failed
make: *** [test] Error 1
emake failed
 * The following tests have been skipped:
 * test_gdb.py
 * If you would like to run them, you may:
 * cd '/usr/lib64/python3.3/test'
 * and run the tests separately.
 * ERROR: dev-lang/python-3.3.2 failed (test phase):
 *   emake test failed

Portage 2.1.12 (default/linux/amd64/13.0/desktop/kde, gcc-4.8.0, glibc-2.17, 3.9.0-gentoo x86_64)
=================================================================
System uname: Linux-3.9.0-gentoo-x86_64-AMD_Phenom-tm-_II_X4_965_Processor-with-gentoo-2.2
KiB Mem:     7921124 total,   1059420 free
KiB Swap:   25165812 total,  25157040 free
Timestamp of tree: Unknown
ld GNU ld (GNU Binutils) 2.23.1
app-shells/bash:          4.2_p45
dev-lang/python:          2.7.4, 3.2.4
dev-util/cmake:           2.8.10.2-r2
dev-util/pkgconfig:       0.28
sys-apps/baselayout:      2.2
sys-apps/openrc:          0.11.8
sys-apps/sandbox:         2.6-r1
sys-devel/autoconf:       2.13, 2.69
sys-devel/automake:       1.13.2
sys-devel/binutils:       2.23.1
sys-devel/gcc:            4.8.0
sys-devel/gcc-config:     1.8
sys-devel/libtool:        2.4.2
sys-devel/make:           3.82-r4
sys-kernel/linux-headers: 3.9 (virtual/os-headers)
sys-libs/glibc:           2.17
Repositories: gentoo
ACCEPT_KEYWORDS="amd64 ~amd64"
ACCEPT_LICENSE="*"
CBUILD="x86_64-pc-linux-gnu"
CFLAGS="-O2 -pipe"
CHOST="x86_64-pc-linux-gnu"
CONFIG_PROTECT="/etc /usr/share/config /usr/share/gnupg/qualified.txt /usr/share/polkit-1/actions /usr/share/themes/oxygen-gtk/gtk-2.0 /var/lib/hsqldb"
CONFIG_PROTECT_MASK="/etc/ca-certificates.conf /etc/env.d /etc/fonts/fonts.conf /etc/gconf /etc/gentoo-release /etc/revdep-rebuild /etc/sandbox.d /etc/terminfo /etc/texmf/language.dat.d /etc/texmf/language.def.d /etc/texmf/updmap.d /etc/texmf/web2c"
CXXFLAGS="-O2 -pipe"
DISTDIR="/usr/portage/distfiles"
FCFLAGS="-O2 -pipe"
FEATURES="assume-digests binpkg-logs buildpkg config-protect-if-modified distlocks ebuild-locks fixlafiles merge-sync news parallel-fetch preserve-libs protect-owned sandbox sfperms strict test unknown-features-warn unmerge-logs unmerge-orphans userfetch"
FFLAGS="-O2 -pipe"
GENTOO_MIRRORS="ftp://ftp.lecl.net/pub/gentoo/ http://ftp.lecl.net/pub/gentoo/"
LANG="en_US.utf8"
LDFLAGS="-Wl,-O1 -Wl,--as-needed"
MAKEOPTS="-j4"
PKGDIR="/usr/portage/packages"
PORTAGE_CONFIGROOT="/"
PORTAGE_RSYNC_OPTS="--recursive --links --safe-links --perms --times --compress --force --whole-file --delete --stats --human-readable --timeout=180 --exclude=/distfiles --exclude=/local --exclude=/packages"
PORTAGE_TMPDIR="/var/tmp"
PORTDIR="/usr/portage"
PORTDIR_OVERLAY=""
SYNC="rsync://rsync.gentoo.org/gentoo-portage"
USE="X a52 aac acl acpi alsa amd64 berkdb bluetooth branding bzip2 cairo cdda cdr cli consolekit cracklib crypt cups cxx dbus declarative dri dts dvd dvdr egl emboss encode exif fam firefox flac fortran gdbm gif gpm gtk iconv ipv6 jpeg kde kipi lcms ldap libnotify mad mmx mng modules mp3 mp4 mpeg mudflap multilib ncurses nls nptl ogg opengl openmp openvg pam pango pcre pdf phonon plasma png policykit ppds qt3support qt4 readline sdl semantic-desktop session spell sqlite sse sse2 ssl startup-notification svg tcpd tiff truetype udev udisks unicode upower usb vorbis wxwidgets x264 xa xcb xcomposite xinerama xml xscreensaver xv xvfb xvid zlib" ABI_X86="64" ALSA_CARDS="ali5451 als4000 atiixp atiixp-modem bt87x ca0106 cmipci emu10k1x ens1370 ens1371 es1938 es1968 fm801 hda-intel intel8x0 intel8x0m maestro3 trident usb-audio via82xx via82xx-modem ymfpci" ALSA_PCM_PLUGINS="adpcm alaw asym copy dmix dshare dsnoop empty extplug file hooks iec958 ioplug ladspa lfloat linear meter mmap_emul mulaw multi null plug rate route share shm softvol" APACHE2_MODULES="authn_core authz_core socache_shmcb unixd actions alias auth_basic authn_alias authn_anon authn_dbm authn_default authn_file authz_dbm authz_default authz_groupfile authz_host authz_owner authz_user autoindex cache cgi cgid dav dav_fs dav_lock deflate dir disk_cache env expires ext_filter file_cache filter headers include info log_config logio mem_cache mime mime_magic negotiation rewrite setenvif speling status unique_id userdir usertrack vhost_alias" CALLIGRA_FEATURES="kexi words flow plan sheets stage tables krita karbon braindump author" CAMERAS="ptp2" COLLECTD_PLUGINS="df interface irq load memory rrdtool swap syslog" ELIBC="glibc" GPSD_PROTOCOLS="ashtech aivdm earthmate evermore fv18 garmin garmintxt gpsclock itrax mtk3301 nmea ntrip navcom oceanserver oldstyle oncore rtcm104v2 rtcm104v3 sirf superstar2 timing tsip tripmate tnt ubx" INPUT_DEVICES="keyboard mouse evdev" KERNEL="linux" LCD_DEVICES="bayrad cfontz cfontz633 glk hd44780 lb216 lcdm001 mtxorb ncurses text" LIBREOFFICE_EXTENSIONS="presenter-console presenter-minimizer" OFFICE_IMPLEMENTATION="libreoffice" PHP_TARGETS="php5-3" PYTHON_SINGLE_TARGET="python2_7" PYTHON_TARGETS="python2_7 python3_2" RUBY_TARGETS="ruby19" USERLAND="GNU" VIDEO_CARDS="vesa" XTABLES_ADDONS="quota2 psd pknock lscan length2 ipv4options ipset ipp2p iface geoip fuzzy condition tee tarpit sysrq steal rawnat logmark ipmark dhcpmac delude chaos account"
Unset:  CPPFLAGS, CTARGET, EMERGE_DEFAULT_OPTS, INSTALL_MASK, LC_ALL, PORTAGE_BUNZIP2_COMMAND, PORTAGE_COMPRESS, PORTAGE_COMPRESS_FLAGS, PORTAGE_RSYNC_EXTRA_OPTS, USE_PYTHON
Comment 1 Jeroen Roovers (RETIRED) gentoo-dev 2013-07-03 14:26:40 UTC
Some more related to rpm (I thought I would lump them in here instead of a new bug):

[ 62/371/1] test_distutils
error: No compatible architectures found for build
error: query of specfile build/bdist.linux-parisc64/rpm/SPECS/foo.spec failed, can't parse
error: No compatible architectures found for build
error: query of specfile build/bdist.linux-parisc64/rpm/SPECS/foo.spec failed, can't parse
test test_distutils failed -- multiple errors occurred; run in verbose mode for details
[...]
test_no_optimize_flag (distutils.tests.test_bdist_rpm.BuildRpmTestCase) ... error: No compatible architectures found for build
error: query of specfile build/bdist.linux-parisc64/rpm/SPECS/foo.spec failed, can't parse
ERROR
test_quiet (distutils.tests.test_bdist_rpm.BuildRpmTestCase) ... error: No compatible architectures found for build
error: query of specfile build/bdist.linux-parisc64/rpm/SPECS/foo.spec failed, can't parse
ERROR
[...]
======================================================================
ERROR: test_no_optimize_flag (distutils.tests.test_bdist_rpm.BuildRpmTestCase)
----------------------------------------------------------------------
Traceback (most recent call last):
  File "/var/tmp/portage/dev-lang/python-3.3.2-r1/work/Python-3.3.2/Lib/distutils/tests/test_bdist_rpm.py", line 125, in test_no_optimize_flag
    cmd.run()
  File "/var/tmp/portage/dev-lang/python-3.3.2-r1/work/Python-3.3.2/Lib/distutils/command/bdist_rpm.py", line 361, in run
    raise DistutilsExecError("Failed to execute: %s" % repr(q_cmd))
distutils.errors.DistutilsExecError: Failed to execute: "rpm -q --qf '%{name}-%{version}-%{release}.src.rpm %{arch}/%{name}-%{version}-%{release}.%{arch}.rpm\\n' --specfile 'build/bdist.linux-parisc64/rpm/SPECS/foo.spec'"

======================================================================
ERROR: test_quiet (distutils.tests.test_bdist_rpm.BuildRpmTestCase)
----------------------------------------------------------------------
Traceback (most recent call last):
  File "/var/tmp/portage/dev-lang/python-3.3.2-r1/work/Python-3.3.2/Lib/distutils/tests/test_bdist_rpm.py", line 81, in test_quiet
    cmd.run()
  File "/var/tmp/portage/dev-lang/python-3.3.2-r1/work/Python-3.3.2/Lib/distutils/command/bdist_rpm.py", line 361, in run
    raise DistutilsExecError("Failed to execute: %s" % repr(q_cmd))
distutils.errors.DistutilsExecError: Failed to execute: "rpm -q --qf '%{name}-%{version}-%{release}.src.rpm %{arch}/%{name}-%{version}-%{release}.%{arch}.rpm\\n' --specfile 'build/bdist.linux-parisc64/rpm/SPECS/foo.spec'"

----------------------------------------------------------------------
Comment 2 Michał Górny archtester Gentoo Infrastructure gentoo-dev Security 2018-04-21 18:14:46 UTC
This version is long gone.