592326
|
Gentoo L
|
Current
|
aballier
|
UNCO
|
---
|
llvm-runtimes/libcxx-3.8.1[libunwind] on x86 - undefined reference to `__divdi3'
|
2024-12-11
|
599456
|
Gentoo L
|
Current
|
aballier
|
UNCO
|
---
|
llvm-runtimes/libcxx-3.9.0 fails tests - usr/bin/python2.7: can't open file '/var/tmp/portage/llvm-runtimes/libcxx-3.9.0/temp/utils/lit/lit.py': [Errno 2] No such file or directory
|
2024-12-11
|
630720
|
Gentoo L
|
Current
|
aballier
|
UNCO
|
---
|
llvm-runtimes/libcxx-3.9.1: Header files have changed between ABIs.
|
2024-12-11
|
761340
|
Gentoo L
|
Current
|
aballier
|
UNCO
|
---
|
llvm-runtimes/libcxx-11.0.0 fails tests
|
2024-12-11
|
710786
|
Gentoo L
|
Current
|
arm
|
UNCO
|
---
|
llvm-runtimes/compiler-rt is not implemented for armeb
|
2024-12-11
|
785604
|
Gentoo L
|
Current
|
arm
|
UNCO
|
---
|
llvm-runtimes/compiler-rt failed (configure phase)
|
2024-12-11
|
777090
|
Gentoo L
|
Current
|
asturm
|
UNCO
|
---
|
dev-libs/libical-3.0.9 ld.lld: error: unknown argument '-Wl,-O1' when using LLVM linker
|
2022-06-16
|
490834
|
Gentoo L
|
[OLD] Co
|
base-system
|
UNCO
|
---
|
sys-fs/lvm2 - 'The link /dev/syssdd2/thin_pool should have been created by udev but it was not found. Falling back to direct link creation.' when booting a thin provisioned root file system
|
2020-12-27
|
527274
|
Gentoo L
|
[OLD] Co
|
base-system
|
UNCO
|
---
|
sys-apps/hdparm-9.45 with llvm-core/clang-3.5.0 - x86_64-pc-linux-gnu-clang-3.5.0: error: unknown argument: '-fkeep-inline-functions'
|
2024-12-11
|
528122
|
Gentoo L
|
[OLD] Co
|
base-system
|
UNCO
|
---
|
sys-fs/lvm2 - add USE=python for Python bindings
|
2020-12-27
|
586396
|
Gentoo L
|
Current
|
base-system
|
UNCO
|
---
|
sys-fs/lvm2-2.02.145-r2 - pvscan Input/output error with not existing logical volume
|
2020-12-27
|
603204
|
Gentoo L
|
Current
|
base-system
|
UNCO
|
---
|
=sys-fs/lvm2-2.02.166 - thin_dump ignores vg_change --physicalextentsize
|
2020-12-27
|
672256
|
Gentoo L
|
Current
|
base-system
|
UNCO
|
---
|
sys-fs/lvm2-2.02.181 - /lib/systemd/system-generators/lvm2-activation-generator hardcodes /usr/bin/udevadm
|
2020-12-27
|
682670
|
Gentoo L
|
Current
|
base-system
|
UNCO
|
---
|
sys-fs/lvm2-2.02.183 - systemd fails to stop dmeventd
|
2021-09-21
|
684882
|
Gentoo L
|
Current
|
base-system
|
UNCO
|
---
|
>=sys-fs/lvm2-2.02.184 - systemd[1]: Timed out waiting for device /dev/mapper/gentoo-swap.
|
2020-12-27
|
690494
|
Gentoo L
|
Current
|
base-system
|
UNCO
|
---
|
sys-fs/lvm2-2.02.184-r4 delayed boot with multiple "WARNING: Device /dev/sdaX not initialized in udev database even after waiting 10000000 microseconds"
|
2021-02-19
|
816714
|
Gentoo L
|
Current
|
base-system
|
UNCO
|
---
|
dev-build/cmake-3.20.5 emerge fail when using LLVM systemwide
|
2024-03-23
|
852575
|
Gentoo L
|
Current
|
base-system
|
UNCO
|
---
|
sys-fs/lvm2 add VDO support for lvm2-2.03.14
|
2024-07-04
|
909418
|
Gentoo L
|
Current
|
base-system
|
UNCO
|
---
|
sys-fs/lvm2: Add option to not compile lvmpolld
|
2023-07-02
|
912966
|
Gentoo L
|
Current
|
base-system
|
UNCO
|
---
|
sys-fs/lvm2 missing license
|
2023-08-24
|
914283
|
Gentoo L
|
Current
|
base-system
|
UNCO
|
---
|
dev-libs/openssl-compat-1.0.2u-r2 fails to build with llvm 17 due to version script assignment
|
2024-04-15
|
917263
|
Gentoo L
|
Current
|
base-system
|
UNCO
|
---
|
app-arch/xz-utils-5.4.5[pgo] - ld.lld: error: cannot open /usr/lib/llvm/16/bin/../../../../lib/clang/16/lib/linux/libclang_rt.profile-x86_64.a: No such file or directory clang-16: error: linker command failed with exit code 1 (use -v to see invocation)
|
2023-11-26
|
936645
|
Gentoo L
|
Current
|
base-system
|
UNCO
|
---
|
sys-apps/coreutils-9.5 (llvm-musl) error: undefined symbol: __truncsfbf2
|
2024-09-15
|
937344
|
Gentoo L
|
Current
|
base-system
|
UNCO
|
---
|
sys-apps/iproute2-6.8.0-r2: call to undeclared function 'yyparse' [-Wimplicit-function-declaration] on musl/llvm
|
2024-08-05
|
938126
|
Gentoo L
|
Current
|
base-system
|
UNCO
|
---
|
dev-build/meson-1.5.1 test fail: frameworks: 15 llvm
|
2025-03-20
|
938951
|
Gentoo L
|
Current
|
base-system
|
UNCO
|
---
|
app-shells/bash[pgo] fails build due to missing llvm-runtimes/compiler-rt-sanitizers
|
2024-12-11
|
947263
|
Gentoo L
|
Current
|
base-system
|
UNCO
|
---
|
sys-fs/lvm2-2.03.22-r7 lvcreate fails to create second mirrored volume in a row
|
2024-12-31
|
947314
|
Gentoo L
|
Current
|
base-system
|
UNCO
|
---
|
sys-fs/lvm2-2.03.22-r7: installs udev rule that causes cryptsetup stuck on systems without systemd
|
2025-01-06
|
951712
|
Gentoo L
|
Current
|
base-system
|
UNCO
|
---
|
dev-build/meson: wrongly detects linker as bfd with llvm-core/clang and -fuse-ld=lld in *FLAGS
|
2025-03-22
|
949724
|
Gentoo L
|
Current
|
blueness
|
UNCO
|
---
|
sys-libs/musl: llvm-runtimes/libgcc: missing __getauxval on aarch64
|
2025-02-16
|
951143
|
Gentoo L
|
Current
|
bratishkaerik
|
UNCO
|
---
|
dev-lang/zig-0.14.0: fails to build with llvm
|
2025-03-28
|
953108
|
Gentoo L
|
Current
|
bug-wranglers
|
UNCO
|
---
|
dev-lang/spidermonkey-128.8.0: Fails to build with gcc - readelf: Error: This is a LLVM bitcode file - try extracting and then using llvm-bcanalyzer
|
08:28:00
|
697490
|
Gentoo L
|
Current
|
candrews
|
UNCO
|
---
|
llvm-core/llvm-roc-2.9 - clinfo: .../work/llvm-roc-ocl-2.9.0/include/llvm/Support/CommandLine.h:813: void llvm::cl::parser<DataType>::addLiteralOption(): Assertion `findOption(Name) == Values.size() && "Option already exists!"' failed.
|
2024-12-11
|
699702
|
Gentoo L
|
Current
|
candrews
|
UNCO
|
---
|
dev-libs/rocm-device-libs - prepare-builtins.cpp:(.text+0x4aa): undefined reference to `llvm::ToolOutputFile::ToolOutputFile(llvm::StringRef, std::__1::error_code&, llvm::sys::fs::OpenFlags)'
|
2020-04-24
|
916273
|
Gentoo L
|
Profiles
|
chewi
|
UNCO
|
---
|
gui-wm/gamescope - error: no type named 'mutex' in namespace 'std' (LLVM Profile)
|
2023-10-25
|
938579
|
Gentoo L
|
Current
|
chewi
|
UNCO
|
---
|
gui-wm/gamescope-3.15.1 Fails to Build Under LLVM18
|
2025-01-08
|
946344
|
Gentoo L
|
Current
|
chiitoo
|
UNCO
|
---
|
media-video/obs-studio-13.0.0: ld.lld: error: relocation R_X86_64_TPOFF32 against thread_graphics.llvm.5418910957160103413 cannot be used with -shared
|
2025-01-03
|
949199
|
Gentoo L
|
Current
|
chromium
|
UNCO
|
---
|
emerge www-client/chromium-132.0.6834.83 fails on PPC64: error: undefined symbol: llvm::MCAsmInfoXCOFF::MCAsmInfoXCOFF()
|
2025-02-03
|
951287
|
Gentoo L
|
Current
|
conikost
|
UNCO
|
---
|
dev-util/spirv-llvm-translator: request triggering rebuild when `llvm-core/llvm` is updated
|
Wed 22:54
|
936960
|
Gentoo L
|
Current
|
cross
|
UNCO
|
---
|
sys-devel/crossdev-20240209: crossdev -S -t powerpc64-unknown-linux-musl fails on llvm profile
|
2024-08-03
|
942317
|
Gentoo L
|
Current
|
cross
|
UNCO
|
---
|
cross_llvm-riscv32-unknown-elf/newlib-4.4.0.20231231:0 fails during setup phase
|
2024-11-30
|
915048
|
Gentoo L
|
Current
|
crossdev
|
UNCO
|
---
|
sys-devel/crossdev: missing musl symbols linker errors with "--llvm --target <arch>-gentoo-linux-musl"
|
2024-05-31
|
905173
|
GURU
|
Package
|
denis7774
|
UNCO
|
---
|
[guru] dev-util/DirectXShaderCompiler-1.7.2212: build fails with gcc-13 (declaration of ‘llvm::DxilV alueCache::WeakValueMap llvm::DxilValueCache::ValueMap’ changes meaning of ‘ValueMap’ [-Wchanges-meaning])
|
2024-04-07
|
603500
|
Gentoo L
|
Current
|
dev-portage
|
UNCO
|
---
|
llvm-core/clang-runtime-3.9.1::gentoo (masked by: )
|
2024-12-11
|
611742
|
Portage
|
Core - D
|
dev-portage
|
UNCO
|
---
|
@world update is not finding update to llvm
|
2017-03-16
|
695646
|
Gentoo L
|
Current
|
dev-portage
|
UNCO
|
---
|
media-libs/mesa-19.2.0_rc4 - libraries from llvm-core/llvm will be removed even if drivers in /usr/lib64/dri linking against them still exist
|
2024-12-11
|
771183
|
Gentoo L
|
Current
|
dev-portage
|
UNCO
|
---
|
sys-apps/portage: llvm-11.1.0 and clang-11.1.0 dependency conflict when upgrading from 11.0.1 versions
|
2022-06-18
|
933711
|
Gentoo L
|
Current
|
dilfridge
|
UNCO
|
---
|
media-gfx/inkscape-1.3.2-r2: fails to compile with clang-18 on llvm profile (3rdparty/2geom/include/2geom/path.h:846:20: error: no member named 'unique' in 'std::shared_ptr<Geom::PathInternal::PathData>')
|
2024-11-21
|
940655
|
Gentoo L
|
Current
|
esteve.varela
|
UNCO
|
---
|
media-libs/tg_owt-0_pre20240804-r1 Build fails under LLVM 19, works fine with GCC
|
2024-10-02
|
942843
|
Gentoo L
|
Current
|
floppym
|
UNCO
|
---
|
sys-boot/grub-2.12-r5 with clang and musl/llvm profile: error: invalid argument '-mcmodel=large' only allowed with '-fno-pic'
|
2024-11-03
|
509696
|
Gentoo L
|
Current
|
freedesktop-bugs
|
UNCO
|
---
|
app-admin/gam-server-0.1.10-r3 with =llvm-core/clang-3.4-r100 - gam_eq.c:127:3: error: non-void function 'gam_eq_flush' should return a value [-Wreturn-type]
|
2024-12-11
|
898964
|
Gentoo L
|
Current
|
genkernel
|
UNCO
|
---
|
sys-kernel/genkernel-4.2.6 lvm requires thin-provisioning-tools causing slow initrd build
|
2023-03-08
|
934773
|
Gentoo H
|
genkerne
|
genkernel
|
UNCO
|
---
|
sys-kernel/genkernel-4.3.16: Failed to create binpkg of lvm-2.03.22!
|
2024-11-25
|
944499
|
Gentoo H
|
genkerne
|
genkernel
|
UNCO
|
---
|
sys-kernel/genkernel-4.3.16: lvm2 built by genkernel includes udev rule that causes boot error on systems without systemd
|
2025-01-06
|
947185
|
Gentoo H
|
genkerne
|
genkernel
|
UNCO
|
---
|
sys-kernel/genkernel-4.3.16-r2: lvm2 built by genkernel includes udev rule that causes cryptsetup stuck on systems without systemd
|
2025-01-01
|
928276
|
Gentoo L
|
Current
|
gentoo
|
UNCO
|
---
|
gui-apps/waybar-0.10.0 with llvm-17 build failure
|
2024-03-31
|
915402
|
Gentoo L
|
Current
|
gnome
|
UNCO
|
---
|
gui-libs/gtk-4.12.2 fails to build on a hardened musl LLVM profile on ~amd64.
|
2025-01-22
|
928907
|
Gentoo L
|
Current
|
gnome
|
UNCO
|
---
|
gui-libs/gtk-4.12.5: fails to compile with clang: /usr/lib/llvm/18/bin/llvm-objcopy: error: 'gtk/gtkresources_blob.o': Symbol table has link index of 5 which is not a valid index
|
2025-01-07
|
948657
|
Gentoo L
|
Current
|
gstreamer
|
UNCO
|
---
|
media-plugins/gst-plugins-v4l2-1.24.11: incompatible function pointer types v4l2object->ioctl = v4l2_ioctl, on musl/llvm (needs media-libs/libv4l patching too)
|
2025-01-25
|
828874
|
Gentoo L
|
Current
|
haskell
|
UNCO
|
---
|
dev-haskell/cabal-3.2.1.0-r1 failed with llvm 13
|
2021-12-13
|
928656
|
Gentoo L
|
Current
|
java
|
UNCO
|
---
|
dev-java/openjdk-17.0.10_p7 - failed build on 23.0/llvm profile
|
2025-01-11
|
651658
|
Gentoo L
|
Current
|
kde
|
UNCO
|
---
|
dev-util/kdevelop:5 and media-libs/mesa-17*[llvm] link with different slots of llvm-core/llvm, resulting in a runtime symbol conflict and crash
|
2024-12-11
|
952955
|
Gentoo L
|
Overlays
|
kde
|
UNCO
|
---
|
[kde] please bump LLVM_MAX_SLOT for dev-util/kdevelop-9999
|
Mon 15:39
|
662108
|
Gentoo L
|
Current
|
llvm
|
UNCO
|
---
|
llvm-core/clang doesn't install i586-pc-linux-gnu-clang{,++} when CHOST=i586-pc-linux-gnu
|
2024-12-11
|
681076
|
Gentoo L
|
Current
|
llvm
|
UNCO
|
---
|
llvm-runtimes/compiler-rt-sanitizers-8.0.0 - FAIL: XRay-x86_64-linux :: TestCases/Posix/fdr-single-thread.cc
|
2024-12-11
|
690962
|
Gentoo L
|
Current
|
llvm
|
UNCO
|
---
|
llvm-core/llvm-8.0.1[+xml +libffi +ncurses +abi_x86_{64,32} llvm_targets_{amdGPU,bpf,nvpx,x86}] : ninja -v -j6 -l0 failed
|
2024-12-11
|
703268
|
Gentoo L
|
Current
|
llvm
|
UNCO
|
---
|
llvm-core/clang-8.0.1 fails test
|
2024-12-11
|
723114
|
Gentoo L
|
Current
|
llvm
|
UNCO
|
---
|
llvm-core/clang-10.0.0 - .../work/x/y/llvm/utils/lit/lit/formats/googletest.py", line 44, in getGTestTests raise StopIteration
|
2024-12-11
|
731264
|
Gentoo L
|
Current
|
llvm
|
UNCO
|
---
|
llvm-core/clang fails to cross compile (needs CBUILD clang-tblgen)
|
2024-12-11
|
734114
|
Gentoo L
|
Current
|
llvm
|
UNCO
|
---
|
llvm-core/clang-10.0.1 testfailure: Clangd document-link.test
|
2024-12-11
|
753380
|
Gentoo L
|
Current
|
llvm
|
UNCO
|
---
|
llvm-core/clang should put run-clang-tidy into PATH
|
2024-12-11
|
767700
|
Gentoo L
|
Current
|
llvm
|
UNCO
|
---
|
llvm-core/lld: needs rebuild if LLVM_TARGETS on llvm changed.
|
2025-03-17
|
768267
|
Gentoo L
|
Current
|
llvm
|
UNCO
|
---
|
llvm-core/clang: undefined symbol: LLVMInitializeNVPTXTargetInfo (at runtime if llvm dropped it)
|
2024-12-11
|
773556
|
Gentoo L
|
Current
|
llvm
|
UNCO
|
---
|
llvm-core/llvm-11.0.1 fails tests when compiled with clang
|
2024-12-11
|
779592
|
Gentoo L
|
Current
|
llvm
|
UNCO
|
---
|
llvm-core/llvm-11.1.0 fails tests
|
2024-12-11
|
796563
|
Gentoo L
|
Current
|
llvm
|
UNCO
|
---
|
llvm-core/clang-12.0.0-r1 fails tests
|
2024-12-12
|
818664
|
Gentoo L
|
Current
|
llvm
|
UNCO
|
---
|
llvm-runtimes/compiler-rt-13.0.0 Fails to emerge due to compiler error
|
2024-12-11
|
819036
|
Gentoo L
|
Current
|
llvm
|
UNCO
|
---
|
llvm-runtimes/compiler-rt-13.0.0 - error loading plugin: /usr/lib/llvm/13/bin/../lib64/LLVMgold.so: cannot open shared object file: No such file or directory
|
2024-12-11
|
834571
|
Gentoo L
|
Current
|
llvm
|
UNCO
|
---
|
llvm-core/clang: postinst should display a warning if built with default-libcxx
|
2024-12-11
|
834944
|
Gentoo L
|
Current
|
llvm
|
UNCO
|
---
|
llvm-runtimes/compiler-rt-13.0.1 fatal error: 'gnu/stubs-32.h' file not found on no-multilib profile
|
2024-12-11
|
852935
|
Gentoo L
|
Current
|
llvm
|
UNCO
|
---
|
llvm-runtimes/compiler-rt-sanitizers-14.0.4 fails test "GWP-ASan-x86_64 :: backtrace.c"
|
2024-12-11
|
854129
|
Gentoo L
|
Current
|
llvm
|
UNCO
|
---
|
llvm-runtimes/openmp-14.0.4 - fails 49 tests on ppc64
|
2024-12-11
|
857786
|
Gentoo L
|
Current
|
llvm
|
UNCO
|
---
|
llvm-runtimes/compiler-rt-sanitizers-14.0.6 uses /tmp instead of /var/tmp/portage/ for tests
|
2024-12-11
|
874336
|
Gentoo L
|
Current
|
llvm
|
UNCO
|
---
|
llvm-runtimes/libcxxabi-15.0.1: x86_64-pc-linux-gnu-ld: error: unable to find library -lc++
|
2024-12-11
|
874606
|
Gentoo L
|
Current
|
llvm
|
UNCO
|
---
|
llvm-runtimes/compiler-rt-14.0.6 fails tests without GOLD linker
|
2024-12-11
|
880855
|
Gentoo L
|
Current
|
llvm
|
UNCO
|
---
|
llvm-core/llvm-15.0.3: Segfault in llvm-tblgen building for x86_32 target on amd64
|
2024-12-11
|
882707
|
Gentoo L
|
Current
|
llvm
|
UNCO
|
---
|
llvm-runtimes/libcxx-16.0.0_pre20221120: Automatic renaming of a file which blocks installation of a directory
|
2024-12-11
|
883451
|
Gentoo L
|
Current
|
llvm
|
UNCO
|
---
|
llvm-runtimes/compiler-rt[clang] llvm-runtimes/compiler-rt-sanitizers[clang] llvm-runtimes/libcxx[clang] llvm-runtimes/libcxxabi[clang] llvm-runtimes/libunwind[clang] strips -unwindlib=libunwind
|
2024-12-11
|
890718
|
Gentoo L
|
Current
|
llvm
|
UNCO
|
---
|
llvm-core/libclc: invalid USE flags check
|
2024-12-11
|
891737
|
Gentoo L
|
Current
|
llvm
|
UNCO
|
---
|
llvm-core/clang-15.0.7-r1 fails to emerge
|
2024-12-11
|
892521
|
Gentoo L
|
Current
|
llvm
|
UNCO
|
---
|
>=llvm-core/lld mangles RUNPATH in an insecure way if cross-compiled: /var/tmp/portage/llvm-core/lld-15.0.7/image/usr/lib/llvm/15/bin/lldn RPATH: $ORIGIN/../lib64:/usr/aarch64-unknown-linux-gnu/usr/lib/llvm/15/lib64
|
2024-12-11
|
892527
|
Gentoo L
|
Current
|
llvm
|
UNCO
|
---
|
llvm-runtimes/compiler-rt-sanitizers-15.0.7 fails to build broken compiler
|
2024-12-11
|
893382
|
Gentoo L
|
Current
|
llvm
|
UNCO
|
---
|
llvm-core/clang-14.0.6-r1: relocation R_X86_64_TPOFF32 against `_ZL13BottomOfStack' can not be used when making a shared object; recompile with -fPIC
|
2024-12-11
|
900160
|
Gentoo L
|
Current
|
llvm
|
UNCO
|
---
|
llvm-core/llvm: add MLIR support
|
2024-12-11
|
904269
|
Gentoo L
|
Current
|
llvm
|
UNCO
|
---
|
llvm-core/llvm-15.0.7 does not build on i686
|
2024-12-11
|
906751
|
Gentoo L
|
Current
|
llvm
|
UNCO
|
---
|
llvm-core/llvm-16.0.4 fails to build with crash
|
2024-12-11
|
907923
|
Gentoo L
|
Current
|
llvm
|
UNCO
|
---
|
llvm-core/clang: add pgo use flag
|
2025-03-16
|
907931
|
Gentoo L
|
Current
|
llvm
|
UNCO
|
---
|
llvm-core/clang: add BOLT use flag
|
2025-03-16
|
908433
|
Gentoo L
|
Current
|
llvm
|
UNCO
|
---
|
llvm-core/llvm-15.0.7-r3 emerge can race with dev-db/unixODBC-2.3.11
|
2024-12-11
|
908489
|
Gentoo L
|
Current
|
llvm
|
UNCO
|
---
|
llvm-runtimes/libcxxabi-15.0.7: build error if USE flag "clang" enabled
|
2024-12-11
|
909180
|
Gentoo L
|
Current
|
llvm
|
UNCO
|
---
|
llvm-core/llvm-16.0.[56] fails loongarch tests
|
2024-12-11
|
911887
|
Gentoo L
|
Current
|
llvm
|
UNCO
|
---
|
llvm-runtimes/compiler-rt-sanitizers-16.0.6 appends -O3 and -fno-lto after user-set CFLAGS
|
2024-12-11
|
912678
|
Gentoo L
|
Current
|
llvm
|
UNCO
|
---
|
llvm-core/clang-17.0.0_rc2[debug]: ICE when building dev-libs/boost-1.83.0-r1
|
2024-12-11
|
913225
|
Gentoo L
|
Profiles
|
llvm
|
UNCO
|
---
|
amd64/desktop/llvm Profile Request
|
2023-12-07
|
914452
|
Gentoo L
|
Current
|
llvm
|
UNCO
|
---
|
llvm-core/clang-17.0.1:17/17 failed to emerge: x86_64-pc-linux-gnu-ld: error: undefined symbol
|
2024-12-11
|
914468
|
Gentoo L
|
Current
|
llvm
|
UNCO
|
---
|
llvm-core/clang-common-17 violates usersandbox in nvidia-drivers
|
2024-12-29
|
914531
|
Gentoo L
|
Current
|
llvm
|
UNCO
|
---
|
llvm-core/lld-17: crashes when building llvm-core/llvm-16.0.6
|
2024-12-11
|
914888
|
Gentoo L
|
Current
|
llvm
|
UNCO
|
---
|
llvm-core/clang-16.0.6 - fails to build with '-Os' with sys-devel/gcc:13 on ppc64
|
2024-12-11
|
917039
|
Gentoo L
|
Current
|
llvm
|
UNCO
|
---
|
=llvm-runtimes/libcxx-17.0.4: fails to link with USE +abi_x86_32 (glibc 2.38 issue?)
|
2024-12-11
|
919687
|
Gentoo L
|
Current
|
llvm
|
UNCO
|
---
|
llvm-core/llvm-14.0.6-r4 - LLVM_ENABLE_Z3_SOLVER cannot be enabled
|
2024-12-11
|
921612
|
Gentoo L
|
Current
|
llvm
|
UNCO
|
---
|
llvm-runtimes/compiler-rt-sanitizers-17.0.6 /usr/bin/x86_64-pc-linux-gnu-ld.bfd: unrecognised emulation mode: 64
|
2024-12-11
|
922519
|
Gentoo L
|
Current
|
llvm
|
UNCO
|
---
|
llvm-core/llvm-15.0.7-r3 error: type ‘SubtargetFeatureBits’ violates the C++ One Definition Rule [-Werror=odr]
|
2024-12-11
|
927926
|
Gentoo L
|
Current
|
llvm
|
UNCO
|
---
|
Upgrading from desktop 17.1 to 23.0 llvm-runtimes/libcxx llvm-runtimes/libcxxabi fails the world upgrade
|
2024-12-11
|
928936
|
Gentoo L
|
Current
|
llvm
|
UNCO
|
---
|
>=llvm-runtimes/compiler-rt-sanitizers-17.0.6 fails to compile with musl-1.2.4: compiler-rt/lib/sanitizer_common/sanitizer_linux.cpp:287:19: error: member access into incomplete type 'struct stat64'
|
2024-12-11
|
931656
|
Gentoo L
|
Current
|
llvm
|
UNCO
|
---
|
llvm-core/llvm-18.1.5 Fails to emerge Using lld Under WSL 2
|
2024-12-11
|
933496
|
Gentoo L
|
Current
|
llvm
|
UNCO
|
---
|
llvm-core/clang-18: ICE when building net-im/telegram-desktop-5.0.4
|
2025-02-05
|
934579
|
Gentoo L
|
Current
|
llvm
|
UNCO
|
---
|
llvm-runtimes/compiler-rt-sanitizers: fails tests (sanitizer_nolibc_test_main.x86_64.o: file not recognized: file format not recognized)
|
2024-12-13
|
935425
|
Gentoo L
|
Current
|
llvm
|
UNCO
|
---
|
llvm-runtimes/libcxx-19.0.0_pre20240623 ; 20.0.0_pre20240808 test fail (profile is not clang) x86_64-pc-linux-gnu/bin/ld.bfd: libc++experimental.a: error adding symbols
|
2024-12-11
|
936545
|
Gentoo L
|
Current
|
llvm
|
UNCO
|
---
|
llvm-core/llvm-17.0.6 test fail if LLVM_TARGETS : SPIRV
|
2024-12-11
|
936570
|
Gentoo L
|
Current
|
llvm
|
UNCO
|
---
|
llvm-runtimes/libunwind-18.1.8 fails to build
|
2024-12-11
|
938665
|
Gentoo L
|
Current
|
llvm
|
UNCO
|
---
|
llvm-core/clang: Module import path mismatch in the intercept-build tool
|
2024-12-11
|
939738
|
Gentoo L
|
Current
|
llvm
|
UNCO
|
---
|
llvm-core/llvm: 18.1.8-r1 fails to build on amd64-musl under WSL 2
|
2024-12-11
|
939746
|
Gentoo L
|
Current
|
llvm
|
UNCO
|
---
|
llvm-core/llvm-18.1.8-r1 fails to build on arm64 llvm musl profile
|
2024-12-11
|
940727
|
Gentoo L
|
Current
|
llvm
|
UNCO
|
---
|
llvm-core/clang-common should not set -D_LIBCPP_HARDENING_MODE, should be done in libcxx
|
2025-01-15
|
942599
|
Gentoo L
|
Current
|
llvm
|
UNCO
|
---
|
llvm-runtimes/compiler-rt-sanitizers-19.1.3 QA Notice: The following files contain writable and executable sections
|
2024-12-11
|
943037
|
Gentoo L
|
Current
|
llvm
|
UNCO
|
---
|
dev-lang/ghc breakage on arm/arm64 without LLVM 14
|
2024-11-09
|
944152
|
Gentoo L
|
Current
|
llvm
|
UNCO
|
---
|
=llvm-core/llvm-19.1.4: failed to compile
|
2025-03-17
|
946081
|
Gentoo L
|
Current
|
llvm
|
UNCO
|
---
|
llvm-core/llvm-toolchain-symlinks: Rephrase Description to "Symlinks to use LLVM"
|
2024-12-11
|
946269
|
Gentoo L
|
Current
|
llvm
|
UNCO
|
---
|
llvm-runtimes/compiler-rt-18.1.8-r2 fails test atomic_test.c
|
2024-12-28
|
946494
|
Gentoo L
|
Current
|
llvm
|
UNCO
|
---
|
llvm-runtimes/compiler-rt-sanitizers: linked to libgcc_s.so.1 and libstdc++.so.6 despite clang-common[default-compiler-rt,default-libcxx]
|
2024-12-15
|
946871
|
Gentoo L
|
Current
|
llvm
|
UNCO
|
---
|
llvm-runtimes/compiler-rt-sanitizers-19.1.6 fails configure phase when "USE=ctx-profile -memprof" are set
|
2024-12-24
|
947034
|
Gentoo L
|
Current
|
llvm
|
UNCO
|
---
|
llvm-runtimes/libcxxabi-19.1.6 fails to build with certain use flags
|
2024-12-29
|
947373
|
Gentoo L
|
Current
|
llvm
|
UNCO
|
---
|
sys-kernel/gentoo-sources-6.12.8: New warnings with sys-devel/llvm-19
|
2025-01-25
|
947641
|
Gentoo L
|
Current
|
llvm
|
UNCO
|
---
|
sys-libs/timezone-data-2024a-r1 fails to compile on musl/llvm "error: clang frontend command failed"
|
2025-01-07
|
948500
|
Gentoo L
|
Eclasses
|
llvm
|
UNCO
|
---
|
llvm-r2.eclass: llvm-config wrapper returns non-existent .so filename on default/linux/arm64/23.0/musl/llvm
|
2025-01-22
|
949552
|
Gentoo L
|
Current
|
llvm
|
UNCO
|
---
|
llvm-runtimes/libcxx-19.1.7 fails sys_info.zdump.pass.cpp test
|
2025-02-10
|
949576
|
Gentoo L
|
Current
|
llvm
|
UNCO
|
---
|
llvm-runtimes/offload-19.1.7 fails tests
|
2025-02-10
|
950171
|
Gentoo L
|
Current
|
llvm
|
UNCO
|
---
|
llvm-runtimes/libunwind-19.1.7 fails to build on aarch64 with musl
|
2025-02-26
|
951337
|
Gentoo L
|
Current
|
llvm
|
UNCO
|
---
|
llvm-runtimes/compiler-rt-sanitizers-19.1.7 - fails ScudoWrappersCppDeathTest
|
2025-03-14
|
951338
|
Gentoo L
|
Current
|
llvm
|
UNCO
|
---
|
llvm-runtimes/compiler-rt-sanitizers-19.1.7 - several test failures w. segfaults
|
2025-03-14
|
951445
|
Gentoo L
|
Current
|
llvm
|
UNCO
|
---
|
llvm-runtimes/libcxxabi-20.1.0 [clang, musl]: error: cannot open crtbeginS.o: No such file or directory
|
Mon 20:29
|
952009
|
Gentoo L
|
Current
|
llvm
|
UNCO
|
---
|
llvm-runtimes/offload fails to build: undefined symbol
|
Mon 05:33
|
952938
|
Gentoo L
|
Current
|
llvm
|
UNCO
|
---
|
llvm-runtimes/libcxxabi-20.1.1: Fails to build using 23.0/llvm profile
|
Mon 01:36
|
935335
|
Gentoo L
|
Current
|
lockalsash
|
UNCO
|
---
|
dev-libs/rocm-device-libs-6.1.1 fails to compile: ld.lld: error: undefined symbol: llvm::MemoryBuffer::getFile
|
2024-08-25
|
934377
|
Gentoo L
|
Current
|
maintainer-needed
|
UNCO
|
---
|
app-crypt/efitools-1.9.2-r1 fails to compile on musl/llvm: invalid ouptut format: 'efi-app-x86_64'
|
2024-08-02
|
951353
|
Gentoo L
|
Current
|
maintainer-needed
|
UNCO
|
---
|
media-libs/libsfml-2.6.2: [llvm] error: implicit instantiation of undefined template 'std::char_traits<unsigned int>'
|
Wed 23:17
|
522392
|
Gentoo L
|
New pack
|
maintainer-wanted
|
UNCO
|
---
|
dev-util/klee - a symbolic virtual machine built on top of the LLVM compiler infrastructure
|
2019-01-04
|
654280
|
Gentoo L
|
New pack
|
maintainer-wanted
|
UNCO
|
---
|
dev-util/graalvm - GraalVM is a universal virtual machine for running applications written in JavaScript, Python 3, Ruby, R, JVM-based languages like Java, Scala, Kotlin, and LLVM-based languages such as C and C++
|
2022-01-08
|
835570
|
Gentoo L
|
New pack
|
maintainer-wanted
|
UNCO
|
---
|
dev-lang/llvm-ada LLVM based GNAT compiler new package
|
2025-01-07
|
895326
|
Gentoo L
|
New pack
|
maintainer-wanted
|
UNCO
|
---
|
llvm-core/llvm-bolt (New Package)
|
2024-12-11
|
934015
|
Gentoo L
|
New pack
|
maintainer-wanted
|
UNCO
|
---
|
llvm-core/llvm-mingw ebuild skell
|
2025-02-13
|
745744
|
Gentoo L
|
Eclasses
|
mgorny
|
UNCO
|
---
|
llvm.eclass: needs get_llvm_prefix change for cross-compilation (was: www-client/firefox-?: cross-compilation fails)
|
2023-09-03
|
938506
|
Gentoo L
|
Current
|
mgorny
|
UNCO
|
---
|
sys-fs/duperemove: unable to find -latomic when compiling with clang/LLVM
|
2024-08-27
|
951975
|
Gentoo L
|
Eclasses
|
mgorny
|
UNCO
|
---
|
llvm-utils.eclass: llvm_prepend_path variable "prefix" is unset if no option is given
|
2025-03-24
|
909724
|
Gentoo L
|
Current
|
mozilla
|
UNCO
|
---
|
www-client/firefox-115.0[clang,pgo]: LLVM Profile Error: Failed to write file "default_24387_random_1577311168127381117_0.profraw": Broken pipe
|
2024-10-30
|
925251
|
Gentoo L
|
Current
|
mozilla
|
UNCO
|
---
|
>=www-client/firefox-123.0 fails to cross compile with new llvm-r1 eclass
|
2024-04-23
|
693200
|
Gentoo L
|
Current
|
negril.nx+gentoo
|
UNCO
|
---
|
media-gfx/blender should use llvm.eclass / add rocm use flag
|
2024-04-21
|
934684
|
Gentoo L
|
Current
|
negril.nx+gentoo
|
UNCO
|
---
|
>=dev-libs/protobuf-22*: ld undefined reference error with protoc [LLVM/libc++]
|
2024-07-09
|
949613
|
Gentoo L
|
Current
|
negril.nx+gentoo
|
UNCO
|
---
|
media-gfx/blender: HIP in Blender tries to use two versions of LLVM and crashes
|
2025-02-11
|
949649
|
Gentoo L
|
Current
|
negril.nx+gentoo
|
UNCO
|
---
|
media-gfx/openvdb-11.0.0: [llvm] error: a template argument list is expected after a name prefixed by the template keyword
|
2025-02-12
|
777069
|
Gentoo L
|
Current
|
office
|
UNCO
|
---
|
media-gfx/graphite2-1.3.14 ld.lld: error: unknown argument '-pipe' with the LLVM linker
|
2022-06-16
|
489686
|
Gentoo H
|
OpenRC
|
openrc
|
UNCO
|
---
|
mdraid, root on LVM - array doesn't stop at reboot
|
2017-04-26
|
715218
|
Gentoo L
|
Current
|
pgsql-bugs
|
UNCO
|
---
|
dev-db/postgresql-12.2[llvm]: build fails when llvm & clang slots don't match
|
2020-11-23
|
906172
|
Gentoo L
|
Current
|
pgsql-bugs
|
UNCO
|
---
|
dev-db/postgresql-15.3 test fails to load llvmjit.so
|
2023-05-12
|
931944
|
Gentoo L
|
Current
|
pgsql-bugs
|
UNCO
|
---
|
dev-db/postgresql-{12.19,13.15,14.12,15.7,16.3}-r1: ebuilds are missing LLVM_OPTIONAL
|
2024-05-15
|
762095
|
Gentoo L
|
Current
|
prefix
|
UNCO
|
---
|
sys-devel/binutils-apple: fix llvm patches to avoid exec loop
|
2021-01-06
|
934376
|
Gentoo L
|
Current
|
proaudio
|
UNCO
|
---
|
media-sound/audacity-3.4.2-r1 fails to compile on musl/llvm due to undefined symbols and references
|
2025-01-07
|
923500
|
Gentoo L
|
Current
|
qt
|
UNCO
|
---
|
dev-qt/qtwebengine-5.15.12_p20240122 - build.cc & build.h Errors (LLVM 17)
|
2024-02-21
|
927471
|
Gentoo L
|
Current
|
randy
|
UNCO
|
---
|
dev-lang/rust: Building Anything Rust-based Fails to Compile Due to Missing -lgcc_s on musl/llvm profile
|
2024-03-25
|
934612
|
Gentoo R
|
Other
|
releng
|
UNCO
|
---
|
scripts/bootstrap.sh pulls in gcc on llvm profiles
|
2024-06-23
|
937996
|
Gentoo R
|
Stages
|
releng
|
UNCO
|
---
|
releases/amd64/binpackages/23.0/{x32,x86-64_hardened,x86-64_llvm,x86-64_musl,x86-64_musl_hardened,x86-64_musl_llvm} not updated since March
|
2024-08-16
|
759064
|
Gentoo L
|
Current
|
rust
|
UNCO
|
---
|
dev-lang/rust rustc breaks if llvm (and clang) is rebuilt with toggled USE=debug
|
2024-02-14
|
913402
|
Gentoo L
|
Current
|
rust
|
UNCO
|
---
|
dev-lang/rust-1.72.0: Missing symbols with USE="-system-llvm" if system llvm compiled with libcxx
|
2024-08-25
|
917492
|
Gentoo L
|
Current
|
rust
|
UNCO
|
---
|
=dev-lang/rust-1.73.0 fail to work after successfully compile, with Arm64 Musl LLVM Stage3 rootfs
|
2024-02-14
|
892926
|
Gentoo L
|
Current
|
sound
|
UNCO
|
---
|
media-libs/libmad-0.15.1b-r10: it will reorder CFLAGS causing -mllvm -polly fail
|
2023-06-17
|
893162
|
Gentoo L
|
Current
|
sound
|
UNCO
|
---
|
media-sound/cmus-2.10.0-r1 fails to link -latomic on llvm-musl
|
2025-01-23
|
948261
|
Gentoo L
|
Current
|
swegener
|
UNCO
|
---
|
dev-debug/systemtap-5.2: add a patch to compile with clang and llvm's libcxx
|
2025-01-17
|
508686
|
Gentoo L
|
[OLD] Co
|
systemd
|
UNCO
|
---
|
systemd fails to start with lvm ater boot from initramfs with separate /usr partition
|
2014-05-30
|
823041
|
Gentoo L
|
Current
|
toolchain
|
UNCO
|
---
|
virtual/libunwind: New virtual to allow selection between sys-libs/libunwind and sys-libs/llvm-libunwid
|
2024-09-24
|
913750
|
Gentoo L
|
Profiles
|
toolchain
|
UNCO
|
---
|
sys-libs/binutils-libs-2.40-r5 on llvm-openrc profile : "clang-16: error: unsupported option '-print-multi-os-directory'"
|
2024-04-04
|
950662
|
Gentoo L
|
Current
|
toolchain
|
UNCO
|
---
|
sys-libs/glibc: Enable the stripping phase if using llvm-strip
|
2025-03-21
|
914474
|
Gentoo L
|
Current
|
virtualization
|
UNCO
|
---
|
app-emulation/qemu-8.1.0-r1 fails to build on LLD16 with LLVM: undefined symbol: __unordtf2
|
2024-04-27
|
658152
|
Gentoo L
|
Current
|
voyageur
|
UNCO
|
---
|
llvm-runtimes/openmp-6.0.1 fails test lock/omp_init_lock.c
|
2024-12-11
|
681806
|
Gentoo L
|
Current
|
voyageur
|
UNCO
|
---
|
llvm-runtimes/openmp must be built with clang/clang++ for use cuda to be fully installed
|
2024-12-11
|
692290
|
Gentoo L
|
Current
|
voyageur
|
UNCO
|
---
|
net-libs/nghttp2-1.39.2 USE=cxx : configure: error: Could not link against boost_thread-mt (ld.lld: error: undefined symbol: _Unwind_GetLanguageSpecificData referenced by gcc_personality_v0.c.o:(__gcc_personality_v0) in archive /usr/lib/llvm/8/bin/../...)
|
2022-07-10
|
700762
|
Gentoo L
|
Current
|
voyageur
|
UNCO
|
---
|
llvm-runtimes/openmp-10.0.0.9999 USE=-ompt - .../work/openmp/tools/archer/ompt-tsan.cpp:38:10: fatal error: omp-tools.h: No such file or directory
|
2024-12-11
|
796572
|
Gentoo L
|
Current
|
voyageur
|
UNCO
|
---
|
llvm-runtimes/openmp-12.0.0 fails test 'tasking/hidden_helper_task/taskgroup.cpp'
|
2024-12-11
|
816750
|
Gentoo L
|
Current
|
voyageur
|
UNCO
|
---
|
llvm-runtimes/openmp-13.0.0 [28/206] ninja: build stopped: subcommand failed (ninja -v -j5 -l0 failed)
|
2024-12-11
|
828009
|
Gentoo L
|
Current
|
voyageur
|
UNCO
|
---
|
llvm-runtimes/openmp-13.0.0-r1 fails test 'libomp :: env/kmp_aff_disable_hwloc.c' with abi_x86_32
|
2024-12-11
|
880085
|
Gentoo L
|
Current
|
voyageur
|
UNCO
|
---
|
llvm-runtimes/openmp-15.0.3 fails tests atomic/omp-atomic-compare-signedness.c and teams/teams-atomic.c
|
2025-02-16
|
892699
|
Gentoo L
|
Current
|
voyageur
|
UNCO
|
---
|
llvm-runtimes/openmp-15.0.7 fails tests kmp-affinity, kmp-hw-subset, omp-places
|
2024-12-11
|
927249
|
Gentoo L
|
Current
|
voyageur
|
UNCO
|
---
|
llvm-runtimes/openmp: OpenMP not found since libomp was slotted
|
2024-12-11
|
913661
|
Gentoo L
|
Current
|
zero-one
|
UNCO
|
---
|
dev-libs/jansson-2.14-r1 fails to compile with LLVM 16 with LTO
|
2024-03-12
|
722672
|
Gentoo L
|
Current
|
base-system
|
UNCO
|
---
|
dev-libs/libaio: broken on x32, causes sys-fs/lvm2 runtime failure
|
2024-03-04
|
330651
|
Gentoo L
|
[OLD] Co
|
base-system
|
CONF
|
---
|
lvm2 udev scripts do not properly set up /dev: udev permissions rules on my LVM don't run
|
2024-03-03
|
408963
|
Quality
|
Trackers
|
qa
|
CONF
|
---
|
[TRACKER] Support LLVM/Clang as alternative system compiler
|
2025-03-26
|
946812
|
Gentoo L
|
Current
|
3dprint
|
CONF
|
---
|
dev-libs/cereal-1.3.2-r2 - [llvm] tuple.hpp: error: a template argument list is expected after a name prefixed by the template keyword [-Wmissing-template-arg-list-after-
|
2025-03-09
|
423745
|
Gentoo L
|
Current
|
aballier
|
CONF
|
---
|
llvm-runtimes/libcxx-0.0_p20120528: fails tests
|
2024-12-11
|
595744
|
Gentoo L
|
Current
|
aballier
|
CONF
|
---
|
llvm-runtimes/libcxx (ppc*) - In file included from ../src/thread.cpp:13:0: ../include/thread:431:73: error: ‘(9.223372036854775807e+18 / 1.0e+9)’ is not a constant expression
|
2024-12-11
|
600364
|
Gentoo L
|
Current
|
aballier
|
CONF
|
---
|
llvm-runtimes/libcxx-9999: fails static assertions on x32
|
2024-12-11
|
655034
|
Gentoo L
|
Current
|
aballier
|
CONF
|
---
|
llvm-runtimes/libcxx-6.0.0 fails test: FAILED: test/CMakeFiles/check-cxx
|
2024-12-11
|
938721
|
Gentoo L
|
Current
|
accessibility
|
CONF
|
---
|
app-accessibility/flite-2.2-r2 - [ncurses-6.5] [llvm] /.../stdlib.h: error: pass_object_size attribute only applies to constant pointer arguments
|
2025-02-25
|
941464
|
Gentoo L
|
Current
|
alarig
|
CONF
|
---
|
net-misc/frr-10.1.1 - [libtool] [llvm] /.../policy_checks.h: error: C++ versions less than C++14 are not supported.
|
2024-12-21
|
946815
|
Gentoo L
|
Current
|
alexander
|
CONF
|
---
|
sci-physics/lhapdf-6.5.5 - [llvm] ld.lld: error: crti.o is incompatible with elf32-i386
|
2024-12-22
|
564302
|
Gentoo L
|
Current
|
amadio
|
CONF
|
---
|
sci-physics/root bundles whole llvm/clang
|
2024-03-10
|
928099
|
Gentoo L
|
Current
|
amadio
|
CONF
|
---
|
sci-physics/root-6.30.04-r1 fails to compile: ld: error: libclangCodeGen.a(CGStmtOpenMP.cpp.o)(.text._ZL28emitOutlinedFunctionPrologueRN5clang7CodeGen15CodeGenFunctionERNS0_15FunctionArgListERN4llvm9MapVectorIPKNS_4DeclESt4pairIPKNS_7VarDeclENS0_7Address
|
2024-03-29
|
938438
|
Gentoo L
|
Current
|
amynka
|
CONF
|
---
|
dev-lang/fpc-3.2.2 - [llvm] clang-18clang-18: : clang-18: error: error: unknown argument: --64unknown argument: --64
|
2024-08-24
|
504092
|
Gentoo L
|
Current
|
base-system
|
CONF
|
---
|
sys-fs/lvm2-2.02.103[clvm,cman] auto_activation_volume_list not respected, no stop_volumes
|
2020-12-27
|
550228
|
Gentoo L
|
[OLD] Co
|
base-system
|
CONF
|
---
|
sys-fs/lvm2 on musl gives extra error messages on volume activation
|
2020-12-27
|
673242
|
Gentoo L
|
Current
|
base-system
|
CONF
|
---
|
sys-fs/lvm2 - lvremove on an active LV does not remove it from /dev
|
2020-12-27
|
682578
|
Gentoo L
|
Current
|
base-system
|
CONF
|
---
|
=sys-fs/lvm2-2.02.183 USE=udev leads to long delays in the initramfs
|
2020-12-27
|
891821
|
Gentoo L
|
Current
|
base-system
|
CONF
|
---
|
sys-fs/lvm2-2.03.17-r2: breakage with cached volumes when USE=lvm (-thin)
|
2024-11-22
|
933350
|
Gentoo L
|
Current
|
base-system
|
CONF
|
---
|
app-arch/xz-utils-5.6.2 - [llvm] ld.lld: error: cannot open .../libclang_rt.profile-i386.a: No such file or directory
|
2024-06-01
|
947218
|
Gentoo L
|
Current
|
base-system
|
CONF
|
---
|
sys-fs/lvm2: init script should honor autoactivation flag
|
2024-12-30
|
938699
|
Gentoo L
|
Current
|
bkohler
|
CONF
|
---
|
app-text/discount-2.2.7c-r1 - [ncurses-6.5] [llvm] gethopt.c: error: parameter val was not declared, defaults to int; ISO
|
2024-10-27
|
941393
|
Gentoo L
|
Current
|
bkohler
|
CONF
|
---
|
sys-apps/memtest86+-7.00 - [libtool] [llvm] ld.lld: error: unknown argument --warn-constructors
|
2024-10-12
|
755449
|
Gentoo L
|
Current
|
candrews
|
CONF
|
---
|
llvm-core/llvm-roc-3.9.0 does not respect CFLAGS
|
2024-12-11
|
778326
|
Gentoo L
|
Current
|
candrews
|
CONF
|
---
|
dev-libs/rocm-device-libs-4.0.0 - /.../llvm-link: error: linked module is broken!
|
2021-03-28
|
836115
|
Gentoo L
|
Current
|
candrews
|
CONF
|
---
|
llvm-core/llvm-roc: uses variables banned in scope (VariableScope)
|
2024-12-11
|
836818
|
Gentoo L
|
Current
|
candrews
|
CONF
|
---
|
llvm-core/llvm-roc-5.0.2 - /.../ld: .../libhsa-runtime64.so.1.5.0: undefined reference to hsaKmtRuntimeEnable@HSAKMT_1
|
2024-12-11
|
864085
|
Gentoo L
|
Current
|
candrews
|
CONF
|
---
|
dev-libs/rocm-comgr-5.1.3 - /.../comgr-compiler.cpp: error: cannot convert llvm::raw_ostream to bool
|
2022-08-27
|
881195
|
Gentoo L
|
Current
|
candrews
|
CONF
|
---
|
llvm-core/llvm-roc-5.0.2: calls Python directly / uses Python not in PYTHON_COMPAT
|
2024-12-11
|
887143
|
Gentoo L
|
Current
|
candrews
|
CONF
|
---
|
dev-libs/rocr-runtime-4.3.0 fails to compile (DASH-SYSTEM): fatal error: cannot open file opencl.bc: Opaque pointers are only supported in -opaque-pointers mode (Producer: LLVM15.0.6 Reader: LLVM 14.0.0roc)
|
2023-01-27
|
913745
|
Gentoo L
|
Current
|
candrews
|
CONF
|
---
|
dev-libs/rocr-runtime-5.3.3-r1 - fatal error: cannot open file .../opencl.bc: Unknown attribute kind (86) (Producer: LLVM16.0.6 Re
|
2024-04-11
|
929044
|
Gentoo L
|
Current
|
candrews
|
CONF
|
---
|
dev-libs/rocr-runtime-5.3.3-r1 fails to compile: No LLVM slot <= 15 satisfying the packages dependencies found installed!
|
2024-04-10
|
932434
|
Gentoo L
|
Current
|
candrews
|
CONF
|
---
|
net-p2p/cpuminer-opt-24.2 - [ncurses-6.5] [gcc-15] [llvm] ./miner.h: error: expected ; after return statement
|
2024-05-22
|
945642
|
Gentoo L
|
Current
|
candrews
|
CONF
|
---
|
dev-libs/rocr-runtime-5.5.1 - [libtool] [gcc-15] No LLVM slot <= 16 satisfying the packages dependencies found installed!
|
2024-12-01
|
932546
|
Gentoo L
|
Current
|
chewi
|
CONF
|
---
|
dev-libs/libgcrypt-compat-1.5.6 - [ncurses-6.5] [gcc-15] [llvm] /.../mpih-div.c: error: invalid use of a cast in a inline asm context requiring an lvalue: remove the cast or build
|
2024-05-23
|
922163
|
Gentoo L
|
Current
|
chiitoo
|
CONF
|
---
|
media-video/obs-studio[browser] - build fails with LLVM profile with or without LTO (even fallback to gcc)
|
2025-02-25
|
938610
|
Gentoo L
|
Current
|
chithanh
|
CONF
|
---
|
net-wireless/aic8800-1.0.5 - [ncurses-6.5] [llvm] error: unknown warning option -Wno-discarded-qualifiers; did you mean
|
2024-08-28
|
917538
|
Gentoo L
|
Profiles
|
chutzpah
|
CONF
|
---
|
app-misc/openrgb-9.0 (LLVM Profile) - 'std::basic_stringstream<char>' (error: implicit instantiation of undefined template)
|
2024-04-22
|
902851
|
Gentoo L
|
Current
|
cjk
|
CONF
|
---
|
dev-libs/darts-0.32h_pre20181117064816: build failed with llvm-core/clang-16.0.0 (error: no member named 'random_shuffle' in namespace 'std')
|
2024-12-22
|
946820
|
Gentoo L
|
Current
|
cjk
|
CONF
|
---
|
dev-libs/darts-0.32h_pre20181117064816 - [llvm] lexicon.h: error: no member named random_shuffle in namespace std
|
2024-12-22
|
938434
|
Gentoo L
|
Current
|
cluster
|
CONF
|
---
|
sys-cluster/ucx-1.13.1 - [llvm] io_demo.cc: error: no member named random_shuffle in namespace std
|
2024-08-24
|
938439
|
Gentoo L
|
Current
|
cluster
|
CONF
|
---
|
sys-cluster/ucx-1.13.0 - [llvm] io_demo.cc: error: no member named random_shuffle in namespace std
|
2025-03-28
|
938468
|
Gentoo L
|
Current
|
cluster
|
CONF
|
---
|
sys-cluster/classads-1.0.10 - [llvm] ld.lld: error: undefined hidden symbol: std::_1::basic_ostream<char, std::_1::char_traits<char>>& std::_1::operator<<[ab
|
2024-08-24
|
941465
|
Gentoo L
|
Current
|
cluster
|
CONF
|
---
|
sys-cluster/legion-23.03.0 - [libtool] [llvm] /.../bitmask.h: error: a template argument list is expected after a name prefixed by the template keyword [-Wmissing-templat
|
2024-10-13
|
938688
|
Gentoo L
|
Current
|
common-lisp
|
CONF
|
---
|
dev-lisp/ecl-24.5.10 - [ncurses-6.5] [llvm] /.../install: cannot stat bin/ecl: No such file or directory
|
2024-08-30
|
942214
|
Gentoo L
|
Current
|
crossdev
|
CONF
|
---
|
sys-devel/crossdev Optional support of clang/llvm
|
2025-03-27
|
948156
|
Gentoo L
|
Current
|
darkdefende
|
CONF
|
---
|
media-gfx/blender: Drop support for old LLVM?
|
2025-03-16
|
521968
|
Portage
|
Core
|
dev-portage
|
CONF
|
---
|
llvm-core/llvm-9999 with sys-apps/portage-2.2.12 - KeyError: '<portage.util._dyn_libs.LinkageMapELF.LinkageMapELF._ObjectKey object at 0x7f5a0a9556e0> (/usr/lib64/libLLVM-3.5svn.so) not in object list'
|
2025-02-01
|
908717
|
Portage
|
Core
|
dev-portage
|
CONF
|
---
|
sys-apps/portage-9999: can't resolve upgrade to LLVM 17 snapshots
|
2023-08-08
|
908048
|
Gentoo L
|
Current
|
dlan
|
CONF
|
---
|
net-vpn/vpncloud-2.3.0 - rustc: .../InstructionPrecedenceTracking.cpp:97: void llvm::InstructionPrecedenceTracking::validate(const
|
2023-12-10
|
932614
|
Gentoo L
|
Current
|
ejabberd
|
CONF
|
---
|
dev-erlang/jose-1.11.10 - [ncurses-6.5] [gcc-15] [llvm] Compiling .../jose_jwa.erl failed:
|
2024-06-08
|
904228
|
Gentoo L
|
Current
|
floppym
|
CONF
|
---
|
sys-boot/grub: Grub fails to detect LVM volumes with: error: disk `lvmid/*/*' not found
|
2024-08-03
|
830492
|
Gentoo L
|
Current
|
games
|
CONF
|
---
|
games-engines/gargoyle-2019.1.1 fails to compile: llvm-ar: error: unknown option /
|
2022-01-03
|
932435
|
Gentoo L
|
Current
|
games
|
CONF
|
---
|
games-puzzle/groundhog-1.4-r1 - [ncurses-6.5] [gcc-15] [llvm] pocket.cc: error: no member named mem_fun in namespace std; did you
|
2024-05-22
|
932500
|
Gentoo L
|
Current
|
games
|
CONF
|
---
|
games-emulation/snes9x-1.62.3 - [ncurses-6.5] [gcc-15] [llvm] unix.cpp: error: invalid operands to binary expression
|
2024-05-22
|
941422
|
Gentoo L
|
Current
|
games
|
CONF
|
---
|
games-arcade/amphetamine-0.8.10-r3 - [libtool] [llvm] 45 | if (!OpenDataFile(gSystem->QualifyDataDir(gConst->kFileMonster))) gSystem->Error(Cannot find file kFileMonster
|
2024-10-12
|
941489
|
Gentoo L
|
Current
|
games
|
CONF
|
---
|
games-emulation/dosbox-0.75_pre4302 - [libtool] [llvm] ./render_templates_sai.h: error: ISO C++17 does not allow register storage class specifier [-Wregister]
|
2024-10-13
|
926895
|
Gentoo L
|
Current
|
genkernel
|
CONF
|
---
|
sys-kernel/gentoo-sources fails to build with LLVM/CLANG >15
|
2024-03-13
|
904368
|
Gentoo L
|
Current
|
gentoo
|
CONF
|
---
|
dev-util/spirv-llvm-translator:15 fails tests on riscv
|
2025-01-06
|
920541
|
Gentoo L
|
Current
|
gentoo
|
CONF
|
---
|
dev-util/intel-graphics-compiler: requires LLVM 15
|
2025-01-11
|
908078
|
Gentoo L
|
Current
|
gnome
|
CONF
|
---
|
gui-libs/gtk-4.10.4 fails to compile on ~amd64 llvm profile ld.lld: error: target emulation unknown: -m or at least one .o file required
|
2024-02-11
|
938608
|
Gentoo L
|
Current
|
gnome
|
CONF
|
---
|
dev-util/umockdev-0.18.3 - [ncurses-6.5] [llvm] ld.lld: error: undefined symbol: _readlinkat_alias
|
2024-08-28
|
945346
|
Gentoo L
|
Current
|
gnome
|
CONF
|
---
|
dev-util/gnome-builder: update to llvm-r2
|
2024-12-31
|
932575
|
Gentoo L
|
Current
|
grozin
|
CONF
|
---
|
app-text/simple-fb2-reader-1.1.3 - [ncurses-6.5] [gcc-15] [llvm] clang-18: error: unknown argument: -export-dynamic
|
2024-05-23
|
930448
|
Gentoo L
|
Current
|
gstreamer
|
CONF
|
---
|
media-libs/gst-plugins-good-1.22.11 fails test - 97/98 elements_flvmux FAIL 22.07s exit status 1
|
2025-01-30
|
950379
|
Gentoo L
|
Current
|
gstreamer
|
CONF
|
---
|
media-libs/gst-plugins-good-1.24.11 fails test - [gcc-15] 98/99 elements_flvmux FAIL 22.96s exit status 1
|
2025-02-28
|
945344
|
Gentoo L
|
Current
|
h.judt
|
CONF
|
---
|
dev-lisp/c2ffi: update to llvm-r2
|
2025-02-10
|
941445
|
Gentoo L
|
Current
|
hardened
|
CONF
|
---
|
sys-apps/paxctld-1.2.5-r1 - [libtool] [llvm] !!! Couldnt download paxctld_1.2.5.orig.tar.gz. Aborting.
|
2024-10-13
|
945343
|
Gentoo L
|
Current
|
haskell
|
CONF
|
---
|
dev-lang/ghc: update to llvm-r2 or remove llvm.eclass
|
2024-12-31
|
742452
|
Gentoo L
|
Current
|
hydrapolic
|
CONF
|
---
|
www-apache/mod_maxminddb-1.2.0 fails to compile with clang/llvm
|
2024-07-12
|
744856
|
Gentoo L
|
Current
|
hydrapolic
|
CONF
|
---
|
app-emulation/xen-tools-4.14.0-r1 fails to compile with clang/llvm
|
2021-12-13
|
655166
|
Gentoo I
|
Dev box
|
infra-bugs
|
CONF
|
---
|
Containerized amd64(+x86) devbox for mgorny's LLVM/PyPy work
|
2018-05-07
|
794175
|
Gentoo I
|
Other
|
infra-bugs
|
CONF
|
---
|
LLVM buildbot on Gentoo Infra
|
2022-09-13
|
941444
|
Gentoo L
|
Current
|
ionen
|
CONF
|
---
|
dev-libs/ncnn-20240820 - [libtool] [llvm] ld.lld: error: undefined symbol: google::protobuf::io::IstreamInputStream::IstreamInputStream(std::_1::basic_istream<char, std::
|
2024-10-13
|
841632
|
Gentoo L
|
Current
|
java
|
CONF
|
---
|
dev-util/visualvm-2.1.7-r1: multiple bundled java packages
|
2023-11-24
|
905895
|
Gentoo L
|
Current
|
java
|
CONF
|
---
|
dev-util/visualvm-2.1.10 installs files with unresolved SONAME dependencies
|
2024-10-10
|
937128
|
Gentoo L
|
Current
|
java
|
CONF
|
---
|
dev-util/visualvm-2.1.10 java-pkg_ensure-dep issue
|
2024-10-10
|
580870
|
Gentoo L
|
[OLD] De
|
llvm
|
CONF
|
---
|
llvm-runtimes/compiler-rt: various compiler_rt libs should be produced for all appropriate targets
|
2024-12-11
|
600362
|
Gentoo L
|
Current
|
llvm
|
CONF
|
---
|
llvm-runtimes/libunwind: build failure on ABI=x32
|
2024-12-11
|
616566
|
Gentoo L
|
Current
|
llvm
|
CONF
|
---
|
llvm-core/clang-4.0.0 uses the wrong chost prefix for symlinks (CHOST != CHOST_arm)
|
2024-12-11
|
617776
|
Gentoo L
|
Current
|
llvm
|
CONF
|
---
|
llvm-core/llvm does not install ${CHOST}-prefixed tools
|
2024-12-11
|
651908
|
Gentoo L
|
Current
|
llvm
|
CONF
|
---
|
llvm-core/clang should create ${CHOST}-clang & co symlinks based on LLVM_TARGETS
|
2024-12-11
|
662720
|
Gentoo L
|
Current
|
llvm
|
CONF
|
---
|
llvm-core/llvm: llvm-config being a binary breaks cross compilation of dependent packages
|
2024-12-11
|
684872
|
Gentoo L
|
Current
|
llvm
|
CONF
|
---
|
llvm-runtimes/compiler-rt-8.0.0: configure fails with llvm-core/llvm[-gold]
|
2024-12-11
|
688638
|
Gentoo L
|
Current
|
llvm
|
CONF
|
---
|
llvm-core/clang-8.0.0 fails tests: FAILED: test/CMakeFiles/check-clang
|
2024-12-11
|
691900
|
Gentoo L
|
Current
|
llvm
|
CONF
|
---
|
llvm-core/lld llvm-runtimes/libcxx llvm-runtimes/libcxxabi should be SLOTted
|
2024-12-11
|
707078
|
Gentoo L
|
Current
|
llvm
|
CONF
|
---
|
llvm-runtimes/libcxxabi-14.0.4 fails to compile on arm with: cxa_personality.cpp:573:22: error: '_URC_FATAL_PHASE1_ERROR' was not declared in this scope'
|
2024-12-11
|
711772
|
Gentoo L
|
Current
|
llvm
|
CONF
|
---
|
llvm-core/lldb-10.0.0_rc3 fails tests: ERROR: test_sb_command_return_object (TestSBCommandReturnObject.TestSBCommandReturnObject)
|
2024-12-11
|
721634
|
Gentoo L
|
Current
|
llvm
|
CONF
|
---
|
llvm-runtimes/libcxxabi fails tests
|
2024-12-11
|
722992
|
Gentoo L
|
Current
|
llvm
|
CONF
|
---
|
"llvm-libunwind" USE flag for usage of llvm-runtimes/libunwind
|
2024-12-11
|
730072
|
Gentoo L
|
Current
|
llvm
|
CONF
|
---
|
llvm-core/clang-10.x fails test: clang-tidy/checkers/abseil-duration-factory-scale.cpp
|
2024-12-11
|
731004
|
Gentoo L
|
Current
|
llvm
|
CONF
|
---
|
[TRACKER] Packages that have failures with LLD linker (llvm-core/lld)
|
2025-03-12
|
732920
|
Gentoo L
|
Current
|
llvm
|
CONF
|
---
|
llvm-core/llvm-10.0.0: 62 test failures on sparc
|
2024-12-11
|
733900
|
Gentoo L
|
Current
|
llvm
|
CONF
|
---
|
llvm-runtimes/compiler-rt-sanitizers-10.0.1 fails tests: FAILED: test/CMakeFiles/check-compiler-rt
|
2024-12-11
|
736856
|
Gentoo L
|
Current
|
llvm
|
CONF
|
---
|
llvm-core/llvm-10.0.1: Can't be built for Celeron N4100 (Gemini Lake)
|
2024-12-11
|
738890
|
Gentoo L
|
Current
|
llvm
|
CONF
|
---
|
llvm-core/llvm: llvm-objdump does not recognize '-g' option (was: dev-util/ccache-3.7.11 fails tests)
|
2024-12-11
|
747844
|
Gentoo L
|
Current
|
llvm
|
CONF
|
---
|
llvm-runtimes/compiler-rt-sanitizers-10.0.1 : CMake will not be able to correctly generate this project.
|
2024-12-11
|
755110
|
Gentoo L
|
Current
|
llvm
|
CONF
|
---
|
llvm-runtimes/compiler-rt-sanitizers-11.0.0 fails test/gwp_asan/CMakeFiles/check-gwp_asan-unit
|
2024-12-11
|
781851
|
Gentoo L
|
Current
|
llvm
|
CONF
|
---
|
dev-ml/llvm: uses hardcoded CC from OCaml build-time
|
2024-12-11
|
815688
|
Gentoo L
|
Current
|
llvm
|
CONF
|
---
|
llvm-runtimes/compiler-rt-sanitizers-19.1.0 installs files that contain writable and executable sections
|
2024-12-11
|
828694
|
Gentoo L
|
Current
|
llvm
|
CONF
|
---
|
llvm-core/clang-15.0.6 - One or more CMake variables were not used by the project: LLVM_BUILD_TESTS
|
2024-12-11
|
832561
|
Gentoo L
|
Current
|
llvm
|
CONF
|
---
|
llvm-core/lldb-19.1.1 - One or more CMake variables were not used by the project:
|
2024-12-11
|
834490
|
Gentoo L
|
Current
|
llvm
|
CONF
|
---
|
llvm-runtimes/compiler-rt-sanitizers-13.0.1 /usr/bin/x86_64-pc-linux-gnu-ld: cannot find -l:libunwind.so
|
2024-12-11
|
836376
|
Gentoo L
|
Current
|
llvm
|
CONF
|
---
|
llvm-core/lld-15.0.4 - One or more CMake variables were not used by the project:
|
2024-12-11
|
838175
|
Gentoo L
|
Current
|
llvm
|
CONF
|
---
|
llvm-runtimes/libunwind-15.0.2 fails tests on MUSL
|
2024-12-11
|
838373
|
Gentoo L
|
Current
|
llvm
|
CONF
|
---
|
llvm-core/clang: compilation of e.g. www-client/firefox-99.0.1 and mail-client/thunderbird fails (error: always_inline function '_mm_crc32_u64' requires target feature 'crc32')
|
2024-12-12
|
853070
|
Gentoo L
|
Current
|
llvm
|
CONF
|
---
|
llvm-core/llvm-14.0.5 - Could not import extension sphinx.builders.linkcheck (exception: No module named six)
|
2024-12-11
|
869035
|
Gentoo L
|
Current
|
llvm
|
CONF
|
---
|
llvm-runtimes/libcxxabi-15.0.0:0 - CMake will not be able to correctly generate this project.
|
2024-12-11
|
869041
|
Gentoo L
|
Current
|
llvm
|
CONF
|
---
|
dev-ml/llvm-16.0.5 - One or more CMake variables were not used by the project:
|
2024-12-11
|
876631
|
Gentoo L
|
Current
|
llvm
|
CONF
|
---
|
llvm-core/lldb-16.0.0_pre20221010: LLVM ERROR: inconsistency in registered CommandLine options
|
2024-12-11
|
879861
|
Gentoo L
|
Current
|
llvm
|
CONF
|
---
|
llvm-runtimes/compiler-rt-sanitizers-15.0.3: failed (test phase)
|
2024-12-11
|
879909
|
Gentoo L
|
Current
|
llvm
|
CONF
|
---
|
llvm-runtimes/compiler-rt-15.0.4 - CMake will not be able to correctly generate this project.
|
2024-12-11
|
883225
|
Gentoo L
|
Current
|
llvm
|
CONF
|
---
|
llvm-runtimes/compiler-rt-sanitizers fails to build due to wrong order of upgrades (needs dependency adjustments?)
|
2024-12-11
|
884395
|
Gentoo L
|
Current
|
llvm
|
CONF
|
---
|
llvm-core/clang: check whether needs adaptation for IEEE long double
|
2024-12-11
|
885795
|
Gentoo L
|
Current
|
llvm
|
CONF
|
---
|
llvm-core/llvm: build failure on PPC with >= sys-devel/gcc-11(?) with -fsanitize=undefined (Error: operand out of range)
|
2024-12-11
|
902559
|
Gentoo L
|
Current
|
llvm
|
CONF
|
---
|
llvm-core/lld-15.0.7: SIGABRT compiling chromium[lto] on ppc64le
|
2024-12-11
|
906603
|
Gentoo L
|
Current
|
llvm
|
CONF
|
---
|
llvm-runtimes/compiler-rt-sanitizers: clang -fsanitize=memory (msan) broken w/ sys-libs/musl-1.2.4
|
2025-02-16
|
908233
|
Gentoo L
|
Current
|
llvm
|
CONF
|
---
|
llvm-runtimes/libcxxabi: fails to configure (unknown CMake command "CHECK_C_SOURCE_COMPILES".)
|
2024-12-11
|
912821
|
Gentoo L
|
Current
|
llvm
|
CONF
|
---
|
[Tracker] Issues with LLVM 17
|
2024-07-19
|
912889
|
Gentoo L
|
Current
|
llvm
|
CONF
|
---
|
llvm-runtimes/libcxx-16.0.6 - /.../iterator_operations.h: error: use of built-in trait _remove_cvref(_Tp) in function signature; use li
|
2024-12-11
|
913968
|
Gentoo L
|
Current
|
llvm
|
CONF
|
---
|
llvm-runtimes/libunwind-16.0.6-r1 - x86_64-pc-linux-gnu-gcc: error: unrecognized command-line option -nostdlib++
|
2024-12-11
|
914454
|
Gentoo L
|
Current
|
llvm
|
CONF
|
---
|
llvm-runtimes/compiler-rt-sanitizers-19.1.1 - One or more CMake variables were not used by the project:
|
2024-12-11
|
914642
|
Gentoo L
|
Current
|
llvm
|
CONF
|
---
|
llvm-core/llvm-16.0.6 - [clang] clang++: error: clang frontend command failed with exit code 139 (use -v to see invocation)
|
2024-12-11
|
918598
|
Gentoo L
|
Current
|
llvm
|
CONF
|
---
|
llvm-runtimes/libcxx-17.0.5 - path.cpp:(<snip>) undefined reference to _cxa_call_terminate
|
2024-12-11
|
918869
|
Gentoo L
|
Current
|
llvm
|
CONF
|
---
|
llvm-core/llvm-16.0.6 - [clang] clang++: error: clang frontend command failed with exit code 139 (use -v to see invocation)
|
2024-12-11
|
919745
|
Gentoo L
|
Current
|
llvm
|
CONF
|
---
|
musl+clang/llvm: Erroneous .gnu_debuglink entry copied from C runtime files
|
2023-12-13
|
920536
|
Quality
|
Trackers
|
llvm
|
CONF
|
---
|
[TRACKER] LLVM 16 porting
|
2024-06-24
|
920550
|
Gentoo L
|
Current
|
llvm
|
CONF
|
---
|
llvm-core/llvm-17.0.6 fails tests on sparc
|
2024-12-11
|
921728
|
Gentoo L
|
Current
|
llvm
|
CONF
|
---
|
llvm-core/lld: segmentation fault when building media-libs/vips-8.15.1 with -flto
|
2024-12-11
|
922202
|
Gentoo L
|
Current
|
llvm
|
CONF
|
---
|
llvm-runtimes/libcxx, llvm-runtimes/libcxxabi: Cannot build shared library with clang++ -stdlib=libc++ -static-libstdc++ (build them as PIC?)
|
2024-12-11
|
923110
|
Gentoo L
|
Current
|
llvm
|
CONF
|
---
|
llvm-runtimes/libcxx-17.0.6 - /.../path.h: error: use of built-in trait _remove_pointer(typename std::_1::decay<_Tp>::type) in function signature; use libr
|
2024-12-11
|
923889
|
Gentoo L
|
Current
|
llvm
|
CONF
|
---
|
llvm-core/llvm-15.0.7-r3 fails to compile: ld.lld: error: version script assignment of LLVM_15 to symbol LLVMCreateDisasm failed: symbol not defined
|
2024-12-11
|
924509
|
Gentoo L
|
Current
|
llvm
|
CONF
|
---
|
llvm-core/llvm-17.0.6 fails to compile: ld: final link failed: memory exhausted
|
2024-12-11
|
925313
|
Gentoo L
|
Current
|
llvm
|
CONF
|
---
|
llvm-core/clang-17.0.6 - QA Notice: One or more CMake variables were not used by the project: CMAKE_DISABLE_FIND_PACKAGE_CUDAToolkit - CMAKE_DISABLE_FIND_PACKAGE_hsa-runtime64
|
2024-12-11
|
926279
|
Gentoo L
|
Current
|
llvm
|
CONF
|
---
|
llvm-runtimes/libcxxabi-19.1.1 one or more CMake variables were not used by the project
|
2024-12-11
|
926505
|
Gentoo L
|
Current
|
llvm
|
CONF
|
---
|
[Tracker] Build failures with llvm-core/clang-18
|
2025-01-06
|
928319
|
Gentoo L
|
Current
|
llvm
|
CONF
|
---
|
llvm-core/lld-16.0.6 fails tests
|
2024-12-11
|
928612
|
Gentoo L
|
Current
|
llvm
|
CONF
|
---
|
llvm-runtimes/libcxxabi-18.1.8 fails to compile: <command line>:5:9: error: _LIBCPP_HARDENING_MODE macro redefined [-Werror,-Wmacro-redefined]
|
2024-12-11
|
928658
|
Gentoo L
|
Current
|
llvm
|
CONF
|
---
|
llvm-core/clang doesn't show the same behaviour of libclang
|
2024-12-11
|
929228
|
Gentoo L
|
Current
|
llvm
|
CONF
|
---
|
llvm-core/clang-18.1.3 crashes building ncnn (was: dev-libs/ncnn-20240410 - [clang] fatal error: error in backend: Cannot select: <snip>: v32bf16 = insert_subvector <snip>, <snip>, Constant:i64<16>)
|
2024-12-11
|
930669
|
Gentoo L
|
Current
|
llvm
|
CONF
|
---
|
llvm-core/clang-18.1.4: ICE when building gui-wm/wayfire-0.8.1-r1
|
2024-12-11
|
931996
|
Gentoo L
|
Current
|
llvm
|
CONF
|
---
|
llvm-core/llvm-18.1.5-r1 - clang -cc1as: fatal error: error in backend: ZMM registers are not supported without EVEX512
|
2024-12-11
|
932815
|
Gentoo L
|
Current
|
llvm
|
CONF
|
---
|
llvm-core/clang-18.1.6: OOM with GCC14 i586-pc-linux-gnu/bin/ld: /usr/lib/llvm/18/lib/libLLVM.so.18.1: error adding symbols: memory exhausted
|
2025-01-27
|
933402
|
Gentoo L
|
Current
|
llvm
|
CONF
|
---
|
llvm-runtimes/compiler-rt-17.0.6 - CMake will not be able to correctly generate this project.
|
2024-12-11
|
933608
|
Gentoo L
|
Current
|
llvm
|
CONF
|
---
|
llvm-runtimes/libcxx-18.1.6 - [icu-75.1] ld.lld: error: undefined symbol: _Unwind_Resume
|
2024-12-11
|
937372
|
Gentoo L
|
Current
|
llvm
|
CONF
|
---
|
sys-kernel/gentoo-kernel-6.6.41: difficulties compiling with stable llvm-18.1.8-r1
|
2024-08-05
|
937391
|
Gentoo L
|
Current
|
llvm
|
CONF
|
---
|
llvm-core/clang-17.0.6 - [icu-75.1] [gcc-15] /.../Twine.h: error: const class llvm::SmallVectorImpl<char> has no member named data
|
2024-12-11
|
937425
|
Gentoo L
|
Current
|
llvm
|
CONF
|
---
|
llvm-core/lldb-18.1.8 - [icu-75.1] [gcc-15] /.../AddressableBits.cpp: error: m_low_memory_addr_bits was not declared in this scope
|
2024-12-11
|
938081
|
Gentoo L
|
Current
|
llvm
|
CONF
|
---
|
llvm-runtimes/libunwind-18.1.8 - One or more CMake variables were not used by the project:
|
2024-12-11
|
939839
|
Gentoo L
|
Current
|
llvm
|
CONF
|
---
|
llvm-runtimes/libcxxabi-19.1.0 - [ncurses-6.5] [gcc-15] One or more CMake variables were not used by the project:
|
2024-12-11
|
940654
|
Gentoo L
|
Current
|
llvm
|
CONF
|
---
|
llvm-core/llvm-19.1.1 fails to compile on ppc64le with sys-devel/gcc[ieee-long-double]: error: invalid conversion from ‘_Float128 (*)(_Float128) noexcept’ to ‘long double (*)(long double)’
|
2025-01-03
|
940676
|
Gentoo L
|
Current
|
llvm
|
CONF
|
---
|
llvm-core/llvm: Multiple backports required for ppc64
|
2024-12-11
|
941398
|
Gentoo L
|
Current
|
llvm
|
CONF
|
---
|
llvm-core/libclc-19.1.1 - [libtool] [gcc-15] FAILED: spirv-mesa3d-.spv .../spirv-mesa3d-.spv
|
2024-12-11
|
945336
|
Quality
|
Trackers
|
llvm
|
CONF
|
---
|
[TRACKER] llvm.eclass removal
|
2024-11-29
|
947348
|
Gentoo L
|
Current
|
llvm
|
CONF
|
---
|
llvm-runtimes/compiler-rt-sanitizers-15.0.7-r1 fails to compile: error.h:129:3: error: unknown type name uintptr_t
|
2025-01-03
|
948159
|
Gentoo L
|
Current
|
llvm
|
CONF
|
---
|
llvm-runtimes/libcxx-19.1.7 fails test - [ffmpeg] FAILED: libcxx/.../check-cxx /.../check-cxx
|
2025-01-15
|
948178
|
Gentoo L
|
Current
|
llvm
|
CONF
|
---
|
llvm-runtimes/compiler-rt-18.1.8-r2 fails test - [ffmpeg] FAILED: test/.../check-builtins /.../check-builtins
|
2025-01-16
|
951539
|
Gentoo L
|
Current
|
llvm
|
CONF
|
---
|
llvm-runtimes/compiler-rt-sanitizers-20.1.0: build failure on riscv/musl
|
2025-03-18
|
952084
|
Gentoo L
|
Current
|
llvm
|
CONF
|
---
|
llvm-runtimes/offload-20.1.1 - [llvm] x86_64-pc-linux-gnu-ld: error: undefined symbol: llvm::TableGenMain(char const , std::function<bool (llvm::raw_ostream&, llvm::Recor
|
2025-03-26
|
953040
|
Gentoo L
|
Current
|
llvm
|
CONF
|
---
|
llvm-runtimes/compiler-rt-sanitizers-20.1.1 - sanitizer_platform_limits_posix.cpp: error: invalid application of sizeof to an incomplete type struct termio
|
Wed 15:48
|
939908
|
Gentoo L
|
Current
|
lockalsash
|
CONF
|
---
|
dev-libs/rocr-runtime-6.1.2 uses the wrong LLVM_SLOT
|
2024-09-20
|
509700
|
Gentoo L
|
Current
|
maintainer-needed
|
CONF
|
---
|
app-arch/arj-3.10.22-r8 with llvm-core/clang miscompiles postproc - ./linux-gnu/en/rs/tools/postproc linux-gnu/en/rs/arj/arj: Patch not found
|
2025-01-25
|
741942
|
Gentoo L
|
Current
|
maintainer-needed
|
CONF
|
---
|
sys-boot/elilo-3.16-r5 fails to compile on llvm-objcopy (missing support for EFI target)
|
2022-01-25
|
910268
|
Gentoo L
|
Current
|
maintainer-needed
|
CONF
|
---
|
app-shells/mcfly-0.5.13 - rustc: .../InstructionPrecedenceTracking.cpp:97: void llvm::InstructionPrecedenceTracking::validate(cons
|
2023-12-10
|
918102
|
Gentoo L
|
Current
|
maintainer-needed
|
CONF
|
---
|
app-crypt/p11-kit: broken symbol versioning with llvm-core/lld-17 (app-crypt/pinentry fails to build with llvm-lld-17: ...)
|
2024-12-11
|
932535
|
Gentoo L
|
Current
|
maintainer-needed
|
CONF
|
---
|
media-libs/libsidplay-2.1.1-r7 - [ncurses-6.5] [gcc-15] [llvm] Header checksum mismatch, aborting.
|
2024-05-24
|
932611
|
Gentoo L
|
Current
|
maintainer-needed
|
CONF
|
---
|
www-apache/mod_security-2.9.7 - [ncurses-6.5] [gcc-15] [llvm] ld.lld: error: .../crti.o is incompatible with elf32-i386
|
2024-05-24
|
932612
|
Gentoo L
|
Current
|
maintainer-needed
|
CONF
|
---
|
app-misc/klavaro-3.14 - [ncurses-6.5] [gcc-15] [llvm] clang-18: error: unknown argument: -export-dynamic
|
2024-12-23
|
932618
|
Gentoo L
|
Current
|
maintainer-needed
|
CONF
|
---
|
x11-misc/idesk-0.7.8 - [ncurses-6.5] [gcc-15] [llvm] Database.cpp: error: no member named ptr_fun in namespace std
|
2024-05-24
|
932619
|
Gentoo L
|
Current
|
maintainer-needed
|
CONF
|
---
|
x11-plugins/asapm-3.1-r1 - [ncurses-6.5] [gcc-15] [llvm] ld.lld: error: .../Scrt1.o is incompatible with elf32-i386
|
2024-05-24
|
932661
|
Gentoo L
|
Current
|
maintainer-needed
|
CONF
|
---
|
dev-cpp/lucene++-3.0.7-r3 - [ncurses-6.5] [gcc-15] [llvm] /.../char_traits.h: error: use of undeclared identifier WEOF
|
2024-05-24
|
938437
|
Gentoo L
|
Current
|
maintainer-needed
|
CONF
|
---
|
app-misc/ola-0.10.9-r2 - [llvm] emake failed
|
2024-08-24
|
938558
|
Gentoo L
|
Current
|
maintainer-needed
|
CONF
|
---
|
dev-lang/mercury-22.01.1-r1 - [ncurses-6.5] [llvm] ../.../mmc:line <snip>: .../mercury_compile: No such file or directory
|
2024-08-27
|
938564
|
Gentoo L
|
Current
|
maintainer-needed
|
CONF
|
---
|
app-cdr/gaffitter-1.0.0-r1 - [ncurses-6.5] [llvm] /.../GeneticAlgorithm.cc: error: no member named random_shuffle in namespace std
|
2024-08-27
|
938691
|
Gentoo L
|
Current
|
maintainer-needed
|
CONF
|
---
|
app-forensics/zzuf-0.15_p20220529 - [ncurses-6.5] [llvm] /.../lib-fd.c: error: at most one overload for a given name may lack the overloadable attribute
|
2024-08-29
|
938736
|
Gentoo L
|
Current
|
maintainer-needed
|
CONF
|
---
|
mail-filter/procmail-3.24-r1 - [ncurses-6.5] [llvm] /.../unistd.h: error: pass_object_size attribute only applies to constant pointer arguments
|
2024-09-01
|
938815
|
Gentoo L
|
Current
|
maintainer-needed
|
CONF
|
---
|
net-libs/gloox-1.0.28 - [ncurses-6.5] [llvm] tlsopensslclient.cpp: error: expected expression
|
2024-08-31
|
938818
|
Gentoo L
|
Current
|
maintainer-needed
|
CONF
|
---
|
sys-apps/fakechroot-2.20.1_p2 - [ncurses-6.5] [llvm] open64.c: error: address of overloaded function open64 is ambiguous
|
2025-02-16
|
938877
|
Gentoo L
|
Current
|
maintainer-needed
|
CONF
|
---
|
dev-db/percona-server-8.0.26.16-r2 - [ncurses-6.5] [llvm] ld.lld: error: version script assignment of global to symbol ftruncate failed: symbol not defined
|
2024-09-01
|
938880
|
Gentoo L
|
Current
|
maintainer-needed
|
CONF
|
---
|
dev-libs/mimetic-0.9.8 - [ncurses-6.5] [llvm] ../.../header.h: error: no template named unary_function
|
2024-09-01
|
939001
|
Gentoo L
|
Current
|
maintainer-needed
|
CONF
|
---
|
dev-libs/librdkafka-2.2.0-r1 - [ncurses-6.5] [llvm] cmp: TAGS: No such file or directory
|
2024-09-03
|
939132
|
Gentoo L
|
Current
|
maintainer-needed
|
CONF
|
---
|
app-misc/ytree-2.09 - [ncurses-6.5] [llvm] tilde.c: error: redeclaration of strcpy must have the overloadable
|
2024-09-05
|
941421
|
Gentoo L
|
Current
|
maintainer-needed
|
CONF
|
---
|
sys-fs/cryfs-0.11.4 - [libtool] [llvm] ld.lld: error: undefined symbol: boost::program_options::abstract_variables_map::operator[](std::_1::basic_string<char, std::_1::ch
|
2024-10-12
|
941423
|
Gentoo L
|
Current
|
maintainer-needed
|
CONF
|
---
|
sys-apps/fwts-24.03.00 - [libtool] [llvm] ld.lld: error: undefined reference: gzgets
|
2024-10-12
|
941479
|
Gentoo L
|
Current
|
maintainer-needed
|
CONF
|
---
|
dev-util/schroot-1.6.13_p2-r1 - [libtool] [llvm] ld.lld: error: undefined symbol: boost::program_options::arg
|
2024-10-13
|
946733
|
Gentoo L
|
Current
|
maintainer-needed
|
CONF
|
---
|
app-arch/pbzip2-1.1.13 - [llvm] string: error: implicit instantiation of undefined template std::char_traits<unsigned char>
|
2024-12-21
|
946968
|
Gentoo L
|
Current
|
maintainer-needed
|
CONF
|
---
|
x11-misc/matchbox-keyboard-0.1-r2 - [llvm] configure: error: cannot find expat library
|
2024-12-26
|
946981
|
Gentoo L
|
Current
|
maintainer-needed
|
CONF
|
---
|
x11-misc/fbdesk-1.4.1-r1 - [llvm] TextBox.cc: error: call to abs is ambiguous
|
2024-12-26
|
946986
|
Gentoo L
|
Current
|
maintainer-needed
|
CONF
|
---
|
app-misc/aldo-0.7.7 - [llvm] menu.cc: error: calling a private constructor of class std::_wrap_iter<libmenu::Item >
|
2024-12-26
|
938692
|
Gentoo L
|
Current
|
mario.haustein
|
CONF
|
---
|
app-forensics/yara-x-0.6.0 - [ncurses-6.5] [llvm] = note: ld.lld: error: undefined symbol: _start_linkm2_WASM_EXPORTS
|
2024-08-29
|
938693
|
Gentoo L
|
Current
|
martin.dummer
|
CONF
|
---
|
media-plugins/vdr-streamdev-0.6.3 - [ncurses-6.5] [llvm] /.../new: error: cannot add abi_tag attribute in a
|
2024-08-29
|
938724
|
Gentoo L
|
Current
|
martin.dummer
|
CONF
|
---
|
media-plugins/vdr-fritzbox-1.5.4 - [ncurses-6.5] [llvm] ./CharsetConverter.h: error: reference to incomplete type
|
2024-08-30
|
938873
|
Gentoo L
|
Current
|
martin.dummer
|
CONF
|
---
|
media-plugins/vdr-ffnetdev-0.1.3 - [ncurses-6.5] [llvm] /.../new: error: cannot add abi_tag attribute in a
|
2024-09-01
|
941451
|
Gentoo L
|
Current
|
martin.dummer
|
CONF
|
---
|
media-plugins/vdr-extrecmenu-2.0.12 - [libtool] [llvm] mytools.c: error: use of undeclared identifier LC_CTYPE
|
2024-10-13
|
938722
|
Gentoo L
|
Current
|
media-video
|
CONF
|
---
|
media-libs/libquvi-0.9.4-r101 - [ncurses-6.5] [llvm] ld.lld: error: undefined reference due to --no-allow-shlib-undefined: gpg_strerror
|
2024-08-30
|
932029
|
Gentoo L
|
Current
|
mgorny
|
CONF
|
---
|
gui-apps/railway-2.7.0 fails to compile: ring.fb965697a0ca88b1-cgu.12:(.text.unlikely._ZN4spin4once17Once$LT$T$C$R$GT$18try_call_once_slow17hf2ce5b30c841fbd2E.llvm.15551044811817222785+0x19): undefined reference to ring_core_0_17_8_OPENSSL_cpuid_setup
|
2024-10-29
|
934241
|
Gentoo L
|
Eclasses
|
mgorny
|
CONF
|
---
|
llvm-utils.eclass fails tests when clang:19 is not installed
|
2024-06-14
|
938467
|
Gentoo L
|
Current
|
mjo
|
CONF
|
---
|
net-analyzer/nagios-plugins-2.4.6 - [llvm] configure: error: <wchar.h> cannot be used with this compiler (clang -O2 -pipe -march=native -fno-diagnostics-colo
|
2024-09-09
|
932493
|
Gentoo L
|
Current
|
ml
|
CONF
|
---
|
dev-lang/polyml-5.9.1 - [ncurses-6.5] [gcc-15] [llvm] emake failed
|
2024-05-22
|
946978
|
Gentoo L
|
Current
|
ml
|
CONF
|
---
|
dev-lang/smlnj-110.99.6.1 - [llvm] prototype is deprecated in all versions of C and is not supported in C23
|
2024-12-26
|
941395
|
Gentoo L
|
Current
|
mozilla
|
CONF
|
---
|
dev-libs/nss-3.101.2 - [libtool] [llvm] gcc: error: unrecognized command-line option -Qunused-arguments
|
2024-10-12
|
829498
|
Gentoo L
|
Current
|
musl
|
CONF
|
---
|
llvm-core/llvm-roc-4.3.0-r1 - /.../FuzzerInterceptors.cpp: error: size_t was not declared in this scope
|
2024-12-11
|
836279
|
Gentoo L
|
Current
|
musl
|
CONF
|
---
|
llvm-core/llvm-roc-5.0.2 - /.../backtrace_linux_libc.cpp: fatal error: execinfo.h: No such file or directory
|
2024-12-11
|
838979
|
Gentoo L
|
Current
|
musl
|
CONF
|
---
|
llvm-core/llvm-14.0.1 - /.../Signals.inc: error: backtrace was not declared in this scope
|
2024-12-11
|
853757
|
Gentoo L
|
Current
|
musl
|
CONF
|
---
|
llvm-core/llvm-roc-5.0.2 - /.../hwasan_exceptions.cpp: error: _Unwind_Word does not name a type
|
2024-12-11
|
906902
|
Gentoo L
|
Current
|
musl
|
CONF
|
---
|
llvm-runtimes/compiler-rt-sanitizers-15.0.7 - /.../sanitizer_platform_limits_posix.cpp: error: use of undeclared identifier dirent64
|
2024-12-11
|
932578
|
Gentoo L
|
Current
|
mysql-bugs
|
CONF
|
---
|
dev-db/myodbc-8.0.32 - [ncurses-6.5] [gcc-15] [llvm] ld.lld: error: .../Scrt1.o is incompatible with elf64-x86-64
|
2024-05-23
|
939036
|
Gentoo L
|
Current
|
mysql-bugs
|
CONF
|
---
|
dev-db/mariadb-10.11.8 - [ncurses-6.5] [llvm] /.../brmtypes.h: fatal error: tr1/unordered_map file not found
|
2024-09-04
|
941469
|
Gentoo L
|
Current
|
mysql-bugs
|
CONF
|
---
|
dev-db/myodbc-8.0.32 - [libtool] [llvm] /.../string: error: implicit instantiation of undefined template std::char_traits<unsigned short>
|
2024-10-13
|
934813
|
Gentoo L
|
Current
|
negril.nx+gentoo
|
CONF
|
---
|
media-gfx/openvdb[ax]: requires LLVM 15
|
2024-06-25
|
941446
|
Gentoo L
|
Current
|
negril.nx+gentoo
|
CONF
|
---
|
dev-libs/imath-3.1.11-r1 - [libtool] [llvm] ld.lld: error: undefined reference: boost::python::objects::register_dynamic_id_aux(boost::python::type_info, std::_1::pair<vo
|
2024-10-13
|
945347
|
Gentoo L
|
Current
|
negril.nx+gentoo
|
CONF
|
---
|
media-gfx/openvdb: update to llvm-r2
|
2024-12-31
|
932616
|
Gentoo L
|
Current
|
netmon
|
CONF
|
---
|
net-analyzer/ntopng-5.6-r2 - [ncurses-6.5] [gcc-15] [llvm] src/LuaEngineNtop.cpp: error: no matching function for call to
|
2024-06-25
|
946971
|
Gentoo L
|
Current
|
netmon
|
CONF
|
---
|
net-analyzer/tcpreplay-4.5.1 - [llvm] configure: error: Unable to link libpcap in /usr
|
2024-12-26
|
946974
|
Gentoo L
|
Current
|
netmon
|
CONF
|
---
|
net-analyzer/nsat-1.5-r7 - [llvm] /lang.h: error: invalid suffix on literal; C++11 requires a space between literal and identifier [-Wreserved-user-defined-literal]
|
2024-12-26
|
733016
|
Gentoo L
|
Current
|
nowa
|
CONF
|
---
|
app-crypt/sbsigntools fails test: ...llvm-objcopy: error: invalid output format: 'efi-app-x86_64'
|
2024-08-25
|
938436
|
Gentoo L
|
Current
|
perfinion
|
CONF
|
---
|
dev-python/pybind11-2.13.5 - [llvm] One or more CMake variables were not used by the project:
|
2024-08-24
|
939026
|
Gentoo L
|
Current
|
perfinion
|
CONF
|
---
|
net-libs/libtorrent-0.13.8-r3 - [ncurses-6.5] [llvm] ../.../functional.h: error: no template named binary_function in
|
2024-09-04
|
932613
|
Gentoo L
|
Current
|
perl
|
CONF
|
---
|
dev-perl/Crypt-OpenSSL-ECDSA-0.100.0 - [ncurses-6.5] [gcc-15] [llvm] ld.lld: error: .../crti.o is incompatible with elf32-i386
|
2024-05-24
|
938816
|
Gentoo L
|
Current
|
pfrank
|
CONF
|
---
|
media-plugins/vdr-vompserver-0.5.1 - [ncurses-6.5] [llvm] mvpserver.c: error: invalid operands to binary expression (_bind<int &,
|
2024-08-31
|
844946
|
Gentoo L
|
Current
|
pgsql-bugs
|
CONF
|
---
|
dev-db/postgresql-14.3[llvm]: tests using llvm jit failed on riscv: "with fatal llvm error: Relocation type not implemented yet!"
|
2022-08-13
|
502318
|
Gentoo/A
|
Prefix S
|
prefix
|
CONF
|
---
|
llvm-core/llvm: pass --with-c-include-dirs on prefix
|
2024-12-11
|
763018
|
Gentoo/A
|
Prefix S
|
prefix
|
CONF
|
---
|
llvm-core/llvm-11.0.0: Host compiler appears to require libatomic, but cannot find it (macOS Big Sur, Clang bootstrap)
|
2024-12-11
|
870055
|
Gentoo/A
|
Prefix S
|
prefix
|
CONF
|
---
|
llvm-core/clang: please upstream prefix-specific patches
|
2024-12-11
|
933353
|
Gentoo L
|
Current
|
prefix
|
CONF
|
---
|
app-arch/xar-1.8.0.0.498 - [llvm] ld.lld: error: undefined reference due to --no-allow-shlib-undefined: acl_get_file
|
2024-06-01
|
933354
|
Gentoo L
|
Current
|
prefix
|
CONF
|
---
|
app-arch/xar-1.8.0.0.487.100.1 - [llvm] ld.lld: error: undefined reference due to --no-allow-shlib-undefined: acl_get_file
|
2024-06-01
|
938687
|
Gentoo L
|
Current
|
printing
|
CONF
|
---
|
dev-libs/pslib-0.4.6 - [ncurses-6.5] [llvm] checking if clang supports -c -o file.o... .../rm: cannot remove conftest : No such file or directory
|
2024-08-29
|
938565
|
Gentoo L
|
Current
|
prolog
|
CONF
|
---
|
dev-lang/cxprolog-0.98.2-r2 - [ncurses-6.5] [llvm] src/Extra.h: error: ISO C++17 does not allow register storage class
|
2024-08-27
|
941470
|
Gentoo L
|
Current
|
prolog
|
CONF
|
---
|
dev-lang/swi-prolog-9.3.9 - [libtool] [llvm] ERROR: .../pl-wam.c:3344: int PL_next_solution_LD(PL_local_data_t , qid_t): Assertion failed: LD->exception.throw_environment
|
2024-10-22
|
941408
|
Gentoo L
|
Current
|
python
|
CONF
|
---
|
dev-python/rapidfuzz-3.10.0 - [libtool] [llvm] /.../string: error: implicit instantiation of undefined template std::char_traits<unsigned int>
|
2024-10-24
|
946989
|
Gentoo L
|
Current
|
python
|
CONF
|
---
|
dev-python/levenshtein-0.26.1 - [llvm] string: error: implicit instantiation of undefined template std::char_traits<unsigned int>
|
2025-03-02
|
944478
|
Gentoo L
|
Profiles
|
qa
|
CONF
|
---
|
LLVM profiles: rename libcxx-using profiles to include libcxx in the name
|
2025-02-11
|
944482
|
Gentoo L
|
Profiles
|
qa
|
CONF
|
---
|
LLVM profiles: add separate libstdc++ profiles
|
2025-03-08
|
875641
|
Gentoo L
|
Current
|
qt
|
CONF
|
---
|
dev-qt/qtwebengine: update has_version test for llvm-core/clang[default-libcxx]
|
2024-12-11
|
946846
|
Gentoo L
|
Current
|
rich0
|
CONF
|
---
|
app-backup/duplicity-3.0.3.2 - [llvm] ld.lld: error: crti.o is incompatible with elf32-i386
|
2024-12-22
|
460474
|
Gentoo L
|
New pack
|
robbat2
|
CONF
|
---
|
LVM does not search zfs zvols for VGs
|
2013-03-06
|
923574
|
Gentoo L
|
Current
|
ruby
|
CONF
|
---
|
dev-ruby/grpc-1.59.2 fails to compile: llvm-strip: error: libboringssl.a: not stripping symbol .L.str because it is named in a relocation
|
2024-09-04
|
932650
|
Gentoo L
|
Current
|
ruby
|
CONF
|
---
|
dev-ruby/grpc-1.59.2 - [ncurses-6.5] [gcc-15] [llvm] Could not create Makefile due to some reason, probably lack of necessary
|
2024-06-09
|
735154
|
Gentoo L
|
Current
|
rust
|
CONF
|
---
|
dev-lang/rust USE=system-llvm should be enabled by default
|
2025-03-07
|
932543
|
Gentoo L
|
Current
|
sam
|
CONF
|
---
|
app-forensics/aflplusplus-4.08c-r1 - [ncurses-6.5] [gcc-15] [llvm] ./split-switches-pass.so: ./split-switches-pass.so: undefined symbol:
|
2024-05-23
|
932279
|
Gentoo L
|
Current
|
scheme
|
CONF
|
---
|
dev-scheme/guile-libyaml-20211124 - [llvm] ERROR: dev-scheme/guile-libyaml-20211124::gentoo failed (compile phase):
|
2024-05-20
|
755086
|
Gentoo L
|
Current
|
sci
|
CONF
|
---
|
[science overlay] sci-biology/bamql-1.6.1 : configure: error: We could not detect the llvm libraries make sure that llvm-config is on your path or s
|
2021-06-08
|
932462
|
Gentoo L
|
Current
|
sci
|
CONF
|
---
|
dev-libs/libdynd-0.7.2-r1 - [ncurses-6.5] [gcc-15] [llvm] /.../sort.h: error: read-only variable is not assignable
|
2024-05-22
|
938758
|
Gentoo L
|
Current
|
sci
|
CONF
|
---
|
x11-libs/xbae-4.60.4 - [ncurses-6.5] [llvm] mkdir: cannot create directory .libs: File exists
|
2024-08-30
|
939000
|
Gentoo L
|
Current
|
sci
|
CONF
|
---
|
x11-libs/xbae-4.60.4-r1 - [ncurses-6.5] [llvm] leak2.c: error: incompatible integer to pointer conversion initializing
|
2024-11-03
|
945273
|
Gentoo L
|
Current
|
sci
|
CONF
|
---
|
dev-util/hip uses LLVM 19, even with LLVM_SLOT=18
|
2024-12-16
|
945341
|
Gentoo L
|
Current
|
sci
|
CONF
|
---
|
dev-cpp/eigen: update to llvm-r2
|
2024-12-31
|
939082
|
Gentoo L
|
Current
|
sci-astronomy
|
CONF
|
---
|
sci-astronomy/wcstools-3.9.5-r1 - [ncurses-6.5] [llvm] webread.c: error: redeclaration of gethostname must have the
|
2025-03-02
|
938456
|
Gentoo L
|
Current
|
sci-biology
|
CONF
|
---
|
sci-biology/ucsc-genome-browser-260-r2 - [llvm] orthoEvaluate.c: error: non-void function agxSupportForEdge should
|
2024-08-24
|
941490
|
Gentoo L
|
Current
|
sci-biology
|
CONF
|
---
|
sci-biology/vcftools-0.1.16 - [libtool] [llvm] variant_file_filters.cpp: error: use of undeclared identifier random_shuffle
|
2024-10-13
|
946977
|
Gentoo L
|
Current
|
sci-mathematics
|
CONF
|
---
|
sci-mathematics/lean-4.11.0 - [llvm] deps=lean --deps LeanClosedTermCache.lean || (echo lean --deps LeanClosedTermCache.lean failed ($?): $deps; exit 1); \
|
2024-12-28
|
938875
|
Gentoo L
|
Current
|
sound
|
CONF
|
---
|
media-libs/alure-1.2-r4 - [ncurses-6.5] [llvm] /.../main.h: error: use of undeclared identifier ret
|
2024-09-01
|
946983
|
Gentoo L
|
Current
|
sysadmin
|
CONF
|
---
|
sys-libs/freeipmi-1.6.14 - [llvm] clang-cpp: error: no such file or directory: libipmimonitoring.3
|
2024-12-26
|
887047
|
Gentoo L
|
Current
|
systemd
|
CONF
|
---
|
sys-apps/systemd[gnuefi] sys-apps/systemd-utils[boot] fails to compile with llvm-objcopy (CLANG-STRICTER-SYSTEM): error: unknown argument --section-alignment=512
|
2023-04-25
|
831723
|
Gentoo L
|
Current
|
tamiko
|
CONF
|
---
|
sci-libs/dealii-9.3.1-r4 fails to compile: llvm issue?
|
2022-02-14
|
874564
|
Gentoo L
|
Current
|
tamiko
|
CONF
|
---
|
games-board/stockfish-16-r1: benchmark.cpp:(.text+0xc5): undefined reference to `__llvm_profile_instrument_memop'
|
2024-05-09
|
946987
|
Gentoo L
|
Current
|
tcltk
|
CONF
|
---
|
dev-tcltk/mysqltcl-3.052-r2 - [llvm] mysqltcl.c: warning: a function definition without a prototype is deprecated in all versions of C and is not supported in C23 [-Wdepr
|
2024-12-26
|
883415
|
Gentoo L
|
Current
|
toolchain
|
CONF
|
---
|
sys-devel/gcc-11.3.1_p20221007 fails to compile (CLANG-STRICTER-SYSTEM): clang++: libstdc++.so.6: version GLIBCXX_3.4.30 not found (required by libLLVM-15.so)
|
2022-11-28
|
899582
|
Gentoo L
|
Profiles
|
toolchain
|
CONF
|
---
|
llvm-core/clang provides incomplete static libraries in llvm profiles (missing TF helpers, e.g. ld.lld: error: undefined symbol: __multf3)
|
2024-12-11
|
917361
|
Gentoo L
|
Current
|
toolchain
|
CONF
|
---
|
sys-devel/gcc, llvm-core/clang: maybe install ${COMPILER}-cachekey or such for ccache usage
|
2025-02-13
|
935418
|
Gentoo L
|
Current
|
toolchain
|
CONF
|
---
|
sys-devel/gcc-15.0.0_pre20240630 - [perl-5.40] [ncurses-6.5] [icu-75.1] [gcc-15] [llvm] /.../exception_ptr.h: error: no member named fancy_abort in namespace std
|
2024-08-14
|
935419
|
Gentoo L
|
Current
|
toolchain
|
CONF
|
---
|
sys-devel/gcc-15.0.0_pre20240630 - [perl-5.40] [ncurses-6.5] [icu-75.1] [gcc-15] [llvm] /.../locale: error: attempt to use a poisoned identifier
|
2024-08-14
|
936033
|
Gentoo L
|
Current
|
toolchain
|
CONF
|
---
|
sys-devel/gcc-15.0.0_pre20240707 - [perl-5.40] [ncurses-6.5] [icu-75.1] [gcc-15] [llvm] cc1: error: -fcf-protection is not compatible with this target
|
2024-07-14
|
938567
|
Gentoo L
|
Current
|
toolchain
|
CONF
|
---
|
dev-libs/libffi-compat-3.3-r2 - [ncurses-6.5] [llvm] ld.lld: error: version script assignment of LIBFFI_BASE_7.0 to symbol ffi_java_raw_call failed: symbol not defined
|
2024-08-27
|
941418
|
Gentoo L
|
Current
|
toolchain
|
CONF
|
---
|
sys-libs/libstdc++-v3-3.3.6-r4 - [libtool] [llvm] /.../getpwd.c: error: redeclaration of getwd must have the overloadable attribute
|
2024-10-12
|
945628
|
Gentoo L
|
Current
|
toolchain
|
CONF
|
---
|
>=sys-devel/dwz-0.15-r3 llvm-readelf: error: unknown argument '-w'
|
2025-02-21
|
948873
|
Gentoo L
|
Current
|
vadorovsky
|
CONF
|
---
|
llvm-runtimes/libgcc: try to make it test actual libgcc* files
|
2025-02-06
|
571228
|
Gentoo L
|
[OLD] Li
|
voyageur
|
CONF
|
---
|
llvm-runtimes/openmp on ABI=x32 - runtime/src/z_Linux_util.c:154:6: error: #error Wrong code for setaffinity system call
|
2024-12-11
|
595040
|
Gentoo L
|
Current
|
voyageur
|
CONF
|
---
|
llvm-runtimes/openmp: missing options/flags
|
2024-12-11
|
624248
|
Gentoo L
|
Current
|
voyageur
|
CONF
|
---
|
llvm-runtimes/openmp-4.0.1 : fails with FEATURES=test
|
2024-12-11
|
638162
|
Gentoo L
|
Current
|
voyageur
|
CONF
|
---
|
llvm-runtimes/openmp-4.0.1: test failure: worksharing/for/kmp_doacross_check.c
|
2024-12-11
|
793437
|
Gentoo L
|
Current
|
voyageur
|
CONF
|
---
|
llvm-runtimes/openmp-12.0.0 fails tests: - FAILED: runtime/test/CMakeFiles/check-libomp
|
2024-12-11
|
828697
|
Gentoo L
|
Current
|
voyageur
|
CONF
|
---
|
llvm-runtimes/openmp-16.0.5 - One or more CMake variables were not used by the project: CMAKE_DISABLE_FIND_PACKAGE_CUDA - LIBOMPTARGET_BUILD_AMDGCN_BCLIB - LIBOMPTARGET_BUILD_NVPTX_BCLIB
|
2024-12-11
|
839936
|
Gentoo L
|
Current
|
voyageur
|
CONF
|
---
|
llvm-runtimes/openmp-14.0.1 fails test - FAILED: .../check-libomp
|
2024-12-11
|
857825
|
Gentoo L
|
Current
|
voyageur
|
CONF
|
---
|
llvm-runtimes/openmp fails compile phase with llvm-libunwind[-static-libs]
|
2024-12-11
|
904140
|
Gentoo L
|
Current
|
voyageur
|
CONF
|
---
|
llvm-runtimes/openmp should be slotted per LLVM versions
|
2024-12-11
|
925314
|
Gentoo L
|
Current
|
voyageur
|
CONF
|
---
|
llvm-runtimes/openmp-17.0.6 - QA Notice: One or more CMake variables were not used by the project: LIBOMPTARGET_AMDGPU_ARCH
|
2024-12-11
|
932504
|
Gentoo L
|
Current
|
voyageur
|
CONF
|
---
|
app-text/tesseract-5.3.4 - [ncurses-6.5] [gcc-15] [llvm] ld.lld: error: non-exported symbol _divdi3 in .../libclang_rt.builtins-i386.a(divdi3.S.o) is referenced by DSO ./.libs/libt
|
2024-11-16
|
946969
|
Gentoo L
|
Current
|
voyageur
|
CONF
|
---
|
x11-plugins/wmweather+-2.18-r1 - [llvm] configure: error: libpcre is required
|
2024-12-26
|
949830
|
Gentoo L
|
Current
|
voyageur
|
CONF
|
---
|
llvm-runtimes/openmp-19.1.7 fails test - [gcc-15] FAILED: runtime/.../check-libomp /.../check-libomp
|
2025-02-16
|
938455
|
Gentoo L
|
Current
|
williamh
|
CONF
|
---
|
net-libs/nodejs-22.7.0 - [llvm] ../.../tlscontext.cc: fatal error: ngtcp2/ngtcp2_crypto_quictls.h file not found
|
2024-09-03
|
927359
|
Gentoo L
|
Current
|
x11
|
CONF
|
---
|
media-libs/mesa-23.3.6 fails tests on arm: mesa:llvmpipe / lp_test_arit: fract.v2(1.40129846e-45): ref = 1.40129846e-45, out = 0, precision = -0.000000 bits, FAIL
|
2024-03-25
|
949726
|
Gentoo L
|
Current
|
x11
|
CONF
|
---
|
media-libs/mesa-24.3.4-r1: only llvmpipe available, segfaults in `libgallium-24.3.4.so`
|
2025-02-17
|
855884
|
Gentoo L
|
Current
|
zmedico
|
CONF
|
---
|
app-shells/nushell-0.64.0 - rustc: .../APInt.h:1470: uint64_t llvm::APInt::getZExtValue() const: Assertion getActiveBits() <= 64 &
|
2022-07-02
|
857561
|
Gentoo L
|
Current
|
zmedico
|
CONF
|
---
|
app-shells/nushell-0.70.0[extra] fails to compile: error: could not compile arrow2 (uint64_t llvm::APInt::getZExtValue() const: Assertion `getActiveBits() <= 64 && "Too many bits for uint64_t"' failed.)
|
2023-04-15
|
941405
|
Gentoo L
|
Current
|
zmedico
|
CONF
|
---
|
dev-util/android-tools-35.0.1 - [libtool] [llvm] ld.lld: error: undefined symbol: google::protobuf::TextFormat::PrintToString(google::protobuf::Message const&, std::_1::b
|
2025-02-05
|
945350
|
Gentoo L
|
Current
|
zx2c4
|
CONF
|
---
|
sys-devel/sparse: update to llvm-r2 or remove llvm.eclass
|
2024-12-31
|
563316
|
Gentoo L
|
[OLD] Co
|
base-system
|
IN_P
|
---
|
sys-fs/lvm2 cannot create or use cache volumes without USE=+thin
|
2023-07-20
|
878131
|
Gentoo L
|
Current
|
base-system
|
IN_P
|
---
|
sys-fs/lvm2-2.03.14-r3[device-mapper-only]: dmsetup is compiled in the install phase
|
2022-11-02
|
749957
|
Gentoo H
|
genkerne
|
genkernel
|
IN_P
|
---
|
sys-kernel/genkernel: unable to build LVM2 on ia64
|
2022-07-26
|
458706
|
Gentoo L
|
Hardened
|
hardened
|
IN_P
|
---
|
PaX: Max. per-task virtual memory too small for llvm asan and gcc-4.8 asan
|
2019-08-22
|
829602
|
Gentoo L
|
Current
|
llvm
|
IN_P
|
---
|
llvm-core/clang-13.0.0 - .../tools/extra/clangd/CompletionModel.cpp {standard input}: Assembler messages: {standard input}:177127: Error: operand out of range
|
2024-12-11
|
946219
|
Gentoo L
|
Stabiliz
|
llvm
|
IN_P
|
---
|
llvm-runtimes/compiler-rt-16.0.6-r6: stablereq
|
2024-12-24
|
946879
|
Gentoo L
|
Stabiliz
|
llvm
|
IN_P
|
---
|
llvm-core/llvm-common-19.1.7 and friends: stablereq
|
2025-03-23
|
821181
|
Gentoo S
|
Vulnerab
|
security
|
IN_P
|
---
|
llvm-core/clang: Unicode "bidirectional override" vulnerabilities (CVE-2021-42574)
|
2024-12-11
|
950652
|
Gentoo L
|
Current
|
toolchain
|
IN_P
|
---
|
sys-devel/gcc-15.0.1_pre20250302: fails to compile llvm-core/llvm-20.1.0
|
Sun 14:29
|
801313
|
Gentoo L
|
Current
|
llvm
|
RESO
|
INVA
|
Disabling CONFIG_COMPAT_32BIT_TIME breaks 32-bit apps (was: sys-devel/llvm build failure)
|
2021-07-10
|
76354
|
Gentoo L
|
[OLD] Co
|
max
|
RESO
|
FIXE
|
a "current" version of lvm2, 2.00.08 in the portage tree is not considered stable
|
2005-05-23
|
125894
|
Gentoo R
|
Everythi
|
releng
|
RESO
|
CANT
|
LiveCD partitioner does not recognize LVM on existing disk
|
2006-03-11
|
146180
|
Gentoo L
|
[OLD] ba
|
rocket
|
RESO
|
FIXE
|
after upgrade to baselayout-1.12.4-r7 lvm2-2.02.06 udev-087, lvm2 can't export logical volumes
|
2006-09-04
|
68406
|
Gentoo S
|
Vulnerab
|
security
|
RESO
|
FIXE
|
sys-fs/lvm-user: Insecure tmpfile use
|
2004-11-11
|
34171
|
[OLD] Do
|
LVM HOWT
|
aaby
|
RESO
|
FIXE
|
Danish translation of LVM howto
|
2003-11-24
|
268355
|
Gentoo L
|
[OLD] Co
|
agk
|
RESO
|
DUPL
|
sys-fs/lvm2-2.02.45: failed to build on first try
|
2009-05-09
|
268662
|
Gentoo L
|
New pack
|
agk
|
RESO
|
FIXE
|
sys-fs/lvm2-2.02.45: ebuild fails: ln: creating symbolic link `libdevmapper.so.1.02': File exists
|
2009-05-21
|
12219
|
Gentoo L
|
New pack
|
aliz
|
RESO
|
FIXE
|
error in lvm-user-1.0.5 emerge (emerge fails due to access violation)
|
2003-02-04
|
34779
|
Gentoo L
|
New pack
|
amd64
|
RESO
|
FIXE
|
add amd64 to sys-libs/device-mapper and sys-fs/lvm2
|
2003-12-13
|
92427
|
Gentoo L
|
[OLD] Co
|
amd64
|
RESO
|
FIXE
|
lvm2-2.01.09 stablization tracker
|
2005-05-29
|